systemml-dev mailing list archives

Site index · List index
Message view « Date » · « Thread »
Top « Date » · « Thread »
From jenk...@spark.tc
Subject Build failed in Jenkins: SystemML-DailyTest #869
Date Wed, 15 Mar 2017 22:01:37 GMT
See <https://sparktc.ibmcloud.com/jenkins/job/SystemML-DailyTest/869/changes>

Changes:

[Matthias Boehm] [SYSTEMML-1402] Scalable statistics counters and atomic id sequence

[Matthias Boehm] [SYSTEMML-1374] New candidate-based code generation algorithm

------------------------------------------
[...truncated 15702 lines...]
  MapMultChainTest.testMapMultChainWeightsNoRewriteDenseCP:96->runMapMultChainTest:369->AutomatedTestBase.checkNumCompiledMRJobs:1414
Unexpected number of compiled MR jobs. expected:<1> but was:<0>
  MapMultChainTest.testMapMultChainWeightsNoRewriteDenseMR:168->runMapMultChainTest:369->AutomatedTestBase.checkNumCompiledMRJobs:1414
Unexpected number of compiled MR jobs. expected:<3> but was:<0>
  MapMultChainTest.testMapMultChainWeights2NoRewriteDenseCP:102->runMapMultChainTest:369->AutomatedTestBase.checkNumCompiledMRJobs:1414
Unexpected number of compiled MR jobs. expected:<1> but was:<0>
  MapMultChainTest.testMapMultChainWeights2NoRewriteDenseMR:174->runMapMultChainTest:369->AutomatedTestBase.checkNumCompiledMRJobs:1414
Unexpected number of compiled MR jobs. expected:<3> but was:<0>
  MapMultChainTest.testMapMultChainWeights2NoRewriteSparseCP:120->runMapMultChainTest:369->AutomatedTestBase.checkNumCompiledMRJobs:1414
Unexpected number of compiled MR jobs. expected:<1> but was:<0>
  MapMultChainTest.testMapMultChainWeights2NoRewriteSparseMR:192->runMapMultChainTest:369->AutomatedTestBase.checkNumCompiledMRJobs:1414
Unexpected number of compiled MR jobs. expected:<3> but was:<0>
  MapMultChainTest.testMapMultChainNoRewriteDenseCP:90->runMapMultChainTest:369->AutomatedTestBase.checkNumCompiledMRJobs:1414
Unexpected number of compiled MR jobs. expected:<1> but was:<0>
  MapMultChainTest.testMapMultChainNoRewriteDenseMR:162->runMapMultChainTest:369->AutomatedTestBase.checkNumCompiledMRJobs:1414
Unexpected number of compiled MR jobs. expected:<3> but was:<0>
  MapMultChainTest.testMapMultChainRewriteSparseCP:144->runMapMultChainTest:369->AutomatedTestBase.checkNumCompiledMRJobs:1414
Unexpected number of compiled MR jobs. expected:<1> but was:<0>
  MapMultChainTest.testMapMultChainRewriteSparseMR:216->runMapMultChainTest:369->AutomatedTestBase.checkNumCompiledMRJobs:1414
Unexpected number of compiled MR jobs. expected:<2> but was:<0>
  MapMultChainTest.testMapMultChainWeightsNoRewriteSparseCP:114->runMapMultChainTest:369->AutomatedTestBase.checkNumCompiledMRJobs:1414
Unexpected number of compiled MR jobs. expected:<1> but was:<0>
  MapMultChainTest.testMapMultChainWeightsNoRewriteSparseMR:186->runMapMultChainTest:369->AutomatedTestBase.checkNumCompiledMRJobs:1414
Unexpected number of compiled MR jobs. expected:<3> but was:<0>
  MapMultChainTest.testMapMultChainNoRewriteSparseCP:108->runMapMultChainTest:369->AutomatedTestBase.checkNumCompiledMRJobs:1414
Unexpected number of compiled MR jobs. expected:<1> but was:<0>
  MapMultChainTest.testMapMultChainNoRewriteSparseMR:180->runMapMultChainTest:369->AutomatedTestBase.checkNumCompiledMRJobs:1414
Unexpected number of compiled MR jobs. expected:<3> but was:<0>
  UaggOuterChainTest.testGreaterEqualsUaggOuterChainRowSumsMultiDenseMR:188->runBinUaggTest:1356->AutomatedTestBase.checkNumCompiledMRJobs:1414
Unexpected number of compiled MR jobs. expected:<2> but was:<0>
  UaggOuterChainTest.testUaggOuterChainSumsMultiSparseMR:774->runBinUaggTest:1356->AutomatedTestBase.checkNumCompiledMRJobs:1414
Unexpected number of compiled MR jobs. expected:<3> but was:<0>
  UaggOuterChainTest.testGreaterEqualsUaggOuterChainSumsSingleSparseMR:788->runBinUaggTest:1356->AutomatedTestBase.checkNumCompiledMRJobs:1414
Unexpected number of compiled MR jobs. expected:<3> but was:<0>
  UaggOuterChainTest.testGreaterEqualsUaggOuterChainRowIndexMaxMultiSparseMR:1152->runBinUaggTest:1356->AutomatedTestBase.checkNumCompiledMRJobs:1414
Unexpected number of compiled MR jobs. expected:<2> but was:<0>
  UaggOuterChainTest.testGreaterUaggOuterChainColSumsMultiDenseMR:476->runBinUaggTest:1356->AutomatedTestBase.checkNumCompiledMRJobs:1414
Unexpected number of compiled MR jobs. expected:<2> but was:<0>
  UaggOuterChainTest.testNotEqualsUaggOuterChainColSumsSingleDenseMR:542->runBinUaggTest:1356->AutomatedTestBase.checkNumCompiledMRJobs:1414
Unexpected number of compiled MR jobs. expected:<2> but was:<0>
  UaggOuterChainTest.testNotEqualsUaggOuterChainRowSumsSingleDenseMR:226->runBinUaggTest:1356->AutomatedTestBase.checkNumCompiledMRJobs:1414
Unexpected number of compiled MR jobs. expected:<2> but was:<0>
  UaggOuterChainTest.testGreaterEqualsUaggOuterChainRowSumsSingleSparseMR:182->runBinUaggTest:1356->AutomatedTestBase.checkNumCompiledMRJobs:1414
Unexpected number of compiled MR jobs. expected:<2> but was:<0>
  UaggOuterChainTest.testLessEqualsUaggOuterChainColSumsSingleSparseMR:496->runBinUaggTest:1356->AutomatedTestBase.checkNumCompiledMRJobs:1414
Unexpected number of compiled MR jobs. expected:<2> but was:<0>
  UaggOuterChainTest.testNotEqualsUaggOuterChainColSumsMultiSparseMR:560->runBinUaggTest:1356->AutomatedTestBase.checkNumCompiledMRJobs:1414
Unexpected number of compiled MR jobs. expected:<2> but was:<0>
  UaggOuterChainTest.testNotEqualsUaggOuterChainSumsSingleSparseMR:892->runBinUaggTest:1356->AutomatedTestBase.checkNumCompiledMRJobs:1414
Unexpected number of compiled MR jobs. expected:<3> but was:<0>
  UaggOuterChainTest.testNotEqualsUaggOuterChainRowSumsMultiSparseMR:244->runBinUaggTest:1356->AutomatedTestBase.checkNumCompiledMRJobs:1414
Unexpected number of compiled MR jobs. expected:<2> but was:<0>
  UaggOuterChainTest.testEqualsUaggOuterChainSumsSingleSparseMR:866->runBinUaggTest:1356->AutomatedTestBase.checkNumCompiledMRJobs:1414
Unexpected number of compiled MR jobs. expected:<3> but was:<0>
  UaggOuterChainTest.testNotEqualsUaggOuterChainRowSumsSingleSparseMR:232->runBinUaggTest:1356->AutomatedTestBase.checkNumCompiledMRJobs:1414
Unexpected number of compiled MR jobs. expected:<2> but was:<0>
  UaggOuterChainTest.testEqualsUaggOuterChainRowSumsMultiDenseMR:213->runBinUaggTest:1356->AutomatedTestBase.checkNumCompiledMRJobs:1414
Unexpected number of compiled MR jobs. expected:<2> but was:<0>
  UaggOuterChainTest.testGreaterUaggOuterChainSumsMultiDenseMR:820->runBinUaggTest:1356->AutomatedTestBase.checkNumCompiledMRJobs:1414
Unexpected number of compiled MR jobs. expected:<3> but was:<0>
  UaggOuterChainTest.testLessEqualsUaggOuterChainRowSumsMultiDenseMR:163->runBinUaggTest:1356->AutomatedTestBase.checkNumCompiledMRJobs:1414
Unexpected number of compiled MR jobs. expected:<2> but was:<0>
  UaggOuterChainTest.testGreaterUaggOuterChainColSumsSingleSparseMR:470->runBinUaggTest:1356->AutomatedTestBase.checkNumCompiledMRJobs:1414
Unexpected number of compiled MR jobs. expected:<2> but was:<0>
  UaggOuterChainTest.testEqualsUaggOuterChainSumsMultiDenseMR:872->runBinUaggTest:1356->AutomatedTestBase.checkNumCompiledMRJobs:1414
Unexpected number of compiled MR jobs. expected:<3> but was:<0>
  UaggOuterChainTest.testUaggOuterChainColSumsSingleDenseMR:412->runBinUaggTest:1356->AutomatedTestBase.checkNumCompiledMRJobs:1414
Unexpected number of compiled MR jobs. expected:<2> but was:<0>
  UaggOuterChainTest.testEqualsUaggOuterChainRowIndexMaxMultiSparseMR:1121->runBinUaggTest:1356->AutomatedTestBase.checkNumCompiledMRJobs:1414
Unexpected number of compiled MR jobs. expected:<2> but was:<0>
  UaggOuterChainTest.testUaggOuterChainRowSumsSingleDenseMR:101->runBinUaggTest:1356->AutomatedTestBase.checkNumCompiledMRJobs:1414
Unexpected number of compiled MR jobs. expected:<2> but was:<0>
  UaggOuterChainTest.testGreaterEqualsUaggOuterChainSumsSingleDenseMR:782->runBinUaggTest:1356->AutomatedTestBase.checkNumCompiledMRJobs:1414
Unexpected number of compiled MR jobs. expected:<3> but was:<0>
  UaggOuterChainTest.testUaggOuterChainColSumsMultiSparseMR:430->runBinUaggTest:1356->AutomatedTestBase.checkNumCompiledMRJobs:1414
Unexpected number of compiled MR jobs. expected:<2> but was:<0>
  UaggOuterChainTest.testUaggOuterChainRowSumsMultiDenseMR:113->runBinUaggTest:1356->AutomatedTestBase.checkNumCompiledMRJobs:1414
Unexpected number of compiled MR jobs. expected:<2> but was:<0>
  UaggOuterChainTest.testUaggOuterChainRowSumsMultiSparseMR:119->runBinUaggTest:1356->AutomatedTestBase.checkNumCompiledMRJobs:1414
Unexpected number of compiled MR jobs. expected:<2> but was:<0>
  UaggOuterChainTest.testEqualsUaggOuterChainRowSumsSingleSparseMR:207->runBinUaggTest:1356->AutomatedTestBase.checkNumCompiledMRJobs:1414
Unexpected number of compiled MR jobs. expected:<2> but was:<0>
  UaggOuterChainTest.testNotEqualsUaggOuterChainColSumsMultiDenseMR:554->runBinUaggTest:1356->AutomatedTestBase.checkNumCompiledMRJobs:1414
Unexpected number of compiled MR jobs. expected:<2> but was:<0>
  UaggOuterChainTest.testGreaterEqualsUaggOuterChainSumsMultiSparseMR:800->runBinUaggTest:1356->AutomatedTestBase.checkNumCompiledMRJobs:1414
Unexpected number of compiled MR jobs. expected:<3> but was:<0>
  UaggOuterChainTest.testGreaterEqualsUaggOuterChainColSumsMultiDenseMR:450->runBinUaggTest:1356->AutomatedTestBase.checkNumCompiledMRJobs:1414
Unexpected number of compiled MR jobs. expected:<2> but was:<0>
  UaggOuterChainTest.testGreaterEqualsUaggOuterChainColSumsSingleDenseMR:438->runBinUaggTest:1356->AutomatedTestBase.checkNumCompiledMRJobs:1414
Unexpected number of compiled MR jobs. expected:<2> but was:<0>
  UaggOuterChainTest.testLessEqualsUaggOuterChainSumsMultiDenseMR:846->runBinUaggTest:1356->AutomatedTestBase.checkNumCompiledMRJobs:1414
Unexpected number of compiled MR jobs. expected:<3> but was:<0>
  UaggOuterChainTest.testLessEqualsUaggOuterChainSumsSingleDenseMR:834->runBinUaggTest:1356->AutomatedTestBase.checkNumCompiledMRJobs:1414
Unexpected number of compiled MR jobs. expected:<3> but was:<0>
  UaggOuterChainTest.testLessEqualsUaggOuterChainRowIndexMinSingleDenseMR:1179->runBinUaggTest:1356->AutomatedTestBase.checkNumCompiledMRJobs:1414
Unexpected number of compiled MR jobs. expected:<2> but was:<0>
  UaggOuterChainTest.testGreaterEqualsUaggOuterChainRowSumsSingleDenseMR:176->runBinUaggTest:1356->AutomatedTestBase.checkNumCompiledMRJobs:1414
Unexpected number of compiled MR jobs. expected:<2> but was:<0>
  UaggOuterChainTest.testGreaterEqualsUaggOuterChainColSumsMultiSparseMR:456->runBinUaggTest:1356->AutomatedTestBase.checkNumCompiledMRJobs:1414
Unexpected number of compiled MR jobs. expected:<2> but was:<0>
  UaggOuterChainTest.testGreaterEqualsUaggOuterChainColSumsSingleSparseMR:444->runBinUaggTest:1356->AutomatedTestBase.checkNumCompiledMRJobs:1414
Unexpected number of compiled MR jobs. expected:<2> but was:<0>
  UaggOuterChainTest.testUaggOuterChainSumsSingleSparseMR:762->runBinUaggTest:1356->AutomatedTestBase.checkNumCompiledMRJobs:1414
Unexpected number of compiled MR jobs. expected:<3> but was:<0>
  UaggOuterChainTest.testUaggOuterChainRowSumsSingleSparseMR:107->runBinUaggTest:1356->AutomatedTestBase.checkNumCompiledMRJobs:1414
Unexpected number of compiled MR jobs. expected:<2> but was:<0>
  UaggOuterChainTest.testLessEqualsUaggOuterChainSumsMultiSparseMR:852->runBinUaggTest:1356->AutomatedTestBase.checkNumCompiledMRJobs:1414
Unexpected number of compiled MR jobs. expected:<3> but was:<0>
  UaggOuterChainTest.testEqualsUaggOuterChainSumsSingleDenseMR:860->runBinUaggTest:1356->AutomatedTestBase.checkNumCompiledMRJobs:1414
Unexpected number of compiled MR jobs. expected:<3> but was:<0>
  UaggOuterChainTest.testGreaterEqualsUaggOuterChainRowSumsMultiSparseMR:194->runBinUaggTest:1356->AutomatedTestBase.checkNumCompiledMRJobs:1414
Unexpected number of compiled MR jobs. expected:<2> but was:<0>
  UaggOuterChainTest.testLessEqualsUaggOuterChainRowIndexMaxMultiSparseMR:1140->runBinUaggTest:1356->AutomatedTestBase.checkNumCompiledMRJobs:1414
Unexpected number of compiled MR jobs. expected:<2> but was:<0>
  UaggOuterChainTest.testGreaterUaggOuterChainColSumsSingleDenseMR:464->runBinUaggTest:1356->AutomatedTestBase.checkNumCompiledMRJobs:1414
Unexpected number of compiled MR jobs. expected:<2> but was:<0>
  UaggOuterChainTest.testEqualsUaggOuterChainSumsMultiSparseMR:878->runBinUaggTest:1356->AutomatedTestBase.checkNumCompiledMRJobs:1414
Unexpected number of compiled MR jobs. expected:<3> but was:<0>
  UaggOuterChainTest.testGreaterUaggOuterChainRowSumsMultiDenseMR:138->runBinUaggTest:1356->AutomatedTestBase.checkNumCompiledMRJobs:1414
Unexpected number of compiled MR jobs. expected:<2> but was:<0>
  UaggOuterChainTest.testGreaterUaggOuterChainRowSumsSingleDenseMR:126->runBinUaggTest:1356->AutomatedTestBase.checkNumCompiledMRJobs:1414
Unexpected number of compiled MR jobs. expected:<2> but was:<0>
  UaggOuterChainTest.testGreaterUaggOuterChainColSumsMultiSparseMR:482->runBinUaggTest:1356->AutomatedTestBase.checkNumCompiledMRJobs:1414
Unexpected number of compiled MR jobs. expected:<2> but was:<0>
  UaggOuterChainTest.testLessUaggOuterChainColSumsEmptyMultiSparseMR:733->runBinUaggTest:1356->AutomatedTestBase.checkNumCompiledMRJobs:1414
Unexpected number of compiled MR jobs. expected:<2> but was:<0>
  UaggOuterChainTest.testGreaterUaggOuterChainSumsSingleDenseMR:808->runBinUaggTest:1356->AutomatedTestBase.checkNumCompiledMRJobs:1414
Unexpected number of compiled MR jobs. expected:<3> but was:<0>
  UaggOuterChainTest.testGreaterUaggOuterChainRowSumsMultiSparseMR:144->runBinUaggTest:1356->AutomatedTestBase.checkNumCompiledMRJobs:1414
Unexpected number of compiled MR jobs. expected:<2> but was:<0>
  UaggOuterChainTest.testNotEqualsUaggOuterChainColSumsSingleSparseMR:548->runBinUaggTest:1356->AutomatedTestBase.checkNumCompiledMRJobs:1414
Unexpected number of compiled MR jobs. expected:<2> but was:<0>
  UaggOuterChainTest.testLessUaggOuterChainRowIndexMaxMultiSparseMR:1134->runBinUaggTest:1356->AutomatedTestBase.checkNumCompiledMRJobs:1414
Unexpected number of compiled MR jobs. expected:<2> but was:<0>
  UaggOuterChainTest.testNotEqualsUaggOuterChainRowIndexMinSingleDenseMR:1167->runBinUaggTest:1356->AutomatedTestBase.checkNumCompiledMRJobs:1414
Unexpected number of compiled MR jobs. expected:<2> but was:<0>
  UaggOuterChainTest.testGreaterUaggOuterChainSumsMultiSparseMR:826->runBinUaggTest:1356->AutomatedTestBase.checkNumCompiledMRJobs:1414
Unexpected number of compiled MR jobs. expected:<3> but was:<0>
  UaggOuterChainTest.testNotEqualsUaggOuterChainSumsSingleDenseMR:886->runBinUaggTest:1356->AutomatedTestBase.checkNumCompiledMRJobs:1414
Unexpected number of compiled MR jobs. expected:<3> but was:<0>
  UaggOuterChainTest.testLessUaggOuterChainSumsEmptyMultiDenseMR:1068->runBinUaggTest:1356->AutomatedTestBase.checkNumCompiledMRJobs:1414
Unexpected number of compiled MR jobs. expected:<3> but was:<0>
  UaggOuterChainTest.testLessEqualsUaggOuterChainRowSumsSingleSparseMR:157->runBinUaggTest:1356->AutomatedTestBase.checkNumCompiledMRJobs:1414
Unexpected number of compiled MR jobs. expected:<2> but was:<0>
  UaggOuterChainTest.testNotEqualsUaggOuterChainRowIndexMaxMultiSparseMR:1128->runBinUaggTest:1356->AutomatedTestBase.checkNumCompiledMRJobs:1414
Unexpected number of compiled MR jobs. expected:<2> but was:<0>
  UaggOuterChainTest.testNotEqualsUaggOuterChainSumsMultiSparseMR:904->runBinUaggTest:1356->AutomatedTestBase.checkNumCompiledMRJobs:1414
Unexpected number of compiled MR jobs. expected:<3> but was:<0>
  UaggOuterChainTest.testLessEqualsUaggOuterChainSumsSingleSparseMR:840->runBinUaggTest:1356->AutomatedTestBase.checkNumCompiledMRJobs:1414
Unexpected number of compiled MR jobs. expected:<3> but was:<0>
  UaggOuterChainTest.testEqualsUaggOuterChainColSumsMultiDenseMR:528->runBinUaggTest:1356->AutomatedTestBase.checkNumCompiledMRJobs:1414
Unexpected number of compiled MR jobs. expected:<2> but was:<0>
  UaggOuterChainTest.testGreaterEqualsUaggOuterChainSumsMultiDenseMR:794->runBinUaggTest:1356->AutomatedTestBase.checkNumCompiledMRJobs:1414
Unexpected number of compiled MR jobs. expected:<3> but was:<0>
  UaggOuterChainTest.testNotEqualsUaggOuterChainSumsMultiDenseMR:898->runBinUaggTest:1356->AutomatedTestBase.checkNumCompiledMRJobs:1414
Unexpected number of compiled MR jobs. expected:<3> but was:<0>
  UaggOuterChainTest.testLessEqualsUaggOuterChainColSumsMultiDenseMR:502->runBinUaggTest:1356->AutomatedTestBase.checkNumCompiledMRJobs:1414
Unexpected number of compiled MR jobs. expected:<2> but was:<0>
  UaggOuterChainTest.testUaggOuterChainSumsMultiDenseMR:768->runBinUaggTest:1356->AutomatedTestBase.checkNumCompiledMRJobs:1414
Unexpected number of compiled MR jobs. expected:<3> but was:<0>
  UaggOuterChainTest.testLessEqualsUaggOuterChainColSumsSingleDenseMR:490->runBinUaggTest:1356->AutomatedTestBase.checkNumCompiledMRJobs:1414
Unexpected number of compiled MR jobs. expected:<2> but was:<0>
  UaggOuterChainTest.testLessEqualsUaggOuterChainRowSumsSingleDenseMR:151->runBinUaggTest:1356->AutomatedTestBase.checkNumCompiledMRJobs:1414
Unexpected number of compiled MR jobs. expected:<2> but was:<0>
  UaggOuterChainTest.testGreaterUaggOuterChainRowSumsSingleSparseMR:132->runBinUaggTest:1356->AutomatedTestBase.checkNumCompiledMRJobs:1414
Unexpected number of compiled MR jobs. expected:<2> but was:<0>
  UaggOuterChainTest.testLessEqualsUaggOuterChainColSumsMultiSparseMR:508->runBinUaggTest:1356->AutomatedTestBase.checkNumCompiledMRJobs:1414
Unexpected number of compiled MR jobs. expected:<2> but was:<0>
  UaggOuterChainTest.testLessEqualsUaggOuterChainRowSumsMultiSparseMR:169->runBinUaggTest:1356->AutomatedTestBase.checkNumCompiledMRJobs:1414
Unexpected number of compiled MR jobs. expected:<2> but was:<0>
  UaggOuterChainTest.testGreaterUaggOuterChainSumsSingleSparseMR:814->runBinUaggTest:1356->AutomatedTestBase.checkNumCompiledMRJobs:1414
Unexpected number of compiled MR jobs. expected:<3> but was:<0>
  UaggOuterChainTest.testEqualsUaggOuterChainColSumsSingleSparseMR:522->runBinUaggTest:1356->AutomatedTestBase.checkNumCompiledMRJobs:1414
Unexpected number of compiled MR jobs. expected:<2> but was:<0>
  UaggOuterChainTest.testEqualsUaggOuterChainColSumsSingleDenseMR:516->runBinUaggTest:1356->AutomatedTestBase.checkNumCompiledMRJobs:1414
Unexpected number of compiled MR jobs. expected:<2> but was:<0>
  UaggOuterChainTest.testUaggOuterChainColSumsMultiDenseMR:424->runBinUaggTest:1356->AutomatedTestBase.checkNumCompiledMRJobs:1414
Unexpected number of compiled MR jobs. expected:<2> but was:<0>
  UaggOuterChainTest.testEqualsUaggOuterChainRowSumsSingleDenseMR:201->runBinUaggTest:1356->AutomatedTestBase.checkNumCompiledMRJobs:1414
Unexpected number of compiled MR jobs. expected:<2> but was:<0>
  UaggOuterChainTest.testLessUaggOuterChainRowSumsEmptyMultiDenseMR:727->runBinUaggTest:1356->AutomatedTestBase.checkNumCompiledMRJobs:1414
Unexpected number of compiled MR jobs. expected:<2> but was:<0>
  UaggOuterChainTest.testGreaterUaggOuterChainRowIndexMinSingleDenseMR:1185->runBinUaggTest:1356->AutomatedTestBase.checkNumCompiledMRJobs:1414
Unexpected number of compiled MR jobs. expected:<2> but was:<0>
  UaggOuterChainTest.testUaggOuterChainColSumsSingleSparseMR:418->runBinUaggTest:1356->AutomatedTestBase.checkNumCompiledMRJobs:1414
Unexpected number of compiled MR jobs. expected:<2> but was:<0>
  UaggOuterChainTest.testEqualsUaggOuterChainColSumsMultiSparseMR:534->runBinUaggTest:1356->AutomatedTestBase.checkNumCompiledMRJobs:1414
Unexpected number of compiled MR jobs. expected:<2> but was:<0>
  UaggOuterChainTest.testUaggOuterChainSumsSingleDenseMR:756->runBinUaggTest:1356->AutomatedTestBase.checkNumCompiledMRJobs:1414
Unexpected number of compiled MR jobs. expected:<3> but was:<0>
  UaggOuterChainTest.testEqualsUaggOuterChainRowSumsMultiSparseMR:219->runBinUaggTest:1356->AutomatedTestBase.checkNumCompiledMRJobs:1414
Unexpected number of compiled MR jobs. expected:<2> but was:<0>
  UaggOuterChainTest.testNotEqualsUaggOuterChainRowSumsMultiDenseMR:238->runBinUaggTest:1356->AutomatedTestBase.checkNumCompiledMRJobs:1414
Unexpected number of compiled MR jobs. expected:<2> but was:<0>
  UaggOuterChainTest.testGreaterUaggOuterChainRowIndexMaxMultiSparseMR:1146->runBinUaggTest:1356->AutomatedTestBase.checkNumCompiledMRJobs:1414
Unexpected number of compiled MR jobs. expected:<2> but was:<0>
  OrderTest.testOrderDesc:62->runtestOrder:92 Unexpected number of compiled MR jobs. expected:<1>
but was:<0>
  OrderTest.testOrderAsc:56->runtestOrder:92 Unexpected number of compiled MR jobs. expected:<1>
but was:<0>
  IPAConstantPropagationTest.testConstantPropagationUpdateBranchRemovalIPA:97->runIPAConstantPropagationTest:142->AutomatedTestBase.checkNumCompiledMRJobs:1414
Unexpected number of compiled MR jobs. expected:<1> but was:<0>
  IPAConstantPropagationTest.testConstantPropagationNoUpdateNoBranchRemovalNoIPA:55->runIPAConstantPropagationTest:142->AutomatedTestBase.checkNumCompiledMRJobs:1414
Unexpected number of compiled MR jobs. expected:<1> but was:<0>
  IPAConstantPropagationTest.testConstantPropagationNoUpdateBranchRemovalNoIPA:67->runIPAConstantPropagationTest:142->AutomatedTestBase.checkNumCompiledMRJobs:1414
Unexpected number of compiled MR jobs. expected:<1> but was:<0>
  IPAConstantPropagationTest.testConstantPropagationNoUpdateNoBranchRemovalIPA:61->runIPAConstantPropagationTest:142->AutomatedTestBase.checkNumCompiledMRJobs:1414
Unexpected number of compiled MR jobs. expected:<1> but was:<0>
  IPAConstantPropagationTest.testConstantPropagationUpdateNoBranchRemovalNoIPA:79->runIPAConstantPropagationTest:142->AutomatedTestBase.checkNumCompiledMRJobs:1414
Unexpected number of compiled MR jobs. expected:<1> but was:<0>
  IPAConstantPropagationTest.testConstantPropagationUpdateBranchRemovalNoIPA:91->runIPAConstantPropagationTest:142->AutomatedTestBase.checkNumCompiledMRJobs:1414
Unexpected number of compiled MR jobs. expected:<1> but was:<0>
  IPAConstantPropagationTest.testConstantPropagationUpdateNoBranchRemovalIPA:85->runIPAConstantPropagationTest:142->AutomatedTestBase.checkNumCompiledMRJobs:1414
Unexpected number of compiled MR jobs. expected:<1> but was:<0>
  RandJobRecompileTest.testRandRecompilEstSizeEval:64->runRandJobRecompileTest:105->AutomatedTestBase.checkNumCompiledMRJobs:1414
Unexpected number of compiled MR jobs. expected:<1> but was:<0>
  RandJobRecompileTest.testRandRecompileNoEstSizeEval:58->runRandJobRecompileTest:105->AutomatedTestBase.checkNumCompiledMRJobs:1414
Unexpected number of compiled MR jobs. expected:<2> but was:<0>
  IPAPropagationSizeMultipleFunctionsTest.testFunctionSizePropagationDifferentDimsUnary:87->runIPASizePropagationMultipleFunctionsTest:165->AutomatedTestBase.checkNumCompiledMRJobs:1414
Unexpected number of compiled MR jobs. expected:<5> but was:<0>
  IPAPropagationSizeMultipleFunctionsTest.testFunctionSizePropagationEqualDimsUnknownNnz:77->runIPASizePropagationMultipleFunctionsTest:165->AutomatedTestBase.checkNumCompiledMRJobs:1414
Unexpected number of compiled MR jobs. expected:<4> but was:<0>
  IPAPropagationSizeMultipleFunctionsTest.testFunctionSizePropagationEqualDimsUnknownNnzLeftIPA:102->runIPASizePropagationMultipleFunctionsTest:165->AutomatedTestBase.checkNumCompiledMRJobs:1414
Unexpected number of compiled MR jobs. expected:<1> but was:<0>
  IPAPropagationSizeMultipleFunctionsTest.testFunctionSizePropagationDifferentDimsIPAUnary:117->runIPASizePropagationMultipleFunctionsTest:165->AutomatedTestBase.checkNumCompiledMRJobs:1414
Unexpected number of compiled MR jobs. expected:<2> but was:<0>
  IPAPropagationSizeMultipleFunctionsTest.testFunctionSizePropagationSameInputIPA:92->runIPASizePropagationMultipleFunctionsTest:165->AutomatedTestBase.checkNumCompiledMRJobs:1414
Unexpected number of compiled MR jobs. expected:<1> but was:<0>
  IPAPropagationSizeMultipleFunctionsTest.testFunctionSizePropagationEqualDimsUnknownNnzLeft:72->runIPASizePropagationMultipleFunctionsTest:165->AutomatedTestBase.checkNumCompiledMRJobs:1414
Unexpected number of compiled MR jobs. expected:<4> but was:<0>
  IPAPropagationSizeMultipleFunctionsTest.testFunctionSizePropagationEqualDimsUnknownNnzIPA:107->runIPASizePropagationMultipleFunctionsTest:165->AutomatedTestBase.checkNumCompiledMRJobs:1414
Unexpected number of compiled MR jobs. expected:<1> but was:<0>
  IPAPropagationSizeMultipleFunctionsTest.testFunctionSizePropagationDifferentDims:82->runIPASizePropagationMultipleFunctionsTest:165->AutomatedTestBase.checkNumCompiledMRJobs:1414
Unexpected number of compiled MR jobs. expected:<5> but was:<0>
  IPAPropagationSizeMultipleFunctionsTest.testFunctionSizePropagationSameInput:62->runIPASizePropagationMultipleFunctionsTest:165->AutomatedTestBase.checkNumCompiledMRJobs:1414
Unexpected number of compiled MR jobs. expected:<4> but was:<0>
  IPAPropagationSizeMultipleFunctionsTest.testFunctionSizePropagationEqualDimsUnknownNnzRightIPA:97->runIPASizePropagationMultipleFunctionsTest:165->AutomatedTestBase.checkNumCompiledMRJobs:1414
Unexpected number of compiled MR jobs. expected:<1> but was:<0>
  IPAPropagationSizeMultipleFunctionsTest.testFunctionSizePropagationEqualDimsUnknownNnzRight:67->runIPASizePropagationMultipleFunctionsTest:165->AutomatedTestBase.checkNumCompiledMRJobs:1414
Unexpected number of compiled MR jobs. expected:<4> but was:<0>
  IPAPropagationSizeMultipleFunctionsTest.testFunctionSizePropagationDifferentDimsIPA:112->runIPASizePropagationMultipleFunctionsTest:165->AutomatedTestBase.checkNumCompiledMRJobs:1414
Unexpected number of compiled MR jobs. expected:<4> but was:<0>
  RandRecompileTest.testRandScalarWithRecompile:62->runRandTest:150 Unexpected number of
compiled MR jobs. expected:<2> but was:<0>
  RandRecompileTest.testRandScalarWithoutRecompile:56->runRandTest:150 Unexpected number
of compiled MR jobs. expected:<2> but was:<0>
  RandRecompileTest.testRandNRowWithoutRecompileWithoutIPA:68->runRandTest:150 Unexpected
number of compiled MR jobs. expected:<2> but was:<0>
  RandRecompileTest.testRandNRowWithRecompileWithoutIPA:74->runRandTest:150 Unexpected
number of compiled MR jobs. expected:<2> but was:<0>
  RandRecompileTest.testRandNColWithoutRecompileWithoutIPA:80->runRandTest:150 Unexpected
number of compiled MR jobs. expected:<2> but was:<0>
  RandRecompileTest.testRandNColWithRecompileWithoutIPA:86->runRandTest:150 Unexpected
number of compiled MR jobs. expected:<2> but was:<0>
  IPAAssignConstantPropagationTest.testAssignConstantPropagationBranchRemovalNoIPA:68->runIPAAssignConstantPropagationTest:118->AutomatedTestBase.checkNumCompiledMRJobs:1414
Unexpected number of compiled MR jobs. expected:<1> but was:<0>
  IPAAssignConstantPropagationTest.testAssignConstantPropagationNoBranchRemovalIPA:62->runIPAAssignConstantPropagationTest:118->AutomatedTestBase.checkNumCompiledMRJobs:1414
Unexpected number of compiled MR jobs. expected:<1> but was:<0>
  IPAAssignConstantPropagationTest.testAssignConstantPropagationNoBranchRemovalNoIPA:56->runIPAAssignConstantPropagationTest:118->AutomatedTestBase.checkNumCompiledMRJobs:1414
Unexpected number of compiled MR jobs. expected:<1> but was:<0>
  RemoveEmptyRecompileTest.testRemoveEmptyMatMultLeftNonEmpty:137->runRemoveEmptyTest:276
Unexpected number of compiled MR jobs. expected:<21> but was:<0>
  RemoveEmptyRecompileTest.testRemoveEmptyMatMultRightEmpty:221->runRemoveEmptyTest:276
Unexpected number of compiled MR jobs. expected:<21> but was:<0>
  RemoveEmptyRecompileTest.testRemoveEmptyRoundNonEmpty:89->runRemoveEmptyTest:276 Unexpected
number of compiled MR jobs. expected:<21> but was:<0>
  RemoveEmptyRecompileTest.testRemoveEmptyTransposeEmpty:173->runRemoveEmptyTest:276 Unexpected
number of compiled MR jobs. expected:<21> but was:<0>
  RemoveEmptyRecompileTest.testRemoveEmptyMultLeftNonEmpty:101->runRemoveEmptyTest:276
Unexpected number of compiled MR jobs. expected:<21> but was:<0>
  RemoveEmptyRecompileTest.testRemoveEmptyMinusRightEmpty:209->runRemoveEmptyTest:276 Unexpected
number of compiled MR jobs. expected:<21> but was:<0>
  RemoveEmptyRecompileTest.testRemoveEmptyRIXEmpty:227->runRemoveEmptyTest:276 Unexpected
number of compiled MR jobs. expected:<21> but was:<0>
  RemoveEmptyRecompileTest.testRemoveEmptyLIXNonEmpty:155->runRemoveEmptyTest:276 Unexpected
number of compiled MR jobs. expected:<21> but was:<0>
  RemoveEmptyRecompileTest.testRemoveEmptyMatMultRightNonEmpty:143->runRemoveEmptyTest:276
Unexpected number of compiled MR jobs. expected:<21> but was:<0>
  RemoveEmptyRecompileTest.testRemoveEmptyMinusLeftNonEmpty:125->runRemoveEmptyTest:276
Unexpected number of compiled MR jobs. expected:<21> but was:<0>
  RemoveEmptyRecompileTest.testRemoveEmptyTransposeNonEmpty:95->runRemoveEmptyTest:276
Unexpected number of compiled MR jobs. expected:<21> but was:<0>
  RemoveEmptyRecompileTest.testRemoveEmptyMinusLeftEmpty:203->runRemoveEmptyTest:276 Unexpected
number of compiled MR jobs. expected:<21> but was:<0>
  RemoveEmptyRecompileTest.testRemoveEmptyPlusLeftEmpty:191->runRemoveEmptyTest:276 Unexpected
number of compiled MR jobs. expected:<21> but was:<0>
  RemoveEmptyRecompileTest.testRemoveEmptyRoundEmpty:167->runRemoveEmptyTest:276 Unexpected
number of compiled MR jobs. expected:<21> but was:<0>
  RemoveEmptyRecompileTest.testRemoveEmptyPlusRightEmpty:197->runRemoveEmptyTest:276 Unexpected
number of compiled MR jobs. expected:<21> but was:<0>
  RemoveEmptyRecompileTest.testRemoveEmptySumNonEmpty:83->runRemoveEmptyTest:276 Unexpected
number of compiled MR jobs. expected:<21> but was:<0>
  RemoveEmptyRecompileTest.testRemoveEmptyMultRightEmpty:185->runRemoveEmptyTest:276 Unexpected
number of compiled MR jobs. expected:<21> but was:<0>
  RemoveEmptyRecompileTest.testRemoveEmptyMinusRightNonEmpty:131->runRemoveEmptyTest:276
Unexpected number of compiled MR jobs. expected:<21> but was:<0>
  RemoveEmptyRecompileTest.testRemoveEmptyMultRightNonEmpty:107->runRemoveEmptyTest:276
Unexpected number of compiled MR jobs. expected:<21> but was:<0>
  RemoveEmptyRecompileTest.testRemoveEmptyPlusLeftNonEmpty:113->runRemoveEmptyTest:276
Unexpected number of compiled MR jobs. expected:<21> but was:<0>
  RemoveEmptyRecompileTest.testRemoveEmptyMultLeftEmpty:179->runRemoveEmptyTest:276 Unexpected
number of compiled MR jobs. expected:<21> but was:<0>
  RemoveEmptyRecompileTest.testRemoveEmptyRIXNonEmpty:149->runRemoveEmptyTest:276 Unexpected
number of compiled MR jobs. expected:<21> but was:<0>
  RemoveEmptyRecompileTest.testRemoveEmptyMatMultLeftEmpty:215->runRemoveEmptyTest:276
Unexpected number of compiled MR jobs. expected:<21> but was:<0>
  RemoveEmptyRecompileTest.testRemoveEmptyLIXEmpty:233->runRemoveEmptyTest:276 Unexpected
number of compiled MR jobs. expected:<21> but was:<0>
  RemoveEmptyRecompileTest.testRemoveEmptyPlusRightNonEmpty:119->runRemoveEmptyTest:276
Unexpected number of compiled MR jobs. expected:<21> but was:<0>
  RemoveEmptyRecompileTest.testRemoveEmptySumEmpty:161->runRemoveEmptyTest:276 Unexpected
number of compiled MR jobs. expected:<21> but was:<0>
  IPAComplexAppendTest.testComplexAppendIPANoRewrites:68->runIPAAppendTest:125->AutomatedTestBase.checkNumCompiledMRJobs:1414
Unexpected number of compiled MR jobs. expected:<3> but was:<0>
  IPAComplexAppendTest.testComplexAppendIPARewrites:82->runIPAAppendTest:125->AutomatedTestBase.checkNumCompiledMRJobs:1414
Unexpected number of compiled MR jobs. expected:<2> but was:<0>
  IPAComplexAppendTest.testComplexAppendNoIPANoRewrites:61->runIPAAppendTest:125->AutomatedTestBase.checkNumCompiledMRJobs:1414
Unexpected number of compiled MR jobs. expected:<3> but was:<0>
  IPAComplexAppendTest.testComplexAppendNoIPARewrites:75->runIPAAppendTest:125->AutomatedTestBase.checkNumCompiledMRJobs:1414
Unexpected number of compiled MR jobs. expected:<3> but was:<0>
  CSVReadUnknownSizeTest.testCSVReadUnknownSizeSplitRewrites:85->runCSVReadUnknownSizeTest:149->AutomatedTestBase.checkNumCompiledMRJobs:1414
Unexpected number of compiled MR jobs. expected:<3> but was:<0>
  CSVReadUnknownSizeTest.testCSVReadUnknownSizeSplitNoRewrites:80->runCSVReadUnknownSizeTest:149->AutomatedTestBase.checkNumCompiledMRJobs:1414
Unexpected number of compiled MR jobs. expected:<3> but was:<0>
  CSVReadUnknownSizeTest.testCSVReadUnknownSizeNoSplitNoRewrites:70->runCSVReadUnknownSizeTest:149->AutomatedTestBase.checkNumCompiledMRJobs:1414
Unexpected number of compiled MR jobs. expected:<3> but was:<0>
  CSVReadUnknownSizeTest.testCSVReadUnknownSizeNoSplitRewrites:75->runCSVReadUnknownSizeTest:149->AutomatedTestBase.checkNumCompiledMRJobs:1414
Unexpected number of compiled MR jobs. expected:<2> but was:<0>
  CTableSequenceTest.testCTableSequenceRightNoRewriteAggCP:194->runCTableSequenceTest:275->AutomatedTestBase.checkNumCompiledMRJobs:1414
Unexpected number of compiled MR jobs. expected:<3> but was:<0>
  CTableSequenceTest.testCTableSequenceRightNoRewriteAggMR:206->runCTableSequenceTest:275->AutomatedTestBase.checkNumCompiledMRJobs:1414
Unexpected number of compiled MR jobs. expected:<7> but was:<0>
  CTableSequenceTest.testCTableSequenceLeftNoRewriteAggCP:170->runCTableSequenceTest:275->AutomatedTestBase.checkNumCompiledMRJobs:1414
Unexpected number of compiled MR jobs. expected:<3> but was:<0>
  CTableSequenceTest.testCTableSequenceLeftNoRewriteAggMR:182->runCTableSequenceTest:275->AutomatedTestBase.checkNumCompiledMRJobs:1414
Unexpected number of compiled MR jobs. expected:<7> but was:<0>
  CTableSequenceTest.testCTableSequenceLeftNoRewriteCP:121->runCTableSequenceTest:275->AutomatedTestBase.checkNumCompiledMRJobs:1414
Unexpected number of compiled MR jobs. expected:<2> but was:<0>
  CTableSequenceTest.testCTableSequenceLeftNoRewriteMR:133->runCTableSequenceTest:275->AutomatedTestBase.checkNumCompiledMRJobs:1414
Unexpected number of compiled MR jobs. expected:<6> but was:<0>
  CTableSequenceTest.testCTableSequenceRightRewriteCP:151->runCTableSequenceTest:275->AutomatedTestBase.checkNumCompiledMRJobs:1414
Unexpected number of compiled MR jobs. expected:<2> but was:<0>
  CTableSequenceTest.testCTableSequenceRightRewriteMR:163->runCTableSequenceTest:275->AutomatedTestBase.checkNumCompiledMRJobs:1414
Unexpected number of compiled MR jobs. expected:<4> but was:<0>
  CTableSequenceTest.testCTableSequenceRightRewriteAggCP:200->runCTableSequenceTest:275->AutomatedTestBase.checkNumCompiledMRJobs:1414
Unexpected number of compiled MR jobs. expected:<3> but was:<0>
  CTableSequenceTest.testCTableSequenceRightRewriteAggMR:212->runCTableSequenceTest:275->AutomatedTestBase.checkNumCompiledMRJobs:1414
Unexpected number of compiled MR jobs. expected:<5> but was:<0>
  CTableSequenceTest.testCTableSequenceRightNoRewriteCP:145->runCTableSequenceTest:275->AutomatedTestBase.checkNumCompiledMRJobs:1414
Unexpected number of compiled MR jobs. expected:<2> but was:<0>
  CTableSequenceTest.testCTableSequenceRightNoRewriteMR:157->runCTableSequenceTest:275->AutomatedTestBase.checkNumCompiledMRJobs:1414
Unexpected number of compiled MR jobs. expected:<6> but was:<0>
  CTableSequenceTest.testCTableSequenceLeftRewriteAggCP:176->runCTableSequenceTest:275->AutomatedTestBase.checkNumCompiledMRJobs:1414
Unexpected number of compiled MR jobs. expected:<3> but was:<0>
  CTableSequenceTest.testCTableSequenceLeftRewriteAggMR:188->runCTableSequenceTest:275->AutomatedTestBase.checkNumCompiledMRJobs:1414
Unexpected number of compiled MR jobs. expected:<5> but was:<0>
  CTableSequenceTest.testCTableSequenceLeftRewriteCP:127->runCTableSequenceTest:275->AutomatedTestBase.checkNumCompiledMRJobs:1414
Unexpected number of compiled MR jobs. expected:<2> but was:<0>
  CTableSequenceTest.testCTableSequenceLeftRewriteMR:139->runCTableSequenceTest:275->AutomatedTestBase.checkNumCompiledMRJobs:1414
Unexpected number of compiled MR jobs. expected:<4> but was:<0>
  BranchRemovalTest.testTrueConditionBranchRemovalNoIPA:66->runBranchRemovalTest:158->AutomatedTestBase.checkNumCompiledMRJobs:1414
Unexpected number of compiled MR jobs. expected:<3> but was:<0>
  BranchRemovalTest.testTrueConditionNoBranchRemovalIPA:78->runBranchRemovalTest:158->AutomatedTestBase.checkNumCompiledMRJobs:1414
Unexpected number of compiled MR jobs. expected:<4> but was:<0>
  BranchRemovalTest.testFalseConditionBranchRemovalIPA:96->runBranchRemovalTest:158->AutomatedTestBase.checkNumCompiledMRJobs:1414
Unexpected number of compiled MR jobs. expected:<1> but was:<0>
  BranchRemovalTest.testFalseConditionNoBranchRemovalNoIPA:60->runBranchRemovalTest:158->AutomatedTestBase.checkNumCompiledMRJobs:1414
Unexpected number of compiled MR jobs. expected:<4> but was:<0>
  BranchRemovalTest.testFalseConditionBranchRemovalNoIPA:72->runBranchRemovalTest:158->AutomatedTestBase.checkNumCompiledMRJobs:1414
Unexpected number of compiled MR jobs. expected:<3> but was:<0>
  BranchRemovalTest.testTrueConditionBranchRemovalIPA:90->runBranchRemovalTest:158->AutomatedTestBase.checkNumCompiledMRJobs:1414
Unexpected number of compiled MR jobs. expected:<1> but was:<0>
  BranchRemovalTest.testTrueConditionNoBranchRemovalNoIPA:54->runBranchRemovalTest:158->AutomatedTestBase.checkNumCompiledMRJobs:1414
Unexpected number of compiled MR jobs. expected:<4> but was:<0>
  BranchRemovalTest.testFalseConditionNoBranchRemovalIPA:84->runBranchRemovalTest:158->AutomatedTestBase.checkNumCompiledMRJobs:1414
Unexpected number of compiled MR jobs. expected:<4> but was:<0>
  RewriteComplexMapMultChainTest.testRewriteExpr2SingleColumnCP:96->runRewriteMapMultChain:170->AutomatedTestBase.checkNumCompiledMRJobs:1414
Unexpected number of compiled MR jobs. expected:<1> but was:<0>
  RewriteComplexMapMultChainTest.testRewriteExpr2SingleColumnMR:110->runRewriteMapMultChain:170->AutomatedTestBase.checkNumCompiledMRJobs:1414
Unexpected number of compiled MR jobs. expected:<4> but was:<0>
  RewriteComplexMapMultChainTest.testRewriteExpr2MultiColumnCP:103->runRewriteMapMultChain:170->AutomatedTestBase.checkNumCompiledMRJobs:1414
Unexpected number of compiled MR jobs. expected:<1> but was:<0>
  RewriteComplexMapMultChainTest.testRewriteExpr2MultiColumnMR:117->runRewriteMapMultChain:170->AutomatedTestBase.checkNumCompiledMRJobs:1414
Unexpected number of compiled MR jobs. expected:<6> but was:<0>
  RewriteComplexMapMultChainTest.testRewriteExpr1MultiColumnCP:75->runRewriteMapMultChain:170->AutomatedTestBase.checkNumCompiledMRJobs:1414
Unexpected number of compiled MR jobs. expected:<1> but was:<0>
  RewriteComplexMapMultChainTest.testRewriteExpr1MultiColumnMR:89->runRewriteMapMultChain:170->AutomatedTestBase.checkNumCompiledMRJobs:1414
Unexpected number of compiled MR jobs. expected:<6> but was:<0>
  RewriteComplexMapMultChainTest.testRewriteExpr1SingleColumnCP:68->runRewriteMapMultChain:170->AutomatedTestBase.checkNumCompiledMRJobs:1414
Unexpected number of compiled MR jobs. expected:<1> but was:<0>
  RewriteComplexMapMultChainTest.testRewriteExpr1SingleColumnMR:82->runRewriteMapMultChain:170->AutomatedTestBase.checkNumCompiledMRJobs:1414
Unexpected number of compiled MR jobs. expected:<4> but was:<0>
  FunctionRecompileTest.testFunctionWithoutRecompileWithoutIPA:58->runFunctionTest:117
Unexpected number of compiled MR jobs. expected:<5> but was:<0>
  FunctionRecompileTest.testFunctionWithRecompileWithIPA:76->runFunctionTest:117 Unexpected
number of compiled MR jobs. expected:<1> but was:<0>
  FunctionRecompileTest.testFunctionWithRecompileWithoutIPA:70->runFunctionTest:117 Unexpected
number of compiled MR jobs. expected:<5> but was:<0>
  FunctionRecompileTest.testFunctionWithoutRecompileWithIPA:64->runFunctionTest:117 Unexpected
number of compiled MR jobs. expected:<1> but was:<0>
  SparsityRecompileTest.testForNoRecompile:101->runRecompileTest:144 Unexpected number
of compiled MR jobs. expected:<4> but was:<0>
  SparsityRecompileTest.testWhileRecompile:71->runRecompileTest:144 Unexpected number of
compiled MR jobs. expected:<4> but was:<0>
  SparsityRecompileTest.testParForNoRecompile:113->runRecompileTest:144 Unexpected number
of compiled MR jobs. expected:<6> but was:<2>
  SparsityRecompileTest.testIfRecompile:83->runRecompileTest:144 Unexpected number of compiled
MR jobs. expected:<3> but was:<0>
  SparsityRecompileTest.testParForRecompile:107->runRecompileTest:144 Unexpected number
of compiled MR jobs. expected:<4> but was:<0>
  SparsityRecompileTest.testIfNoRecompile:89->runRecompileTest:144 Unexpected number of
compiled MR jobs. expected:<3> but was:<0>
  SparsityRecompileTest.testForRecompile:95->runRecompileTest:144 Unexpected number of
compiled MR jobs. expected:<4> but was:<0>
  SparsityRecompileTest.testWhileNoRecompile:77->runRecompileTest:144 Unexpected number
of compiled MR jobs. expected:<4> but was:<0>
  SparsityFunctionRecompileTest.testIfNoRecompileNoIPA:138->runRecompileTest:199 Unexpected
number of compiled MR jobs. expected:<6> but was:<0>
  SparsityFunctionRecompileTest.testIfRecompileNoIPA:132->runRecompileTest:199 Unexpected
number of compiled MR jobs. expected:<6> but was:<0>
  SparsityFunctionRecompileTest.testParForNoRecompileIPA:114->runRecompileTest:199 Unexpected
number of compiled MR jobs. expected:<6> but was:<2>
  SparsityFunctionRecompileTest.testForNoRecompileIPA:102->runRecompileTest:199 Unexpected
number of compiled MR jobs. expected:<4> but was:<0>
  SparsityFunctionRecompileTest.testParForRecompileNoIPA:156->runRecompileTest:199 Unexpected
number of compiled MR jobs. expected:<7> but was:<2>
  SparsityFunctionRecompileTest.testForNoRecompileNoIPA:150->runRecompileTest:199 Unexpected
number of compiled MR jobs. expected:<5> but was:<0>
  SparsityFunctionRecompileTest.testForRecompileNoIPA:144->runRecompileTest:199 Unexpected
number of compiled MR jobs. expected:<5> but was:<0>
  SparsityFunctionRecompileTest.testWhileRecompileIPA:72->runRecompileTest:199 Unexpected
number of compiled MR jobs. expected:<4> but was:<0>
  SparsityFunctionRecompileTest.testForRecompileIPA:96->runRecompileTest:199 Unexpected
number of compiled MR jobs. expected:<4> but was:<0>
  SparsityFunctionRecompileTest.testWhileNoRecompileIPA:78->runRecompileTest:199 Unexpected
number of compiled MR jobs. expected:<4> but was:<0>
  SparsityFunctionRecompileTest.testWhileRecompileNoIPA:120->runRecompileTest:199 Unexpected
number of compiled MR jobs. expected:<5> but was:<0>
  SparsityFunctionRecompileTest.testWhileNoRecompileNoIPA:126->runRecompileTest:199 Unexpected
number of compiled MR jobs. expected:<5> but was:<0>
  SparsityFunctionRecompileTest.testParForNoRecompileNoIPA:162->runRecompileTest:199 Unexpected
number of compiled MR jobs. expected:<7> but was:<2>
  SparsityFunctionRecompileTest.testIfNoRecompileIPA:90->runRecompileTest:199 Unexpected
number of compiled MR jobs. expected:<3> but was:<0>
  SparsityFunctionRecompileTest.testParForRecompileIPA:108->runRecompileTest:199 Unexpected
number of compiled MR jobs. expected:<6> but was:<2>
  SparsityFunctionRecompileTest.testIfRecompileIPA:84->runRecompileTest:199 Unexpected
number of compiled MR jobs. expected:<3> but was:<0>

Tests run: 6741, Failures: 253, Errors: 0, Skipped: 0

[INFO] 
[INFO] --- maven-failsafe-plugin:2.17:verify (default) @ systemml ---
[INFO] Failsafe report directory: <https://sparktc.ibmcloud.com/jenkins/job/SystemML-DailyTest/ws/target/failsafe-reports>
[INFO] ------------------------------------------------------------------------
[INFO] BUILD FAILURE
[INFO] ------------------------------------------------------------------------
[INFO] Total time: 02:25 h
[INFO] Finished at: 2017-03-15T17:01:36-05:00
[INFO] Final Memory: 61M/2224M
[INFO] ------------------------------------------------------------------------
[ERROR] Failed to execute goal org.apache.maven.plugins:maven-failsafe-plugin:2.17:verify
(default) on project systemml: There are test failures.
[ERROR] 
[ERROR] Please refer to <https://sparktc.ibmcloud.com/jenkins/job/SystemML-DailyTest/ws/target/failsafe-reports>
for the individual test results.
[ERROR] -> [Help 1]
[ERROR] 
[ERROR] To see the full stack trace of the errors, re-run Maven with the -e switch.
[ERROR] Re-run Maven using the -X switch to enable full debug logging.
[ERROR] 
[ERROR] For more information about the errors and possible solutions, please read the following
articles:
[ERROR] [Help 1] http://cwiki.apache.org/confluence/display/MAVEN/MojoFailureException
Build step 'Execute shell' marked build as failure
Run condition [Always] enabling perform for step [[]]


Mime
View raw message