systemml-dev mailing list archives

Site index · List index
Message view « Date » · « Thread »
Top « Date » · « Thread »
From jenk...@spark.tc
Subject Build failed in Jenkins: SystemML-DailyTest #806
Date Sun, 12 Feb 2017 11:26:30 GMT
See <https://sparktc.ibmcloud.com/jenkins/job/SystemML-DailyTest/806/>

------------------------------------------
[...truncated 12657 lines...]
17/02/12 03:49:03 INFO memory.MemoryStore: Block broadcast_242 stored as values in memory
(estimated size 3.9 KB, free 1045.5 MB)
17/02/12 03:49:03 INFO memory.MemoryStore: Block broadcast_242_piece0 stored as bytes in memory
(estimated size 2.2 KB, free 1045.5 MB)
17/02/12 03:49:03 INFO storage.BlockManagerInfo: Added broadcast_242_piece0 in memory on 169.54.146.43:39681
(size: 2.2 KB, free: 1045.8 MB)
17/02/12 03:49:03 INFO spark.SparkContext: Created broadcast 242 from broadcast at DAGScheduler.scala:996
17/02/12 03:49:03 INFO scheduler.DAGScheduler: Submitting 1 missing tasks from ShuffleMapStage
242 (MapPartitionsRDD[663] at flatMapToPair at RDDConverterUtils.java:273)
17/02/12 03:49:03 INFO scheduler.TaskSchedulerImpl: Adding task set 242.0 with 1 tasks
17/02/12 03:49:03 INFO scheduler.FairSchedulableBuilder: Added task set TaskSet_242.0 tasks
to pool default
17/02/12 03:49:03 INFO scheduler.TaskSetManager: Starting task 0.0 in stage 242.0 (TID 252,
localhost, executor driver, partition 0, PROCESS_LOCAL, 6218 bytes)
17/02/12 03:49:03 INFO executor.Executor: Running task 0.0 in stage 242.0 (TID 252)
17/02/12 03:49:03 INFO executor.Executor: Finished task 0.0 in stage 242.0 (TID 252). 1253
bytes result sent to driver
17/02/12 03:49:03 INFO scheduler.TaskSetManager: Finished task 0.0 in stage 242.0 (TID 252)
in 7 ms on localhost (executor driver) (1/1)
17/02/12 03:49:03 INFO scheduler.TaskSchedulerImpl: Removed TaskSet 242.0, whose tasks have
all completed, from pool default
17/02/12 03:49:03 INFO scheduler.DAGScheduler: ShuffleMapStage 242 (flatMapToPair at RDDConverterUtils.java:273)
finished in 0.008 s
17/02/12 03:49:03 INFO scheduler.DAGScheduler: looking for newly runnable stages
17/02/12 03:49:03 INFO scheduler.DAGScheduler: running: Set()
17/02/12 03:49:03 INFO scheduler.DAGScheduler: waiting: Set(ResultStage 243)
17/02/12 03:49:03 INFO scheduler.DAGScheduler: failed: Set()
17/02/12 03:49:03 INFO scheduler.DAGScheduler: Submitting ResultStage 243 (MapPartitionsRDD[669]
at collectAsList at MLContextTest.java:1337), which has no missing parents
17/02/12 03:49:03 INFO memory.MemoryStore: Block broadcast_243 stored as values in memory
(estimated size 11.3 KB, free 1045.4 MB)
17/02/12 03:49:04 INFO memory.MemoryStore: Block broadcast_243_piece0 stored as bytes in memory
(estimated size 5.6 KB, free 1045.4 MB)
17/02/12 03:49:04 INFO storage.BlockManagerInfo: Added broadcast_243_piece0 in memory on 169.54.146.43:39681
(size: 5.6 KB, free: 1045.8 MB)
17/02/12 03:49:04 INFO spark.SparkContext: Created broadcast 243 from broadcast at DAGScheduler.scala:996
17/02/12 03:49:04 INFO scheduler.DAGScheduler: Submitting 1 missing tasks from ResultStage
243 (MapPartitionsRDD[669] at collectAsList at MLContextTest.java:1337)
17/02/12 03:49:04 INFO scheduler.TaskSchedulerImpl: Adding task set 243.0 with 1 tasks
17/02/12 03:49:04 INFO scheduler.FairSchedulableBuilder: Added task set TaskSet_243.0 tasks
to pool default
17/02/12 03:49:04 INFO scheduler.TaskSetManager: Starting task 0.0 in stage 243.0 (TID 253,
localhost, executor driver, partition 0, ANY, 5783 bytes)
17/02/12 03:49:04 INFO executor.Executor: Running task 0.0 in stage 243.0 (TID 253)
17/02/12 03:49:04 INFO storage.ShuffleBlockFetcherIterator: Getting 1 non-empty blocks out
of 1 blocks
17/02/12 03:49:04 INFO storage.ShuffleBlockFetcherIterator: Started 0 remote fetches in 0
ms
17/02/12 03:49:04 INFO executor.Executor: Finished task 0.0 in stage 243.0 (TID 253). 2024
bytes result sent to driver
17/02/12 03:49:04 INFO scheduler.TaskSetManager: Finished task 0.0 in stage 243.0 (TID 253)
in 7 ms on localhost (executor driver) (1/1)
17/02/12 03:49:04 INFO scheduler.TaskSchedulerImpl: Removed TaskSet 243.0, whose tasks have
all completed, from pool default
17/02/12 03:49:04 INFO scheduler.DAGScheduler: ResultStage 243 (collectAsList at MLContextTest.java:1337)
finished in 0.008 s
17/02/12 03:49:04 INFO storage.BlockManagerInfo: Removed broadcast_243_piece0 on 169.54.146.43:39681
in memory (size: 5.6 KB, free: 1045.8 MB)
17/02/12 03:49:04 INFO spark.ContextCleaner: Cleaned accumulator 16145
17/02/12 03:49:04 INFO spark.ContextCleaner: Cleaned shuffle 62
17/02/12 03:49:04 INFO storage.BlockManagerInfo: Removed broadcast_242_piece0 on 169.54.146.43:39681
in memory (size: 2.2 KB, free: 1045.8 MB)
17/02/12 03:49:04 INFO scheduler.DAGScheduler: Registering RDD 671 (flatMapToPair at RDDConverterUtils.java:273)
17/02/12 03:49:04 INFO scheduler.DAGScheduler: Got job 181 (collectAsList at MLContextTest.java:1225)
with 1 output partitions
17/02/12 03:49:04 INFO scheduler.DAGScheduler: Final stage: ResultStage 245 (collectAsList
at MLContextTest.java:1225)
17/02/12 03:49:04 INFO scheduler.DAGScheduler: Parents of final stage: List(ShuffleMapStage
244)
17/02/12 03:49:04 INFO scheduler.DAGScheduler: Missing parents: List(ShuffleMapStage 244)
17/02/12 03:49:04 INFO scheduler.DAGScheduler: Submitting ShuffleMapStage 244 (MapPartitionsRDD[671]
at flatMapToPair at RDDConverterUtils.java:273), which has no missing parents
17/02/12 03:49:04 INFO memory.MemoryStore: Block broadcast_244 stored as values in memory
(estimated size 3.9 KB, free 1045.5 MB)
17/02/12 03:49:04 INFO memory.MemoryStore: Block broadcast_244_piece0 stored as bytes in memory
(estimated size 2.2 KB, free 1045.5 MB)
17/02/12 03:49:04 INFO storage.BlockManagerInfo: Added broadcast_244_piece0 in memory on 169.54.146.43:39681
(size: 2.2 KB, free: 1045.8 MB)
17/02/12 03:49:04 INFO spark.SparkContext: Created broadcast 244 from broadcast at DAGScheduler.scala:996
17/02/12 03:49:04 INFO scheduler.DAGScheduler: Submitting 1 missing tasks from ShuffleMapStage
244 (MapPartitionsRDD[671] at flatMapToPair at RDDConverterUtils.java:273)
17/02/12 03:49:04 INFO scheduler.TaskSchedulerImpl: Adding task set 244.0 with 1 tasks
17/02/12 03:49:04 INFO scheduler.FairSchedulableBuilder: Added task set TaskSet_244.0 tasks
to pool default
17/02/12 03:49:04 INFO scheduler.TaskSetManager: Starting task 0.0 in stage 244.0 (TID 254,
localhost, executor driver, partition 0, PROCESS_LOCAL, 6218 bytes)
17/02/12 03:49:04 INFO executor.Executor: Running task 0.0 in stage 244.0 (TID 254)
17/02/12 03:49:04 INFO executor.Executor: Finished task 0.0 in stage 244.0 (TID 254). 1253
bytes result sent to driver
17/02/12 03:49:04 INFO scheduler.TaskSetManager: Finished task 0.0 in stage 244.0 (TID 254)
in 6 ms on localhost (executor driver) (1/1)
17/02/12 03:49:04 INFO scheduler.TaskSchedulerImpl: Removed TaskSet 244.0, whose tasks have
all completed, from pool default
17/02/12 03:49:04 INFO scheduler.DAGScheduler: ShuffleMapStage 244 (flatMapToPair at RDDConverterUtils.java:273)
finished in 0.006 s
17/02/12 03:49:04 INFO scheduler.DAGScheduler: looking for newly runnable stages
17/02/12 03:49:04 INFO scheduler.DAGScheduler: running: Set()
17/02/12 03:49:04 INFO scheduler.DAGScheduler: waiting: Set(ResultStage 245)
17/02/12 03:49:04 INFO scheduler.DAGScheduler: failed: Set()
17/02/12 03:49:04 INFO scheduler.DAGScheduler: Submitting ResultStage 245 (MapPartitionsRDD[677]
at collectAsList at MLContextTest.java:1225), which has no missing parents
17/02/12 03:49:04 INFO memory.MemoryStore: Block broadcast_245 stored as values in memory
(estimated size 11.3 KB, free 1045.4 MB)
17/02/12 03:49:04 INFO memory.MemoryStore: Block broadcast_245_piece0 stored as bytes in memory
(estimated size 5.6 KB, free 1045.4 MB)
17/02/12 03:49:04 INFO storage.BlockManagerInfo: Added broadcast_245_piece0 in memory on 169.54.146.43:39681
(size: 5.6 KB, free: 1045.8 MB)
17/02/12 03:49:04 INFO spark.SparkContext: Created broadcast 245 from broadcast at DAGScheduler.scala:996
17/02/12 03:49:04 INFO scheduler.DAGScheduler: Submitting 1 missing tasks from ResultStage
245 (MapPartitionsRDD[677] at collectAsList at MLContextTest.java:1225)
17/02/12 03:49:04 INFO scheduler.TaskSchedulerImpl: Adding task set 245.0 with 1 tasks
17/02/12 03:49:04 INFO scheduler.FairSchedulableBuilder: Added task set TaskSet_245.0 tasks
to pool default
17/02/12 03:49:04 INFO scheduler.TaskSetManager: Starting task 0.0 in stage 245.0 (TID 255,
localhost, executor driver, partition 0, ANY, 5783 bytes)
17/02/12 03:49:04 INFO executor.Executor: Running task 0.0 in stage 245.0 (TID 255)
17/02/12 03:49:04 INFO storage.ShuffleBlockFetcherIterator: Getting 1 non-empty blocks out
of 1 blocks
17/02/12 03:49:04 INFO storage.ShuffleBlockFetcherIterator: Started 0 remote fetches in 1
ms
17/02/12 03:49:04 INFO executor.Executor: Finished task 0.0 in stage 245.0 (TID 255). 2024
bytes result sent to driver
17/02/12 03:49:04 INFO scheduler.TaskSetManager: Finished task 0.0 in stage 245.0 (TID 255)
in 6 ms on localhost (executor driver) (1/1)
17/02/12 03:49:04 INFO scheduler.TaskSchedulerImpl: Removed TaskSet 245.0, whose tasks have
all completed, from pool default
17/02/12 03:49:04 INFO scheduler.DAGScheduler: ResultStage 245 (collectAsList at MLContextTest.java:1225)
finished in 0.008 s
17/02/12 03:49:05 INFO storage.BlockManagerInfo: Removed broadcast_245_piece0 on 169.54.146.43:39681
in memory (size: 5.6 KB, free: 1045.8 MB)
17/02/12 03:49:05 INFO storage.BlockManagerInfo: Removed broadcast_244_piece0 on 169.54.146.43:39681
in memory (size: 2.2 KB, free: 1045.8 MB)
17/02/12 03:49:05 INFO spark.ContextCleaner: Cleaned accumulator 16242
17/02/12 03:49:05 INFO spark.ContextCleaner: Cleaned shuffle 63
17/02/12 03:49:06 INFO server.ServerConnector: Stopped ServerConnector@55a57032{HTTP/1.1}{0.0.0.0:4040}
17/02/12 03:49:06 INFO handler.ContextHandler: Stopped o.s.j.s.ServletContextHandler@6ee6ebb5{/stages/stage/kill,null,UNAVAILABLE}
17/02/12 03:49:06 INFO handler.ContextHandler: Stopped o.s.j.s.ServletContextHandler@71bb18e9{/jobs/job/kill,null,UNAVAILABLE}
17/02/12 03:49:06 INFO handler.ContextHandler: Stopped o.s.j.s.ServletContextHandler@6516e75f{/api,null,UNAVAILABLE}
17/02/12 03:49:06 INFO handler.ContextHandler: Stopped o.s.j.s.ServletContextHandler@411d1947{/,null,UNAVAILABLE}
17/02/12 03:49:06 INFO handler.ContextHandler: Stopped o.s.j.s.ServletContextHandler@5fb80f44{/static,null,UNAVAILABLE}
17/02/12 03:49:06 INFO handler.ContextHandler: Stopped o.s.j.s.ServletContextHandler@6def3ade{/executors/threadDump/json,null,UNAVAILABLE}
17/02/12 03:49:06 INFO handler.ContextHandler: Stopped o.s.j.s.ServletContextHandler@2260c9e2{/executors/threadDump,null,UNAVAILABLE}
17/02/12 03:49:06 INFO handler.ContextHandler: Stopped o.s.j.s.ServletContextHandler@57093652{/executors/json,null,UNAVAILABLE}
17/02/12 03:49:06 INFO handler.ContextHandler: Stopped o.s.j.s.ServletContextHandler@660a9dea{/executors,null,UNAVAILABLE}
17/02/12 03:49:06 INFO handler.ContextHandler: Stopped o.s.j.s.ServletContextHandler@3b3e8fc7{/environment/json,null,UNAVAILABLE}
17/02/12 03:49:06 INFO handler.ContextHandler: Stopped o.s.j.s.ServletContextHandler@7c5129b8{/environment,null,UNAVAILABLE}
17/02/12 03:49:06 INFO handler.ContextHandler: Stopped o.s.j.s.ServletContextHandler@7e99e57c{/storage/rdd/json,null,UNAVAILABLE}
17/02/12 03:49:06 INFO handler.ContextHandler: Stopped o.s.j.s.ServletContextHandler@3f8c4cb6{/storage/rdd,null,UNAVAILABLE}
17/02/12 03:49:06 INFO handler.ContextHandler: Stopped o.s.j.s.ServletContextHandler@7e2731e4{/storage/json,null,UNAVAILABLE}
17/02/12 03:49:06 INFO handler.ContextHandler: Stopped o.s.j.s.ServletContextHandler@3186799e{/storage,null,UNAVAILABLE}
17/02/12 03:49:06 INFO handler.ContextHandler: Stopped o.s.j.s.ServletContextHandler@76c6e251{/stages/pool/json,null,UNAVAILABLE}
17/02/12 03:49:06 INFO handler.ContextHandler: Stopped o.s.j.s.ServletContextHandler@122a781e{/stages/pool,null,UNAVAILABLE}
17/02/12 03:49:06 INFO handler.ContextHandler: Stopped o.s.j.s.ServletContextHandler@4e960fa{/stages/stage/json,null,UNAVAILABLE}
17/02/12 03:49:06 INFO handler.ContextHandler: Stopped o.s.j.s.ServletContextHandler@5e532a95{/stages/stage,null,UNAVAILABLE}
17/02/12 03:49:06 INFO handler.ContextHandler: Stopped o.s.j.s.ServletContextHandler@60c409a{/stages/json,null,UNAVAILABLE}
17/02/12 03:49:06 INFO handler.ContextHandler: Stopped o.s.j.s.ServletContextHandler@55b86db4{/stages,null,UNAVAILABLE}
17/02/12 03:49:06 INFO handler.ContextHandler: Stopped o.s.j.s.ServletContextHandler@3eec9194{/jobs/job/json,null,UNAVAILABLE}
17/02/12 03:49:06 INFO handler.ContextHandler: Stopped o.s.j.s.ServletContextHandler@f2ae5b3{/jobs/job,null,UNAVAILABLE}
17/02/12 03:49:06 INFO handler.ContextHandler: Stopped o.s.j.s.ServletContextHandler@7f259849{/jobs/json,null,UNAVAILABLE}
17/02/12 03:49:06 INFO handler.ContextHandler: Stopped o.s.j.s.ServletContextHandler@1fde9c29{/jobs,null,UNAVAILABLE}
17/02/12 03:49:06 INFO ui.SparkUI: Stopped Spark web UI at http://169.54.146.43:4040
17/02/12 03:49:06 INFO spark.MapOutputTrackerMasterEndpoint: MapOutputTrackerMasterEndpoint
stopped!
17/02/12 03:49:06 INFO memory.MemoryStore: MemoryStore cleared
17/02/12 03:49:06 INFO storage.BlockManager: BlockManager stopped
17/02/12 03:49:06 INFO storage.BlockManagerMaster: BlockManagerMaster stopped
17/02/12 03:49:06 INFO scheduler.OutputCommitCoordinator$OutputCommitCoordinatorEndpoint:
OutputCommitCoordinator stopped!
17/02/12 03:49:06 INFO spark.SparkContext: Successfully stopped SparkContext
Running org.apache.sysml.test.integration.mlcontext.MLContextTest
Tests run: 165, Failures: 0, Errors: 0, Skipped: 0, Time elapsed: 66.294 sec - in org.apache.sysml.test.integration.mlcontext.MLContextTest
17/02/12 03:49:07 INFO util.ShutdownHookManager: Shutdown hook called
17/02/12 03:49:07 INFO util.ShutdownHookManager: Deleting directory /tmp/spark-5c92740a-f014-4d96-878a-e84f53128a17
Running org.apache.sysml.test.integration.functions.append.AppendVectorTest
Tests run: 6, Failures: 0, Errors: 0, Skipped: 0, Time elapsed: 318.258 sec - in org.apache.sysml.test.integration.functions.append.AppendVectorTest
Running org.apache.sysml.test.integration.applications.dml.ArimaDMLTest
Tests run: 2, Failures: 0, Errors: 0, Skipped: 0, Time elapsed: 206.039 sec - in org.apache.sysml.test.integration.applications.dml.ArimaDMLTest
Running org.apache.sysml.test.integration.functions.indexing.LeftIndexingTest
Tests run: 3, Failures: 0, Errors: 0, Skipped: 0, Time elapsed: 671.078 sec - in org.apache.sysml.test.integration.functions.indexing.LeftIndexingTest
Running org.apache.sysml.test.integration.functions.quaternary.WeightedSigmoidTest
Tests run: 56, Failures: 0, Errors: 0, Skipped: 0, Time elapsed: 996.099 sec - in org.apache.sysml.test.integration.functions.quaternary.WeightedSigmoidTest
17/02/12 03:51:51 INFO util.ShutdownHookManager: Shutdown hook called
17/02/12 03:51:51 INFO util.ShutdownHookManager: Deleting directory /tmp/spark-dfe01c77-af98-476c-83bb-4769931baafa
Running org.apache.sysml.test.integration.applications.descriptivestats.UnivariateUnweightedScaleDenseTest
Tests run: 24, Failures: 0, Errors: 0, Skipped: 0, Time elapsed: 328.943 sec - in org.apache.sysml.test.integration.applications.descriptivestats.UnivariateUnweightedScaleDenseTest
Running org.apache.sysml.test.integration.applications.parfor.ParForCorrelationTest
Tests run: 12, Failures: 0, Errors: 0, Skipped: 0, Time elapsed: 283.975 sec - in org.apache.sysml.test.integration.applications.parfor.ParForCorrelationTest
Running org.apache.sysml.test.integration.applications.parfor.ParForCorrelationTestLarge
Tests run: 2, Failures: 0, Errors: 0, Skipped: 0, Time elapsed: 45.627 sec - in org.apache.sysml.test.integration.applications.parfor.ParForCorrelationTestLarge
Running org.apache.sysml.test.integration.functions.reorg.FullOrderTest
Tests run: 132, Failures: 0, Errors: 0, Skipped: 0, Time elapsed: 1,351.533 sec - in org.apache.sysml.test.integration.functions.reorg.FullOrderTest
Running org.apache.sysml.test.integration.functions.quaternary.WeightedDivMatrixMultTest
Tests run: 90, Failures: 0, Errors: 0, Skipped: 0, Time elapsed: 1,508.342 sec - in org.apache.sysml.test.integration.functions.quaternary.WeightedDivMatrixMultTest
17/02/12 03:58:32 INFO util.ShutdownHookManager: Shutdown hook called
17/02/12 03:58:32 INFO util.ShutdownHookManager: Deleting directory /tmp/spark-b0af0493-13df-40bd-85be-9f948904f64e
Running org.apache.sysml.test.integration.applications.descriptivestats.UnivariateWeightedScaleDenseTest
Tests run: 24, Failures: 0, Errors: 0, Skipped: 0, Time elapsed: 355.291 sec - in org.apache.sysml.test.integration.applications.descriptivestats.UnivariateWeightedScaleDenseTest
Running org.apache.sysml.test.integration.functions.append.AppendChainTest
Tests run: 12, Failures: 0, Errors: 0, Skipped: 0, Time elapsed: 1,062.067 sec - in org.apache.sysml.test.integration.functions.append.AppendChainTest
Running org.apache.sysml.test.integration.applications.parfor.ParForNaiveBayesTest
Tests run: 10, Failures: 0, Errors: 0, Skipped: 0, Time elapsed: 527.816 sec - in org.apache.sysml.test.integration.applications.parfor.ParForNaiveBayesTest
Running org.apache.sysml.test.integration.applications.descriptivestats.UnivariateUnweightedScaleSparseTest
Tests run: 24, Failures: 0, Errors: 0, Skipped: 0, Time elapsed: 278.124 sec - in org.apache.sysml.test.integration.applications.descriptivestats.UnivariateUnweightedScaleSparseTest
Running org.apache.sysml.test.integration.functions.append.AppendMatrixTest
Tests run: 22, Failures: 0, Errors: 0, Skipped: 0, Time elapsed: 1,380.271 sec - in org.apache.sysml.test.integration.functions.append.AppendMatrixTest
Running org.apache.sysml.test.integration.applications.descriptivestats.UnivariateWeightedScaleSparseTest
Tests run: 24, Failures: 0, Errors: 0, Skipped: 0, Time elapsed: 367.97 sec - in org.apache.sysml.test.integration.applications.descriptivestats.UnivariateWeightedScaleSparseTest
Running org.apache.sysml.test.integration.applications.dml.HITSDMLTest
Tests run: 2, Failures: 0, Errors: 0, Skipped: 0, Time elapsed: 156.229 sec - in org.apache.sysml.test.integration.applications.dml.HITSDMLTest
Running org.apache.sysml.test.integration.applications.pydml.ArimaPyDMLTest
Tests run: 1, Failures: 0, Errors: 0, Skipped: 0, Time elapsed: 50.272 sec - in org.apache.sysml.test.integration.applications.pydml.ArimaPyDMLTest
Running org.apache.sysml.test.integration.applications.pydml.HITSPyDMLTest
Tests run: 1, Failures: 0, Errors: 0, Skipped: 0, Time elapsed: 77.712 sec - in org.apache.sysml.test.integration.applications.pydml.HITSPyDMLTest
Running org.apache.sysml.test.integration.applications.dml.LinearRegressionDMLTest
Tests run: 14, Failures: 0, Errors: 0, Skipped: 0, Time elapsed: 102.903 sec - in org.apache.sysml.test.integration.applications.dml.LinearRegressionDMLTest
Running org.apache.sysml.test.integration.applications.pydml.CsplineDSPyDMLTest
Tests run: 3, Failures: 0, Errors: 0, Skipped: 0, Time elapsed: 6.855 sec - in org.apache.sysml.test.integration.applications.pydml.CsplineDSPyDMLTest
Running org.apache.sysml.test.integration.applications.pydml.LinearLogRegPyDMLTest
Tests run: 7, Failures: 0, Errors: 0, Skipped: 0, Time elapsed: 85.612 sec - in org.apache.sysml.test.integration.applications.pydml.LinearLogRegPyDMLTest
Running org.apache.sysml.test.integration.applications.pydml.NaiveBayesPyDMLTest
Tests run: 6, Failures: 0, Errors: 0, Skipped: 0, Time elapsed: 81.291 sec - in org.apache.sysml.test.integration.applications.pydml.NaiveBayesPyDMLTest
Running org.apache.sysml.test.integration.applications.dml.CsplineCGDMLTest
Tests run: 6, Failures: 0, Errors: 0, Skipped: 0, Time elapsed: 23.887 sec - in org.apache.sysml.test.integration.applications.dml.CsplineCGDMLTest
Running org.apache.sysml.test.integration.applications.dml.L2SVMDMLTest
Tests run: 18, Failures: 0, Errors: 0, Skipped: 0, Time elapsed: 128.223 sec - in org.apache.sysml.test.integration.applications.dml.L2SVMDMLTest
Running org.apache.sysml.test.integration.applications.pydml.MDABivariateStatsPyDMLTest
Tests run: 4, Failures: 0, Errors: 0, Skipped: 0, Time elapsed: 295.891 sec - in org.apache.sysml.test.integration.applications.pydml.MDABivariateStatsPyDMLTest
Running org.apache.sysml.test.integration.applications.pydml.PageRankPyDMLTest
Tests run: 3, Failures: 0, Errors: 0, Skipped: 0, Time elapsed: 6.308 sec - in org.apache.sysml.test.integration.applications.pydml.PageRankPyDMLTest
Running org.apache.sysml.test.integration.applications.pydml.NaiveBayesParforPyDMLTest
Tests run: 6, Failures: 0, Errors: 0, Skipped: 0, Time elapsed: 81.374 sec - in org.apache.sysml.test.integration.applications.pydml.NaiveBayesParforPyDMLTest
Running org.apache.sysml.test.integration.applications.dml.NaiveBayesDMLTest
Tests run: 12, Failures: 0, Errors: 0, Skipped: 0, Time elapsed: 163.03 sec - in org.apache.sysml.test.integration.applications.dml.NaiveBayesDMLTest
Running org.apache.sysml.test.integration.applications.dml.MDABivariateStatsDMLTest
Tests run: 8, Failures: 0, Errors: 0, Skipped: 0, Time elapsed: 610.814 sec - in org.apache.sysml.test.integration.applications.dml.MDABivariateStatsDMLTest
Running org.apache.sysml.test.integration.applications.dml.PageRankDMLTest
Tests run: 6, Failures: 0, Errors: 0, Skipped: 0, Time elapsed: 12.345 sec - in org.apache.sysml.test.integration.applications.dml.PageRankDMLTest
Running org.apache.sysml.test.integration.applications.pydml.GLMPyDMLTest
Tests run: 30, Failures: 0, Errors: 0, Skipped: 0, Time elapsed: 587.158 sec - in org.apache.sysml.test.integration.applications.pydml.GLMPyDMLTest
Running org.apache.sysml.test.integration.applications.pydml.MultiClassSVMPyDMLTest
Tests run: 9, Failures: 0, Errors: 0, Skipped: 0, Time elapsed: 88.191 sec - in org.apache.sysml.test.integration.applications.pydml.MultiClassSVMPyDMLTest
Running org.apache.sysml.test.integration.applications.dml.ID3DMLTest
Tests run: 4, Failures: 0, Errors: 0, Skipped: 0, Time elapsed: 658.009 sec - in org.apache.sysml.test.integration.applications.dml.ID3DMLTest
Running org.apache.sysml.test.integration.applications.dml.GLMDMLTest
Tests run: 60, Failures: 0, Errors: 0, Skipped: 0, Time elapsed: 1,454.053 sec - in org.apache.sysml.test.integration.applications.dml.GLMDMLTest
Running org.apache.sysml.test.integration.applications.pydml.CsplineCGPyDMLTest
Tests run: 3, Failures: 0, Errors: 0, Skipped: 0, Time elapsed: 6.32 sec - in org.apache.sysml.test.integration.applications.pydml.CsplineCGPyDMLTest
Running org.apache.sysml.test.integration.applications.pydml.WelchTPyDMLTest
Tests run: 3, Failures: 0, Errors: 0, Skipped: 0, Time elapsed: 6.657 sec - in org.apache.sysml.test.integration.applications.pydml.WelchTPyDMLTest
Running org.apache.sysml.test.integration.applications.dml.MultiClassSVMDMLTest
Tests run: 18, Failures: 0, Errors: 0, Skipped: 0, Time elapsed: 178.044 sec - in org.apache.sysml.test.integration.applications.dml.MultiClassSVMDMLTest
Running org.apache.sysml.test.integration.applications.dml.CsplineDSDMLTest
Tests run: 6, Failures: 0, Errors: 0, Skipped: 0, Time elapsed: 22.413 sec - in org.apache.sysml.test.integration.applications.dml.CsplineDSDMLTest
Running org.apache.sysml.test.integration.applications.pydml.ApplyTransformPyDMLTest
Tests run: 7, Failures: 0, Errors: 0, Skipped: 0, Time elapsed: 1.402 sec - in org.apache.sysml.test.integration.applications.pydml.ApplyTransformPyDMLTest
Running org.apache.sysml.test.integration.applications.dml.NaiveBayesParforDMLTest
Tests run: 12, Failures: 0, Errors: 0, Skipped: 0, Time elapsed: 162.961 sec - in org.apache.sysml.test.integration.applications.dml.NaiveBayesParforDMLTest
Running org.apache.sysml.test.integration.applications.pydml.L2SVMPyDMLTest
Tests run: 9, Failures: 0, Errors: 0, Skipped: 0, Time elapsed: 64.266 sec - in org.apache.sysml.test.integration.applications.pydml.L2SVMPyDMLTest
Running org.apache.sysml.test.integration.applications.pydml.LinearRegressionPyDMLTest
Tests run: 7, Failures: 0, Errors: 0, Skipped: 0, Time elapsed: 51.935 sec - in org.apache.sysml.test.integration.applications.pydml.LinearRegressionPyDMLTest
Running org.apache.sysml.test.integration.applications.dml.LinearLogRegDMLTest
Tests run: 14, Failures: 0, Errors: 0, Skipped: 0, Time elapsed: 121.73 sec - in org.apache.sysml.test.integration.applications.dml.LinearLogRegDMLTest
Running org.apache.sysml.test.integration.applications.dml.GNMFDMLTest
Tests run: 6, Failures: 0, Errors: 0, Skipped: 0, Time elapsed: 118.688 sec - in org.apache.sysml.test.integration.applications.dml.GNMFDMLTest
Running org.apache.sysml.test.integration.applications.dml.WelchTDMLTest
Tests run: 6, Failures: 0, Errors: 0, Skipped: 0, Time elapsed: 13.234 sec - in org.apache.sysml.test.integration.applications.dml.WelchTDMLTest
Running org.apache.sysml.test.integration.applications.dml.ApplyTransformDMLTest
Tests run: 14, Failures: 0, Errors: 0, Skipped: 0, Time elapsed: 18.691 sec - in org.apache.sysml.test.integration.applications.dml.ApplyTransformDMLTest
Running org.apache.sysml.test.integration.applications.pydml.ID3PyDMLTest
Tests run: 2, Failures: 0, Errors: 0, Skipped: 0, Time elapsed: 333.023 sec - in org.apache.sysml.test.integration.applications.pydml.ID3PyDMLTest
Running org.apache.sysml.test.integration.applications.pydml.GNMFPyDMLTest
Tests run: 3, Failures: 0, Errors: 0, Skipped: 0, Time elapsed: 57.249 sec - in org.apache.sysml.test.integration.applications.pydml.GNMFPyDMLTest

Results :

Tests in error: 
  TransformCSVFrameEncodeReadTest.testFrameParReadMetaHybridCSV:79->runTransformTest:122
Runtime
  TransformCSVFrameEncodeReadTest.testFrameParReadMetaSparkCSV:74->runTransformTest:122
Runtime
  TransformCSVFrameEncodeReadTest.testFrameParReadMetaSingleNodeCSV:69->runTransformTest:122
Runtime

Tests run: 6676, Failures: 0, Errors: 3, Skipped: 0

[INFO] 
[INFO] --- maven-failsafe-plugin:2.17:verify (default) @ systemml ---
[INFO] Failsafe report directory: <https://sparktc.ibmcloud.com/jenkins/job/SystemML-DailyTest/ws/target/failsafe-reports>
[INFO] ------------------------------------------------------------------------
[INFO] BUILD FAILURE
[INFO] ------------------------------------------------------------------------
[INFO] Total time: 02:54 h
[INFO] Finished at: 2017-02-12T05:26:30-06:00
[INFO] Final Memory: 63M/2358M
[INFO] ------------------------------------------------------------------------
[ERROR] Failed to execute goal org.apache.maven.plugins:maven-failsafe-plugin:2.17:verify
(default) on project systemml: There are test failures.
[ERROR] 
[ERROR] Please refer to <https://sparktc.ibmcloud.com/jenkins/job/SystemML-DailyTest/ws/target/failsafe-reports>
for the individual test results.
[ERROR] -> [Help 1]
[ERROR] 
[ERROR] To see the full stack trace of the errors, re-run Maven with the -e switch.
[ERROR] Re-run Maven using the -X switch to enable full debug logging.
[ERROR] 
[ERROR] For more information about the errors and possible solutions, please read the following
articles:
[ERROR] [Help 1] http://cwiki.apache.org/confluence/display/MAVEN/MojoFailureException
Build step 'Execute shell' marked build as failure
Run condition [Always] enabling perform for step [[]]

Mime
View raw message