systemml-dev mailing list archives

Site index · List index
Message view « Date » · « Thread »
Top « Date » · « Thread »
From jenk...@spark.tc
Subject Build failed in Jenkins: SystemML-DailyTest #777
Date Sun, 29 Jan 2017 00:16:23 GMT
See <https://sparktc.ibmcloud.com/jenkins/job/SystemML-DailyTest/777/changes>

Changes:

[Deron Eriksson] [SYSTEMML-1208] Mimic main website styles in project documentation

------------------------------------------
[...truncated 9498 lines...]
17/01/28 16:08:31 INFO scheduler.DAGScheduler: Submitting 1 missing tasks from ResultStage
245 (MapPartitionsRDD[677] at collectAsList at MLContextTest.java:1225)
17/01/28 16:08:31 INFO scheduler.TaskSchedulerImpl: Adding task set 245.0 with 1 tasks
17/01/28 16:08:31 INFO scheduler.FairSchedulableBuilder: Added task set TaskSet_245 tasks
to pool default
17/01/28 16:08:31 INFO scheduler.TaskSetManager: Starting task 0.0 in stage 245.0 (TID 255,
localhost, partition 0, NODE_LOCAL, 5202 bytes)
17/01/28 16:08:31 INFO executor.Executor: Running task 0.0 in stage 245.0 (TID 255)
17/01/28 16:08:31 INFO storage.ShuffleBlockFetcherIterator: Getting 1 non-empty blocks out
of 1 blocks
17/01/28 16:08:31 INFO storage.ShuffleBlockFetcherIterator: Started 0 remote fetches in 0
ms
17/01/28 16:08:31 INFO executor.Executor: Finished task 0.0 in stage 245.0 (TID 255). 1855
bytes result sent to driver
17/01/28 16:08:31 INFO scheduler.TaskSetManager: Finished task 0.0 in stage 245.0 (TID 255)
in 8 ms on localhost (1/1)
17/01/28 16:08:31 INFO scheduler.TaskSchedulerImpl: Removed TaskSet 245.0, whose tasks have
all completed, from pool default
17/01/28 16:08:31 INFO scheduler.DAGScheduler: ResultStage 245 (collectAsList at MLContextTest.java:1225)
finished in 0.013 s
17/01/28 16:08:31 INFO spark.ContextCleaner: Cleaned accumulator 14906
17/01/28 16:08:31 INFO spark.ContextCleaner: Cleaned shuffle 63
17/01/28 16:08:31 INFO storage.BlockManagerInfo: Removed broadcast_245_piece0 on localhost:32777
in memory (size: 5.3 KB, free: 1045.8 MB)
17/01/28 16:08:31 INFO storage.BlockManagerInfo: Removed broadcast_244_piece0 on localhost:32777
in memory (size: 2.2 KB, free: 1045.8 MB)
17/01/28 16:08:33 INFO server.ServerConnector: Stopped ServerConnector@5e076e77{HTTP/1.1}{0.0.0.0:4040}
17/01/28 16:08:33 INFO handler.ContextHandler: Stopped o.s.j.s.ServletContextHandler@1f3726bc{/stages/stage/kill,null,UNAVAILABLE}
17/01/28 16:08:33 INFO handler.ContextHandler: Stopped o.s.j.s.ServletContextHandler@5dc6219c{/api,null,UNAVAILABLE}
17/01/28 16:08:33 INFO handler.ContextHandler: Stopped o.s.j.s.ServletContextHandler@2cfe82e8{/,null,UNAVAILABLE}
17/01/28 16:08:33 INFO handler.ContextHandler: Stopped o.s.j.s.ServletContextHandler@488eb260{/static,null,UNAVAILABLE}
17/01/28 16:08:33 INFO handler.ContextHandler: Stopped o.s.j.s.ServletContextHandler@120a1737{/executors/threadDump/json,null,UNAVAILABLE}
17/01/28 16:08:33 INFO handler.ContextHandler: Stopped o.s.j.s.ServletContextHandler@5bb54f84{/executors/threadDump,null,UNAVAILABLE}
17/01/28 16:08:33 INFO handler.ContextHandler: Stopped o.s.j.s.ServletContextHandler@87d9d24{/executors/json,null,UNAVAILABLE}
17/01/28 16:08:33 INFO handler.ContextHandler: Stopped o.s.j.s.ServletContextHandler@565181ef{/executors,null,UNAVAILABLE}
17/01/28 16:08:33 INFO handler.ContextHandler: Stopped o.s.j.s.ServletContextHandler@24dda560{/environment/json,null,UNAVAILABLE}
17/01/28 16:08:33 INFO handler.ContextHandler: Stopped o.s.j.s.ServletContextHandler@301c70e7{/environment,null,UNAVAILABLE}
17/01/28 16:08:33 INFO handler.ContextHandler: Stopped o.s.j.s.ServletContextHandler@54114c65{/storage/rdd/json,null,UNAVAILABLE}
17/01/28 16:08:33 INFO handler.ContextHandler: Stopped o.s.j.s.ServletContextHandler@168c9e5a{/storage/rdd,null,UNAVAILABLE}
17/01/28 16:08:33 INFO handler.ContextHandler: Stopped o.s.j.s.ServletContextHandler@18e18692{/storage/json,null,UNAVAILABLE}
17/01/28 16:08:33 INFO handler.ContextHandler: Stopped o.s.j.s.ServletContextHandler@7dd3374f{/storage,null,UNAVAILABLE}
17/01/28 16:08:33 INFO handler.ContextHandler: Stopped o.s.j.s.ServletContextHandler@466097f1{/stages/pool/json,null,UNAVAILABLE}
17/01/28 16:08:33 INFO handler.ContextHandler: Stopped o.s.j.s.ServletContextHandler@1a22982c{/stages/pool,null,UNAVAILABLE}
17/01/28 16:08:33 INFO handler.ContextHandler: Stopped o.s.j.s.ServletContextHandler@199f891e{/stages/stage/json,null,UNAVAILABLE}
17/01/28 16:08:33 INFO handler.ContextHandler: Stopped o.s.j.s.ServletContextHandler@4a8e30d2{/stages/stage,null,UNAVAILABLE}
17/01/28 16:08:33 INFO handler.ContextHandler: Stopped o.s.j.s.ServletContextHandler@2e4e5a1b{/stages/json,null,UNAVAILABLE}
17/01/28 16:08:33 INFO handler.ContextHandler: Stopped o.s.j.s.ServletContextHandler@791f442d{/stages,null,UNAVAILABLE}
17/01/28 16:08:33 INFO handler.ContextHandler: Stopped o.s.j.s.ServletContextHandler@7f159aff{/jobs/job/json,null,UNAVAILABLE}
17/01/28 16:08:33 INFO handler.ContextHandler: Stopped o.s.j.s.ServletContextHandler@34ba03db{/jobs/job,null,UNAVAILABLE}
17/01/28 16:08:33 INFO handler.ContextHandler: Stopped o.s.j.s.ServletContextHandler@3ba8782{/jobs/json,null,UNAVAILABLE}
17/01/28 16:08:33 INFO handler.ContextHandler: Stopped o.s.j.s.ServletContextHandler@1ba3b5ed{/jobs,null,UNAVAILABLE}
17/01/28 16:08:33 INFO ui.SparkUI: Stopped Spark web UI at http://localhost:4040
17/01/28 16:08:33 INFO spark.MapOutputTrackerMasterEndpoint: MapOutputTrackerMasterEndpoint
stopped!
17/01/28 16:08:33 INFO memory.MemoryStore: MemoryStore cleared
17/01/28 16:08:33 INFO storage.BlockManager: BlockManager stopped
17/01/28 16:08:33 INFO storage.BlockManagerMaster: BlockManagerMaster stopped
17/01/28 16:08:33 INFO scheduler.OutputCommitCoordinator$OutputCommitCoordinatorEndpoint:
OutputCommitCoordinator stopped!
17/01/28 16:08:33 INFO spark.SparkContext: Successfully stopped SparkContext
Running org.apache.sysml.test.integration.mlcontext.MLContextTest
Tests run: 161, Failures: 0, Errors: 0, Skipped: 0, Time elapsed: 101.058 sec - in org.apache.sysml.test.integration.mlcontext.MLContextTest
17/01/28 16:08:33 INFO util.ShutdownHookManager: Shutdown hook called
17/01/28 16:08:33 INFO util.ShutdownHookManager: Deleting directory /tmp/spark-92520fc8-3ad8-497d-83b7-9197cfee08cc
Running org.apache.sysml.test.integration.functions.append.AppendVectorTest
Tests run: 6, Failures: 0, Errors: 0, Skipped: 0, Time elapsed: 516.944 sec - in org.apache.sysml.test.integration.functions.append.AppendVectorTest
Running org.apache.sysml.test.integration.functions.quaternary.WeightedSigmoidTest
Tests run: 56, Failures: 0, Errors: 0, Skipped: 0, Time elapsed: 1,473.599 sec - in org.apache.sysml.test.integration.functions.quaternary.WeightedSigmoidTest
17/01/28 16:09:49 INFO util.ShutdownHookManager: Shutdown hook called
17/01/28 16:09:49 INFO util.ShutdownHookManager: Deleting directory /tmp/spark-c5f2a90c-18ff-4078-bd9b-114427c65bbf
Running org.apache.sysml.test.integration.applications.dml.ArimaDMLTest
Tests run: 2, Failures: 0, Errors: 0, Skipped: 0, Time elapsed: 305.54 sec - in org.apache.sysml.test.integration.applications.dml.ArimaDMLTest
Running org.apache.sysml.test.integration.functions.reorg.FullOrderTest
Tests run: 132, Failures: 0, Errors: 0, Skipped: 0, Time elapsed: 1,909.125 sec - in org.apache.sysml.test.integration.functions.reorg.FullOrderTest
Running org.apache.sysml.test.integration.applications.parfor.ParForCorrelationTest
Tests run: 12, Failures: 0, Errors: 0, Skipped: 0, Time elapsed: 369.738 sec - in org.apache.sysml.test.integration.applications.parfor.ParForCorrelationTest
Running org.apache.sysml.test.integration.functions.indexing.LeftIndexingTest
Tests run: 3, Failures: 0, Errors: 0, Skipped: 0, Time elapsed: 1,079.248 sec - in org.apache.sysml.test.integration.functions.indexing.LeftIndexingTest
Running org.apache.sysml.test.integration.applications.descriptivestats.UnivariateUnweightedScaleDenseTest
Tests run: 24, Failures: 0, Errors: 0, Skipped: 0, Time elapsed: 425.396 sec - in org.apache.sysml.test.integration.applications.descriptivestats.UnivariateUnweightedScaleDenseTest
Running org.apache.sysml.test.integration.applications.parfor.ParForCorrelationTestLarge
Tests run: 2, Failures: 0, Errors: 0, Skipped: 0, Time elapsed: 76.155 sec - in org.apache.sysml.test.integration.applications.parfor.ParForCorrelationTestLarge
Running org.apache.sysml.test.integration.functions.quaternary.WeightedDivMatrixMultTest
Tests run: 90, Failures: 0, Errors: 0, Skipped: 0, Time elapsed: 2,206.585 sec - in org.apache.sysml.test.integration.functions.quaternary.WeightedDivMatrixMultTest
17/01/28 16:19:40 INFO util.ShutdownHookManager: Shutdown hook called
17/01/28 16:19:40 INFO util.ShutdownHookManager: Deleting directory /tmp/spark-2e3a8c12-b995-44ba-932a-a134ad502d8a
Running org.apache.sysml.test.integration.applications.descriptivestats.UnivariateWeightedScaleDenseTest
Tests run: 24, Failures: 0, Errors: 0, Skipped: 0, Time elapsed: 446.161 sec - in org.apache.sysml.test.integration.applications.descriptivestats.UnivariateWeightedScaleDenseTest
Running org.apache.sysml.test.integration.applications.descriptivestats.UnivariateUnweightedScaleSparseTest
Tests run: 24, Failures: 0, Errors: 0, Skipped: 0, Time elapsed: 379.417 sec - in org.apache.sysml.test.integration.applications.descriptivestats.UnivariateUnweightedScaleSparseTest
Running org.apache.sysml.test.integration.applications.parfor.ParForNaiveBayesTest
Tests run: 10, Failures: 0, Errors: 0, Skipped: 0, Time elapsed: 806.306 sec - in org.apache.sysml.test.integration.applications.parfor.ParForNaiveBayesTest
Running org.apache.sysml.test.integration.functions.append.AppendChainTest
Tests run: 12, Failures: 0, Errors: 0, Skipped: 0, Time elapsed: 1,810.686 sec - in org.apache.sysml.test.integration.functions.append.AppendChainTest
Running org.apache.sysml.test.integration.applications.descriptivestats.UnivariateWeightedScaleSparseTest
Tests run: 24, Failures: 0, Errors: 0, Skipped: 0, Time elapsed: 446.292 sec - in org.apache.sysml.test.integration.applications.descriptivestats.UnivariateWeightedScaleSparseTest
Running org.apache.sysml.test.integration.functions.append.AppendMatrixTest
Tests run: 22, Failures: 0, Errors: 0, Skipped: 0, Time elapsed: 2,459.736 sec - in org.apache.sysml.test.integration.functions.append.AppendMatrixTest
Running org.apache.sysml.test.integration.applications.dml.HITSDMLTest
Tests run: 2, Failures: 0, Errors: 0, Skipped: 0, Time elapsed: 237.872 sec - in org.apache.sysml.test.integration.applications.dml.HITSDMLTest
Running org.apache.sysml.test.integration.applications.pydml.ArimaPyDMLTest
Tests run: 1, Failures: 0, Errors: 0, Skipped: 0, Time elapsed: 49.851 sec - in org.apache.sysml.test.integration.applications.pydml.ArimaPyDMLTest
Running org.apache.sysml.test.integration.applications.pydml.HITSPyDMLTest
Tests run: 1, Failures: 0, Errors: 0, Skipped: 0, Time elapsed: 77.616 sec - in org.apache.sysml.test.integration.applications.pydml.HITSPyDMLTest
Running org.apache.sysml.test.integration.applications.dml.LinearRegressionDMLTest
Tests run: 14, Failures: 0, Errors: 0, Skipped: 0, Time elapsed: 101.813 sec - in org.apache.sysml.test.integration.applications.dml.LinearRegressionDMLTest
Running org.apache.sysml.test.integration.applications.pydml.CsplineDSPyDMLTest
Tests run: 3, Failures: 0, Errors: 0, Skipped: 0, Time elapsed: 6.931 sec - in org.apache.sysml.test.integration.applications.pydml.CsplineDSPyDMLTest
Running org.apache.sysml.test.integration.applications.pydml.LinearLogRegPyDMLTest
Tests run: 7, Failures: 1, Errors: 0, Skipped: 0, Time elapsed: 78.84 sec <<< FAILURE!
- in org.apache.sysml.test.integration.applications.pydml.LinearLogRegPyDMLTest
testLinearLogRegPyDml[3](org.apache.sysml.test.integration.applications.pydml.LinearLogRegPyDMLTest)
 Time elapsed: 31.958 sec  <<< FAILURE!
java.lang.AssertionError: Detailed matrices characteristics:
!  wR<->wSYSTEMML # stored values in wSYSTEMML: 1000
!  wR<->wSYSTEMML # stored values in wR: 1000
!  wR<->wSYSTEMML identical values(z=0): 0
!  wR<->wSYSTEMML wrong values(z=1.0E-14): 1000
!  wR<->wSYSTEMML min error: 1.5888668158936525E-10
!  wR<->wSYSTEMML max error: 8.055393015849593E-5

	at org.junit.Assert.fail(Assert.java:88)
	at org.junit.Assert.assertTrue(Assert.java:41)
	at org.apache.sysml.test.utils.TestUtils.displayAssertionBuffer(TestUtils.java:1057)
	at org.apache.sysml.test.integration.AutomatedTestBase.tearDown(AutomatedTestBase.java:1472)
	at sun.reflect.GeneratedMethodAccessor4.invoke(Unknown Source)
	at sun.reflect.DelegatingMethodAccessorImpl.invoke(DelegatingMethodAccessorImpl.java:43)
	at java.lang.reflect.Method.invoke(Method.java:497)
	at org.junit.runners.model.FrameworkMethod$1.runReflectiveCall(FrameworkMethod.java:47)
	at org.junit.internal.runners.model.ReflectiveCallable.run(ReflectiveCallable.java:12)
	at org.junit.runners.model.FrameworkMethod.invokeExplosively(FrameworkMethod.java:44)
	at org.junit.internal.runners.statements.RunAfters.evaluate(RunAfters.java:33)
	at org.junit.runners.ParentRunner.runLeaf(ParentRunner.java:271)
	at org.junit.runners.BlockJUnit4ClassRunner.runChild(BlockJUnit4ClassRunner.java:70)
	at org.junit.runners.BlockJUnit4ClassRunner.runChild(BlockJUnit4ClassRunner.java:50)
	at org.junit.runners.ParentRunner$3.run(ParentRunner.java:238)
	at org.apache.maven.surefire.junitcore.pc.Scheduler$1.run(Scheduler.java:318)
	at org.apache.maven.surefire.junitcore.pc.InvokerStrategy.schedule(InvokerStrategy.java:41)
	at org.apache.maven.surefire.junitcore.pc.Scheduler.schedule(Scheduler.java:274)
	at org.junit.runners.ParentRunner.runChildren(ParentRunner.java:236)
	at org.junit.runners.ParentRunner.access$000(ParentRunner.java:53)
	at org.junit.runners.ParentRunner$2.evaluate(ParentRunner.java:229)
	at org.junit.runners.ParentRunner.run(ParentRunner.java:309)
	at org.junit.runners.Suite.runChild(Suite.java:127)
	at org.junit.runners.Suite.runChild(Suite.java:26)
	at org.junit.runners.ParentRunner$3.run(ParentRunner.java:238)
	at org.apache.maven.surefire.junitcore.pc.Scheduler$1.run(Scheduler.java:318)
	at org.apache.maven.surefire.junitcore.pc.InvokerStrategy.schedule(InvokerStrategy.java:41)
	at org.apache.maven.surefire.junitcore.pc.Scheduler.schedule(Scheduler.java:274)
	at org.junit.runners.ParentRunner.runChildren(ParentRunner.java:236)
	at org.junit.runners.ParentRunner.access$000(ParentRunner.java:53)
	at org.junit.runners.ParentRunner$2.evaluate(ParentRunner.java:229)
	at org.junit.runners.ParentRunner.run(ParentRunner.java:309)
	at org.junit.runners.Suite.runChild(Suite.java:127)
	at org.junit.runners.Suite.runChild(Suite.java:26)
	at org.junit.runners.ParentRunner$3.run(ParentRunner.java:238)
	at org.apache.maven.surefire.junitcore.pc.Scheduler$1.run(Scheduler.java:318)
	at org.apache.maven.surefire.junitcore.pc.InvokerStrategy.schedule(InvokerStrategy.java:41)
	at org.apache.maven.surefire.junitcore.pc.Scheduler.schedule(Scheduler.java:274)
	at org.junit.runners.ParentRunner.runChildren(ParentRunner.java:236)
	at org.junit.runners.ParentRunner.access$000(ParentRunner.java:53)
	at org.junit.runners.ParentRunner$2.evaluate(ParentRunner.java:229)
	at org.junit.runners.ParentRunner.run(ParentRunner.java:309)
	at org.junit.runners.Suite.runChild(Suite.java:127)
	at org.junit.runners.Suite.runChild(Suite.java:26)
	at org.junit.runners.ParentRunner$3.run(ParentRunner.java:238)
	at org.apache.maven.surefire.junitcore.pc.Scheduler$1.run(Scheduler.java:318)
	at java.util.concurrent.Executors$RunnableAdapter.call(Executors.java:511)
	at java.util.concurrent.FutureTask.run(FutureTask.java:266)
	at java.util.concurrent.ThreadPoolExecutor.runWorker(ThreadPoolExecutor.java:1142)
	at java.util.concurrent.ThreadPoolExecutor$Worker.run(ThreadPoolExecutor.java:617)
	at java.lang.Thread.run(Thread.java:745)

Running org.apache.sysml.test.integration.applications.pydml.NaiveBayesPyDMLTest
Tests run: 6, Failures: 0, Errors: 0, Skipped: 0, Time elapsed: 81.269 sec - in org.apache.sysml.test.integration.applications.pydml.NaiveBayesPyDMLTest
Running org.apache.sysml.test.integration.applications.dml.CsplineCGDMLTest
Tests run: 6, Failures: 0, Errors: 0, Skipped: 0, Time elapsed: 45.109 sec - in org.apache.sysml.test.integration.applications.dml.CsplineCGDMLTest
Running org.apache.sysml.test.integration.applications.dml.L2SVMDMLTest
Tests run: 18, Failures: 0, Errors: 0, Skipped: 0, Time elapsed: 129.115 sec - in org.apache.sysml.test.integration.applications.dml.L2SVMDMLTest
Running org.apache.sysml.test.integration.applications.pydml.MDABivariateStatsPyDMLTest
Tests run: 4, Failures: 0, Errors: 0, Skipped: 0, Time elapsed: 293.534 sec - in org.apache.sysml.test.integration.applications.pydml.MDABivariateStatsPyDMLTest
Running org.apache.sysml.test.integration.applications.pydml.PageRankPyDMLTest
Tests run: 3, Failures: 0, Errors: 0, Skipped: 0, Time elapsed: 6.226 sec - in org.apache.sysml.test.integration.applications.pydml.PageRankPyDMLTest
Running org.apache.sysml.test.integration.applications.pydml.NaiveBayesParforPyDMLTest
Tests run: 6, Failures: 0, Errors: 0, Skipped: 0, Time elapsed: 82.652 sec - in org.apache.sysml.test.integration.applications.pydml.NaiveBayesParforPyDMLTest
Running org.apache.sysml.test.integration.applications.dml.NaiveBayesDMLTest
Tests run: 12, Failures: 0, Errors: 0, Skipped: 0, Time elapsed: 162.915 sec - in org.apache.sysml.test.integration.applications.dml.NaiveBayesDMLTest
Running org.apache.sysml.test.integration.applications.dml.MDABivariateStatsDMLTest
Tests run: 8, Failures: 0, Errors: 0, Skipped: 0, Time elapsed: 606.658 sec - in org.apache.sysml.test.integration.applications.dml.MDABivariateStatsDMLTest
Running org.apache.sysml.test.integration.applications.dml.PageRankDMLTest
Tests run: 6, Failures: 0, Errors: 0, Skipped: 0, Time elapsed: 12.072 sec - in org.apache.sysml.test.integration.applications.dml.PageRankDMLTest
Running org.apache.sysml.test.integration.applications.pydml.GLMPyDMLTest
Tests run: 30, Failures: 0, Errors: 0, Skipped: 0, Time elapsed: 585.045 sec - in org.apache.sysml.test.integration.applications.pydml.GLMPyDMLTest
Running org.apache.sysml.test.integration.applications.pydml.MultiClassSVMPyDMLTest
Tests run: 9, Failures: 0, Errors: 0, Skipped: 0, Time elapsed: 88.229 sec - in org.apache.sysml.test.integration.applications.pydml.MultiClassSVMPyDMLTest
Running org.apache.sysml.test.integration.applications.dml.ID3DMLTest
Tests run: 4, Failures: 0, Errors: 0, Skipped: 0, Time elapsed: 825.974 sec - in org.apache.sysml.test.integration.applications.dml.ID3DMLTest
Running org.apache.sysml.test.integration.applications.dml.GLMDMLTest
Tests run: 60, Failures: 0, Errors: 0, Skipped: 0, Time elapsed: 2,887.564 sec - in org.apache.sysml.test.integration.applications.dml.GLMDMLTest
Running org.apache.sysml.test.integration.applications.pydml.CsplineCGPyDMLTest
Tests run: 3, Failures: 0, Errors: 0, Skipped: 0, Time elapsed: 6.508 sec - in org.apache.sysml.test.integration.applications.pydml.CsplineCGPyDMLTest
Running org.apache.sysml.test.integration.applications.pydml.WelchTPyDMLTest
Tests run: 3, Failures: 0, Errors: 0, Skipped: 0, Time elapsed: 6.698 sec - in org.apache.sysml.test.integration.applications.pydml.WelchTPyDMLTest
Running org.apache.sysml.test.integration.applications.dml.MultiClassSVMDMLTest
Tests run: 18, Failures: 0, Errors: 0, Skipped: 0, Time elapsed: 176.222 sec - in org.apache.sysml.test.integration.applications.dml.MultiClassSVMDMLTest
Running org.apache.sysml.test.integration.applications.dml.CsplineDSDMLTest
Tests run: 6, Failures: 0, Errors: 0, Skipped: 0, Time elapsed: 41.179 sec - in org.apache.sysml.test.integration.applications.dml.CsplineDSDMLTest
Running org.apache.sysml.test.integration.applications.pydml.ApplyTransformPyDMLTest
Tests run: 7, Failures: 0, Errors: 0, Skipped: 0, Time elapsed: 1.319 sec - in org.apache.sysml.test.integration.applications.pydml.ApplyTransformPyDMLTest
Running org.apache.sysml.test.integration.applications.dml.NaiveBayesParforDMLTest
Tests run: 12, Failures: 0, Errors: 0, Skipped: 0, Time elapsed: 163.972 sec - in org.apache.sysml.test.integration.applications.dml.NaiveBayesParforDMLTest
Running org.apache.sysml.test.integration.applications.pydml.L2SVMPyDMLTest
Tests run: 9, Failures: 0, Errors: 0, Skipped: 0, Time elapsed: 64.486 sec - in org.apache.sysml.test.integration.applications.pydml.L2SVMPyDMLTest
Running org.apache.sysml.test.integration.applications.pydml.LinearRegressionPyDMLTest
Tests run: 7, Failures: 0, Errors: 0, Skipped: 0, Time elapsed: 52.175 sec - in org.apache.sysml.test.integration.applications.pydml.LinearRegressionPyDMLTest
Running org.apache.sysml.test.integration.applications.dml.LinearLogRegDMLTest
Tests run: 14, Failures: 0, Errors: 0, Skipped: 0, Time elapsed: 122.398 sec - in org.apache.sysml.test.integration.applications.dml.LinearLogRegDMLTest
Running org.apache.sysml.test.integration.applications.dml.GNMFDMLTest
Tests run: 6, Failures: 0, Errors: 0, Skipped: 0, Time elapsed: 181.957 sec - in org.apache.sysml.test.integration.applications.dml.GNMFDMLTest
Running org.apache.sysml.test.integration.applications.dml.WelchTDMLTest
Tests run: 6, Failures: 0, Errors: 0, Skipped: 0, Time elapsed: 13.454 sec - in org.apache.sysml.test.integration.applications.dml.WelchTDMLTest
Running org.apache.sysml.test.integration.applications.dml.ApplyTransformDMLTest
Tests run: 14, Failures: 0, Errors: 0, Skipped: 0, Time elapsed: 37.664 sec - in org.apache.sysml.test.integration.applications.dml.ApplyTransformDMLTest
Running org.apache.sysml.test.integration.applications.pydml.ID3PyDMLTest
Tests run: 2, Failures: 0, Errors: 0, Skipped: 0, Time elapsed: 332.647 sec - in org.apache.sysml.test.integration.applications.pydml.ID3PyDMLTest
Running org.apache.sysml.test.integration.applications.pydml.GNMFPyDMLTest
Tests run: 3, Failures: 0, Errors: 0, Skipped: 0, Time elapsed: 56.834 sec - in org.apache.sysml.test.integration.applications.pydml.GNMFPyDMLTest

Results :

Failed tests: 
  LinearLogRegPyDMLTest>AutomatedTestBase.tearDown:1472 Detailed matrices characteristics:
!  wR<->wSYSTEMML # stored values in wSYSTEMML: 1000
!  wR<->wSYSTEMML # stored values in wR: 1000
!  wR<->wSYSTEMML identical values(z=0): 0
!  wR<->wSYSTEMML wrong values(z=1.0E-14): 1000
!  wR<->wSYSTEMML min error: 1.5888668158936525E-10
!  wR<->wSYSTEMML max error: 8.055393015849593E-5


Tests run: 6541, Failures: 1, Errors: 0, Skipped: 0

[INFO] 
[INFO] --- maven-failsafe-plugin:2.17:verify (default) @ systemml ---
[INFO] Failsafe report directory: <https://sparktc.ibmcloud.com/jenkins/job/SystemML-DailyTest/ws/target/failsafe-reports>
[INFO] ------------------------------------------------------------------------
[INFO] BUILD FAILURE
[INFO] ------------------------------------------------------------------------
[INFO] Total time: 03:40 h
[INFO] Finished at: 2017-01-28T18:16:23-06:00
[INFO] Final Memory: 62M/2295M
[INFO] ------------------------------------------------------------------------
[ERROR] Failed to execute goal org.apache.maven.plugins:maven-failsafe-plugin:2.17:verify
(default) on project systemml: There are test failures.
[ERROR] 
[ERROR] Please refer to <https://sparktc.ibmcloud.com/jenkins/job/SystemML-DailyTest/ws/target/failsafe-reports>
for the individual test results.
[ERROR] -> [Help 1]
[ERROR] 
[ERROR] To see the full stack trace of the errors, re-run Maven with the -e switch.
[ERROR] Re-run Maven using the -X switch to enable full debug logging.
[ERROR] 
[ERROR] For more information about the errors and possible solutions, please read the following
articles:
[ERROR] [Help 1] http://cwiki.apache.org/confluence/display/MAVEN/MojoFailureException
Build step 'Execute shell' marked build as failure
Run condition [Always] enabling perform for step [[]]

Mime
View raw message