systemml-dev mailing list archives

Site index · List index
Message view « Date » · « Thread »
Top « Date » · « Thread »
From jenk...@spark.tc
Subject Build failed in Jenkins: SystemML-DailyTest #725
Date Tue, 03 Jan 2017 00:15:23 GMT
See <https://sparktc.ibmcloud.com/jenkins/job/SystemML-DailyTest/725/>

------------------------------------------
[...truncated 10019 lines...]
17/01/02 16:14:56 INFO handler.ContextHandler: stopped o.s.j.s.ServletContextHandler{/static/sql,null}
17/01/02 16:14:56 INFO handler.ContextHandler: stopped o.s.j.s.ServletContextHandler{/SQL27/execution/json,null}
17/01/02 16:14:56 INFO handler.ContextHandler: stopped o.s.j.s.ServletContextHandler{/SQL27/execution,null}
17/01/02 16:14:56 INFO handler.ContextHandler: stopped o.s.j.s.ServletContextHandler{/SQL27/json,null}
17/01/02 16:14:56 INFO handler.ContextHandler: stopped o.s.j.s.ServletContextHandler{/SQL27,null}
17/01/02 16:14:56 INFO handler.ContextHandler: stopped o.s.j.s.ServletContextHandler{/static/sql,null}
17/01/02 16:14:56 INFO handler.ContextHandler: stopped o.s.j.s.ServletContextHandler{/SQL26/execution/json,null}
17/01/02 16:14:56 INFO handler.ContextHandler: stopped o.s.j.s.ServletContextHandler{/SQL26/execution,null}
17/01/02 16:14:56 INFO handler.ContextHandler: stopped o.s.j.s.ServletContextHandler{/SQL26/json,null}
17/01/02 16:14:56 INFO handler.ContextHandler: stopped o.s.j.s.ServletContextHandler{/SQL26,null}
17/01/02 16:14:56 INFO handler.ContextHandler: stopped o.s.j.s.ServletContextHandler{/static/sql,null}
17/01/02 16:14:56 INFO handler.ContextHandler: stopped o.s.j.s.ServletContextHandler{/SQL25/execution/json,null}
17/01/02 16:14:56 INFO handler.ContextHandler: stopped o.s.j.s.ServletContextHandler{/SQL25/execution,null}
17/01/02 16:14:56 INFO handler.ContextHandler: stopped o.s.j.s.ServletContextHandler{/SQL25/json,null}
17/01/02 16:14:56 INFO handler.ContextHandler: stopped o.s.j.s.ServletContextHandler{/SQL25,null}
17/01/02 16:14:56 INFO handler.ContextHandler: stopped o.s.j.s.ServletContextHandler{/static/sql,null}
17/01/02 16:14:56 INFO handler.ContextHandler: stopped o.s.j.s.ServletContextHandler{/SQL24/execution/json,null}
17/01/02 16:14:56 INFO handler.ContextHandler: stopped o.s.j.s.ServletContextHandler{/SQL24/execution,null}
17/01/02 16:14:56 INFO handler.ContextHandler: stopped o.s.j.s.ServletContextHandler{/SQL24/json,null}
17/01/02 16:14:56 INFO handler.ContextHandler: stopped o.s.j.s.ServletContextHandler{/SQL24,null}
17/01/02 16:14:56 INFO handler.ContextHandler: stopped o.s.j.s.ServletContextHandler{/static/sql,null}
17/01/02 16:14:56 INFO handler.ContextHandler: stopped o.s.j.s.ServletContextHandler{/SQL23/execution/json,null}
17/01/02 16:14:56 INFO handler.ContextHandler: stopped o.s.j.s.ServletContextHandler{/SQL23/execution,null}
17/01/02 16:14:56 INFO handler.ContextHandler: stopped o.s.j.s.ServletContextHandler{/SQL23/json,null}
17/01/02 16:14:56 INFO handler.ContextHandler: stopped o.s.j.s.ServletContextHandler{/SQL23,null}
17/01/02 16:14:56 INFO handler.ContextHandler: stopped o.s.j.s.ServletContextHandler{/static/sql,null}
17/01/02 16:14:56 INFO handler.ContextHandler: stopped o.s.j.s.ServletContextHandler{/SQL22/execution/json,null}
17/01/02 16:14:56 INFO handler.ContextHandler: stopped o.s.j.s.ServletContextHandler{/SQL22/execution,null}
17/01/02 16:14:56 INFO handler.ContextHandler: stopped o.s.j.s.ServletContextHandler{/SQL22/json,null}
17/01/02 16:14:56 INFO handler.ContextHandler: stopped o.s.j.s.ServletContextHandler{/SQL22,null}
17/01/02 16:14:56 INFO handler.ContextHandler: stopped o.s.j.s.ServletContextHandler{/static/sql,null}
17/01/02 16:14:56 INFO handler.ContextHandler: stopped o.s.j.s.ServletContextHandler{/SQL21/execution/json,null}
17/01/02 16:14:56 INFO handler.ContextHandler: stopped o.s.j.s.ServletContextHandler{/SQL21/execution,null}
17/01/02 16:14:56 INFO handler.ContextHandler: stopped o.s.j.s.ServletContextHandler{/SQL21/json,null}
17/01/02 16:14:56 INFO handler.ContextHandler: stopped o.s.j.s.ServletContextHandler{/SQL21,null}
17/01/02 16:14:56 INFO handler.ContextHandler: stopped o.s.j.s.ServletContextHandler{/static/sql,null}
17/01/02 16:14:56 INFO handler.ContextHandler: stopped o.s.j.s.ServletContextHandler{/SQL20/execution/json,null}
17/01/02 16:14:56 INFO handler.ContextHandler: stopped o.s.j.s.ServletContextHandler{/SQL20/execution,null}
17/01/02 16:14:56 INFO handler.ContextHandler: stopped o.s.j.s.ServletContextHandler{/SQL20/json,null}
17/01/02 16:14:56 INFO handler.ContextHandler: stopped o.s.j.s.ServletContextHandler{/SQL20,null}
17/01/02 16:14:56 INFO handler.ContextHandler: stopped o.s.j.s.ServletContextHandler{/static/sql,null}
17/01/02 16:14:56 INFO handler.ContextHandler: stopped o.s.j.s.ServletContextHandler{/SQL19/execution/json,null}
17/01/02 16:14:56 INFO handler.ContextHandler: stopped o.s.j.s.ServletContextHandler{/SQL19/execution,null}
17/01/02 16:14:56 INFO handler.ContextHandler: stopped o.s.j.s.ServletContextHandler{/SQL19/json,null}
17/01/02 16:14:56 INFO handler.ContextHandler: stopped o.s.j.s.ServletContextHandler{/SQL19,null}
17/01/02 16:14:56 INFO handler.ContextHandler: stopped o.s.j.s.ServletContextHandler{/static/sql,null}
17/01/02 16:14:56 INFO handler.ContextHandler: stopped o.s.j.s.ServletContextHandler{/SQL18/execution/json,null}
17/01/02 16:14:56 INFO handler.ContextHandler: stopped o.s.j.s.ServletContextHandler{/SQL18/execution,null}
17/01/02 16:14:56 INFO handler.ContextHandler: stopped o.s.j.s.ServletContextHandler{/SQL18/json,null}
17/01/02 16:14:56 INFO handler.ContextHandler: stopped o.s.j.s.ServletContextHandler{/SQL18,null}
17/01/02 16:14:56 INFO handler.ContextHandler: stopped o.s.j.s.ServletContextHandler{/static/sql,null}
17/01/02 16:14:56 INFO handler.ContextHandler: stopped o.s.j.s.ServletContextHandler{/SQL17/execution/json,null}
17/01/02 16:14:56 INFO handler.ContextHandler: stopped o.s.j.s.ServletContextHandler{/SQL17/execution,null}
17/01/02 16:14:56 INFO handler.ContextHandler: stopped o.s.j.s.ServletContextHandler{/SQL17/json,null}
17/01/02 16:14:56 INFO handler.ContextHandler: stopped o.s.j.s.ServletContextHandler{/SQL17,null}
17/01/02 16:14:56 INFO handler.ContextHandler: stopped o.s.j.s.ServletContextHandler{/static/sql,null}
17/01/02 16:14:56 INFO handler.ContextHandler: stopped o.s.j.s.ServletContextHandler{/SQL16/execution/json,null}
17/01/02 16:14:56 INFO handler.ContextHandler: stopped o.s.j.s.ServletContextHandler{/SQL16/execution,null}
17/01/02 16:14:56 INFO handler.ContextHandler: stopped o.s.j.s.ServletContextHandler{/SQL16/json,null}
17/01/02 16:14:56 INFO handler.ContextHandler: stopped o.s.j.s.ServletContextHandler{/SQL16,null}
17/01/02 16:14:56 INFO handler.ContextHandler: stopped o.s.j.s.ServletContextHandler{/static/sql,null}
17/01/02 16:14:56 INFO handler.ContextHandler: stopped o.s.j.s.ServletContextHandler{/SQL15/execution/json,null}
17/01/02 16:14:56 INFO handler.ContextHandler: stopped o.s.j.s.ServletContextHandler{/SQL15/execution,null}
17/01/02 16:14:56 INFO handler.ContextHandler: stopped o.s.j.s.ServletContextHandler{/SQL15/json,null}
17/01/02 16:14:56 INFO handler.ContextHandler: stopped o.s.j.s.ServletContextHandler{/SQL15,null}
17/01/02 16:14:56 INFO handler.ContextHandler: stopped o.s.j.s.ServletContextHandler{/static/sql,null}
17/01/02 16:14:56 INFO handler.ContextHandler: stopped o.s.j.s.ServletContextHandler{/SQL14/execution/json,null}
17/01/02 16:14:56 INFO handler.ContextHandler: stopped o.s.j.s.ServletContextHandler{/SQL14/execution,null}
17/01/02 16:14:56 INFO handler.ContextHandler: stopped o.s.j.s.ServletContextHandler{/SQL14/json,null}
17/01/02 16:14:56 INFO handler.ContextHandler: stopped o.s.j.s.ServletContextHandler{/SQL14,null}
17/01/02 16:14:56 INFO handler.ContextHandler: stopped o.s.j.s.ServletContextHandler{/static/sql,null}
17/01/02 16:14:56 INFO handler.ContextHandler: stopped o.s.j.s.ServletContextHandler{/SQL13/execution/json,null}
17/01/02 16:14:56 INFO handler.ContextHandler: stopped o.s.j.s.ServletContextHandler{/SQL13/execution,null}
17/01/02 16:14:56 INFO handler.ContextHandler: stopped o.s.j.s.ServletContextHandler{/SQL13/json,null}
17/01/02 16:14:56 INFO handler.ContextHandler: stopped o.s.j.s.ServletContextHandler{/SQL13,null}
17/01/02 16:14:56 INFO handler.ContextHandler: stopped o.s.j.s.ServletContextHandler{/static/sql,null}
17/01/02 16:14:56 INFO handler.ContextHandler: stopped o.s.j.s.ServletContextHandler{/SQL12/execution/json,null}
17/01/02 16:14:56 INFO handler.ContextHandler: stopped o.s.j.s.ServletContextHandler{/SQL12/execution,null}
17/01/02 16:14:56 INFO handler.ContextHandler: stopped o.s.j.s.ServletContextHandler{/SQL12/json,null}
17/01/02 16:14:56 INFO handler.ContextHandler: stopped o.s.j.s.ServletContextHandler{/SQL12,null}
17/01/02 16:14:56 INFO handler.ContextHandler: stopped o.s.j.s.ServletContextHandler{/metrics/json,null}
17/01/02 16:14:56 INFO handler.ContextHandler: stopped o.s.j.s.ServletContextHandler{/stages/stage/kill,null}
17/01/02 16:14:56 INFO handler.ContextHandler: stopped o.s.j.s.ServletContextHandler{/api,null}
17/01/02 16:14:56 INFO handler.ContextHandler: stopped o.s.j.s.ServletContextHandler{/,null}
17/01/02 16:14:56 INFO handler.ContextHandler: stopped o.s.j.s.ServletContextHandler{/static,null}
17/01/02 16:14:56 INFO handler.ContextHandler: stopped o.s.j.s.ServletContextHandler{/executors/threadDump/json,null}
17/01/02 16:14:56 INFO handler.ContextHandler: stopped o.s.j.s.ServletContextHandler{/executors/threadDump,null}
17/01/02 16:14:56 INFO handler.ContextHandler: stopped o.s.j.s.ServletContextHandler{/executors/json,null}
17/01/02 16:14:56 INFO handler.ContextHandler: stopped o.s.j.s.ServletContextHandler{/executors,null}
17/01/02 16:14:56 INFO handler.ContextHandler: stopped o.s.j.s.ServletContextHandler{/environment/json,null}
17/01/02 16:14:56 INFO handler.ContextHandler: stopped o.s.j.s.ServletContextHandler{/environment,null}
17/01/02 16:14:56 INFO handler.ContextHandler: stopped o.s.j.s.ServletContextHandler{/storage/rdd/json,null}
17/01/02 16:14:56 INFO handler.ContextHandler: stopped o.s.j.s.ServletContextHandler{/storage/rdd,null}
17/01/02 16:14:56 INFO handler.ContextHandler: stopped o.s.j.s.ServletContextHandler{/storage/json,null}
17/01/02 16:14:56 INFO handler.ContextHandler: stopped o.s.j.s.ServletContextHandler{/storage,null}
17/01/02 16:14:56 INFO handler.ContextHandler: stopped o.s.j.s.ServletContextHandler{/stages/pool/json,null}
17/01/02 16:14:56 INFO handler.ContextHandler: stopped o.s.j.s.ServletContextHandler{/stages/pool,null}
17/01/02 16:14:56 INFO handler.ContextHandler: stopped o.s.j.s.ServletContextHandler{/stages/stage/json,null}
17/01/02 16:14:56 INFO handler.ContextHandler: stopped o.s.j.s.ServletContextHandler{/stages/stage,null}
17/01/02 16:14:56 INFO handler.ContextHandler: stopped o.s.j.s.ServletContextHandler{/stages/json,null}
17/01/02 16:14:56 INFO handler.ContextHandler: stopped o.s.j.s.ServletContextHandler{/stages,null}
17/01/02 16:14:56 INFO handler.ContextHandler: stopped o.s.j.s.ServletContextHandler{/jobs/job/json,null}
17/01/02 16:14:56 INFO handler.ContextHandler: stopped o.s.j.s.ServletContextHandler{/jobs/job,null}
17/01/02 16:14:56 INFO handler.ContextHandler: stopped o.s.j.s.ServletContextHandler{/jobs/json,null}
17/01/02 16:14:56 INFO handler.ContextHandler: stopped o.s.j.s.ServletContextHandler{/jobs,null}
17/01/02 16:14:56 INFO ui.SparkUI: Stopped Spark web UI at http://localhost:4040
17/01/02 16:14:56 INFO spark.MapOutputTrackerMasterEndpoint: MapOutputTrackerMasterEndpoint
stopped!
17/01/02 16:14:56 INFO storage.MemoryStore: MemoryStore cleared
17/01/02 16:14:56 INFO storage.BlockManager: BlockManager stopped
17/01/02 16:14:56 INFO storage.BlockManagerMaster: BlockManagerMaster stopped
17/01/02 16:14:56 INFO scheduler.OutputCommitCoordinator$OutputCommitCoordinatorEndpoint:
OutputCommitCoordinator stopped!
17/01/02 16:14:56 INFO remote.RemoteActorRefProvider$RemotingTerminator: Shutting down remote
daemon.
17/01/02 16:14:56 INFO remote.RemoteActorRefProvider$RemotingTerminator: Remote daemon shut
down; proceeding with flushing remote transports.
17/01/02 16:14:56 INFO remote.RemoteActorRefProvider$RemotingTerminator: Remoting shut down.
17/01/02 16:14:56 INFO spark.SparkContext: Successfully stopped SparkContext
Running org.apache.sysml.test.integration.mlcontext.MLContextTest
Tests run: 140, Failures: 0, Errors: 0, Skipped: 0, Time elapsed: 77.898 sec - in org.apache.sysml.test.integration.mlcontext.MLContextTest
17/01/02 16:14:56 INFO util.ShutdownHookManager: Shutdown hook called
17/01/02 16:14:56 INFO util.ShutdownHookManager: Deleting directory /tmp/spark-d33759d7-3cca-4f0d-b5be-5a45a4cb381b
Running org.apache.sysml.test.integration.functions.quaternary.WeightedSigmoidTest
Tests run: 56, Failures: 0, Errors: 0, Skipped: 0, Time elapsed: 1,432.186 sec - in org.apache.sysml.test.integration.functions.quaternary.WeightedSigmoidTest
17/01/02 16:16:01 INFO util.ShutdownHookManager: Shutdown hook called
17/01/02 16:16:01 INFO util.ShutdownHookManager: Deleting directory /tmp/spark-cf2e7960-480b-4b70-bc4c-93ebac02b8bd
Running org.apache.sysml.test.integration.applications.dml.ArimaDMLTest
Tests run: 2, Failures: 0, Errors: 0, Skipped: 0, Time elapsed: 310.785 sec - in org.apache.sysml.test.integration.applications.dml.ArimaDMLTest
Running org.apache.sysml.test.integration.functions.reorg.FullOrderTest
Tests run: 132, Failures: 0, Errors: 0, Skipped: 0, Time elapsed: 1,873.619 sec - in org.apache.sysml.test.integration.functions.reorg.FullOrderTest
Running org.apache.sysml.test.integration.functions.append.AppendVectorTest
Tests run: 6, Failures: 0, Errors: 0, Skipped: 0, Time elapsed: 747.946 sec - in org.apache.sysml.test.integration.functions.append.AppendVectorTest
Running org.apache.sysml.test.integration.applications.parfor.ParForCorrelationTest
Tests run: 12, Failures: 0, Errors: 0, Skipped: 0, Time elapsed: 362.165 sec - in org.apache.sysml.test.integration.applications.parfor.ParForCorrelationTest
Running org.apache.sysml.test.integration.functions.indexing.LeftIndexingTest
Tests run: 3, Failures: 0, Errors: 0, Skipped: 0, Time elapsed: 1,040.682 sec - in org.apache.sysml.test.integration.functions.indexing.LeftIndexingTest
Running org.apache.sysml.test.integration.applications.descriptivestats.UnivariateUnweightedScaleDenseTest
Tests run: 24, Failures: 0, Errors: 0, Skipped: 0, Time elapsed: 434.213 sec - in org.apache.sysml.test.integration.applications.descriptivestats.UnivariateUnweightedScaleDenseTest
Running org.apache.sysml.test.integration.applications.parfor.ParForCorrelationTestLarge
Tests run: 2, Failures: 0, Errors: 0, Skipped: 0, Time elapsed: 91.401 sec - in org.apache.sysml.test.integration.applications.parfor.ParForCorrelationTestLarge
Running org.apache.sysml.test.integration.functions.quaternary.WeightedDivMatrixMultTest
Tests run: 90, Failures: 0, Errors: 0, Skipped: 0, Time elapsed: 2,189.31 sec - in org.apache.sysml.test.integration.functions.quaternary.WeightedDivMatrixMultTest
17/01/02 16:27:01 INFO util.ShutdownHookManager: Shutdown hook called
17/01/02 16:27:01 INFO util.ShutdownHookManager: Deleting directory /tmp/spark-09d4c44b-fc63-44ac-864a-3b4b4a5eafcc
Running org.apache.sysml.test.integration.applications.descriptivestats.UnivariateWeightedScaleDenseTest
Tests run: 24, Failures: 0, Errors: 0, Skipped: 0, Time elapsed: 475.513 sec - in org.apache.sysml.test.integration.applications.descriptivestats.UnivariateWeightedScaleDenseTest
Running org.apache.sysml.test.integration.applications.parfor.ParForNaiveBayesTest
Tests run: 10, Failures: 0, Errors: 0, Skipped: 0, Time elapsed: 827.013 sec - in org.apache.sysml.test.integration.applications.parfor.ParForNaiveBayesTest
Running org.apache.sysml.test.integration.applications.descriptivestats.UnivariateUnweightedScaleSparseTest
Tests run: 24, Failures: 0, Errors: 0, Skipped: 0, Time elapsed: 397.298 sec - in org.apache.sysml.test.integration.applications.descriptivestats.UnivariateUnweightedScaleSparseTest
Running org.apache.sysml.test.integration.functions.append.AppendChainTest
Tests run: 12, Failures: 0, Errors: 0, Skipped: 0, Time elapsed: 1,848.726 sec - in org.apache.sysml.test.integration.functions.append.AppendChainTest
Running org.apache.sysml.test.integration.applications.descriptivestats.UnivariateWeightedScaleSparseTest
Tests run: 24, Failures: 0, Errors: 0, Skipped: 0, Time elapsed: 440.816 sec - in org.apache.sysml.test.integration.applications.descriptivestats.UnivariateWeightedScaleSparseTest
Running org.apache.sysml.test.integration.functions.append.AppendMatrixTest
Tests run: 22, Failures: 0, Errors: 0, Skipped: 0, Time elapsed: 2,655.095 sec - in org.apache.sysml.test.integration.functions.append.AppendMatrixTest
Running org.apache.sysml.test.integration.applications.dml.HITSDMLTest
Tests run: 2, Failures: 0, Errors: 0, Skipped: 0, Time elapsed: 187.525 sec - in org.apache.sysml.test.integration.applications.dml.HITSDMLTest
Running org.apache.sysml.test.integration.applications.pydml.ArimaPyDMLTest
Tests run: 1, Failures: 0, Errors: 0, Skipped: 0, Time elapsed: 49.108 sec - in org.apache.sysml.test.integration.applications.pydml.ArimaPyDMLTest
Running org.apache.sysml.test.integration.applications.pydml.HITSPyDMLTest
Tests run: 1, Failures: 0, Errors: 0, Skipped: 0, Time elapsed: 78.051 sec - in org.apache.sysml.test.integration.applications.pydml.HITSPyDMLTest
Running org.apache.sysml.test.integration.applications.dml.LinearRegressionDMLTest
Tests run: 14, Failures: 0, Errors: 0, Skipped: 0, Time elapsed: 101.84 sec - in org.apache.sysml.test.integration.applications.dml.LinearRegressionDMLTest
Running org.apache.sysml.test.integration.applications.pydml.CsplineDSPyDMLTest
Tests run: 3, Failures: 0, Errors: 0, Skipped: 0, Time elapsed: 7.111 sec - in org.apache.sysml.test.integration.applications.pydml.CsplineDSPyDMLTest
Running org.apache.sysml.test.integration.applications.pydml.LinearLogRegPyDMLTest
Tests run: 7, Failures: 0, Errors: 0, Skipped: 0, Time elapsed: 81.593 sec - in org.apache.sysml.test.integration.applications.pydml.LinearLogRegPyDMLTest
Running org.apache.sysml.test.integration.applications.pydml.NaiveBayesPyDMLTest
Tests run: 6, Failures: 0, Errors: 0, Skipped: 0, Time elapsed: 81.247 sec - in org.apache.sysml.test.integration.applications.pydml.NaiveBayesPyDMLTest
Running org.apache.sysml.test.integration.applications.dml.CsplineCGDMLTest
Tests run: 6, Failures: 0, Errors: 0, Skipped: 0, Time elapsed: 44.398 sec - in org.apache.sysml.test.integration.applications.dml.CsplineCGDMLTest
Running org.apache.sysml.test.integration.applications.dml.L2SVMDMLTest
Tests run: 18, Failures: 0, Errors: 0, Skipped: 0, Time elapsed: 127.062 sec - in org.apache.sysml.test.integration.applications.dml.L2SVMDMLTest
Running org.apache.sysml.test.integration.applications.pydml.MDABivariateStatsPyDMLTest
Tests run: 4, Failures: 0, Errors: 0, Skipped: 0, Time elapsed: 293.848 sec - in org.apache.sysml.test.integration.applications.pydml.MDABivariateStatsPyDMLTest
Running org.apache.sysml.test.integration.applications.pydml.PageRankPyDMLTest
Tests run: 3, Failures: 0, Errors: 0, Skipped: 0, Time elapsed: 6.167 sec - in org.apache.sysml.test.integration.applications.pydml.PageRankPyDMLTest
Running org.apache.sysml.test.integration.applications.pydml.NaiveBayesParforPyDMLTest
Tests run: 6, Failures: 0, Errors: 0, Skipped: 0, Time elapsed: 80.962 sec - in org.apache.sysml.test.integration.applications.pydml.NaiveBayesParforPyDMLTest
Running org.apache.sysml.test.integration.applications.dml.NaiveBayesDMLTest
Tests run: 12, Failures: 0, Errors: 0, Skipped: 0, Time elapsed: 163.881 sec - in org.apache.sysml.test.integration.applications.dml.NaiveBayesDMLTest
Running org.apache.sysml.test.integration.applications.dml.MDABivariateStatsDMLTest
Tests run: 8, Failures: 0, Errors: 0, Skipped: 0, Time elapsed: 604.683 sec - in org.apache.sysml.test.integration.applications.dml.MDABivariateStatsDMLTest
Running org.apache.sysml.test.integration.applications.dml.PageRankDMLTest
Tests run: 6, Failures: 0, Errors: 0, Skipped: 0, Time elapsed: 12.115 sec - in org.apache.sysml.test.integration.applications.dml.PageRankDMLTest
Running org.apache.sysml.test.integration.applications.pydml.GLMPyDMLTest
Tests run: 30, Failures: 0, Errors: 0, Skipped: 0, Time elapsed: 586.881 sec - in org.apache.sysml.test.integration.applications.pydml.GLMPyDMLTest
Running org.apache.sysml.test.integration.applications.pydml.MultiClassSVMPyDMLTest
Tests run: 9, Failures: 0, Errors: 0, Skipped: 0, Time elapsed: 89.571 sec - in org.apache.sysml.test.integration.applications.pydml.MultiClassSVMPyDMLTest
Running org.apache.sysml.test.integration.applications.dml.ID3DMLTest
Tests run: 4, Failures: 0, Errors: 0, Skipped: 0, Time elapsed: 711.943 sec - in org.apache.sysml.test.integration.applications.dml.ID3DMLTest
Running org.apache.sysml.test.integration.applications.dml.GLMDMLTest
Tests run: 60, Failures: 0, Errors: 0, Skipped: 0, Time elapsed: 2,604.646 sec - in org.apache.sysml.test.integration.applications.dml.GLMDMLTest
Running org.apache.sysml.test.integration.applications.pydml.CsplineCGPyDMLTest
Tests run: 3, Failures: 0, Errors: 0, Skipped: 0, Time elapsed: 6.212 sec - in org.apache.sysml.test.integration.applications.pydml.CsplineCGPyDMLTest
Running org.apache.sysml.test.integration.applications.pydml.WelchTPyDMLTest
Tests run: 3, Failures: 0, Errors: 0, Skipped: 0, Time elapsed: 6.56 sec - in org.apache.sysml.test.integration.applications.pydml.WelchTPyDMLTest
Running org.apache.sysml.test.integration.applications.dml.MultiClassSVMDMLTest
Tests run: 18, Failures: 0, Errors: 0, Skipped: 0, Time elapsed: 180.428 sec - in org.apache.sysml.test.integration.applications.dml.MultiClassSVMDMLTest
Running org.apache.sysml.test.integration.applications.dml.CsplineDSDMLTest
Tests run: 6, Failures: 0, Errors: 0, Skipped: 0, Time elapsed: 39.205 sec - in org.apache.sysml.test.integration.applications.dml.CsplineDSDMLTest
Running org.apache.sysml.test.integration.applications.pydml.ApplyTransformPyDMLTest
Tests run: 7, Failures: 0, Errors: 0, Skipped: 0, Time elapsed: 1.688 sec - in org.apache.sysml.test.integration.applications.pydml.ApplyTransformPyDMLTest
Running org.apache.sysml.test.integration.applications.dml.NaiveBayesParforDMLTest
Tests run: 12, Failures: 0, Errors: 0, Skipped: 0, Time elapsed: 164.106 sec - in org.apache.sysml.test.integration.applications.dml.NaiveBayesParforDMLTest
Running org.apache.sysml.test.integration.applications.pydml.L2SVMPyDMLTest
Tests run: 9, Failures: 0, Errors: 0, Skipped: 0, Time elapsed: 69.09 sec - in org.apache.sysml.test.integration.applications.pydml.L2SVMPyDMLTest
Running org.apache.sysml.test.integration.applications.pydml.LinearRegressionPyDMLTest
Tests run: 7, Failures: 0, Errors: 0, Skipped: 0, Time elapsed: 51.048 sec - in org.apache.sysml.test.integration.applications.pydml.LinearRegressionPyDMLTest
Running org.apache.sysml.test.integration.applications.dml.LinearLogRegDMLTest
Tests run: 14, Failures: 0, Errors: 0, Skipped: 0, Time elapsed: 123.395 sec - in org.apache.sysml.test.integration.applications.dml.LinearLogRegDMLTest
Running org.apache.sysml.test.integration.applications.dml.GNMFDMLTest
Tests run: 6, Failures: 0, Errors: 0, Skipped: 0, Time elapsed: 162.677 sec - in org.apache.sysml.test.integration.applications.dml.GNMFDMLTest
Running org.apache.sysml.test.integration.applications.dml.WelchTDMLTest
Tests run: 6, Failures: 0, Errors: 0, Skipped: 0, Time elapsed: 12.958 sec - in org.apache.sysml.test.integration.applications.dml.WelchTDMLTest
Running org.apache.sysml.test.integration.applications.dml.ApplyTransformDMLTest
Tests run: 14, Failures: 0, Errors: 0, Skipped: 0, Time elapsed: 39.966 sec - in org.apache.sysml.test.integration.applications.dml.ApplyTransformDMLTest
Running org.apache.sysml.test.integration.applications.pydml.ID3PyDMLTest
Tests run: 2, Failures: 0, Errors: 0, Skipped: 0, Time elapsed: 332.948 sec - in org.apache.sysml.test.integration.applications.pydml.ID3PyDMLTest
Running org.apache.sysml.test.integration.applications.pydml.GNMFPyDMLTest
Tests run: 3, Failures: 0, Errors: 0, Skipped: 0, Time elapsed: 58.2 sec - in org.apache.sysml.test.integration.applications.pydml.GNMFPyDMLTest

Results :

Failed tests: 
  FullReblockTest.testCSVSingeMSparseMR:382->runReblockTest:479 39 values are not in equal

Tests run: 6517, Failures: 1, Errors: 0, Skipped: 0

[INFO] 
[INFO] --- maven-failsafe-plugin:2.17:verify (default) @ systemml ---
[INFO] Failsafe report directory: <https://sparktc.ibmcloud.com/jenkins/job/SystemML-DailyTest/ws/target/failsafe-reports>
[INFO] ------------------------------------------------------------------------
[INFO] BUILD FAILURE
[INFO] ------------------------------------------------------------------------
[INFO] Total time: 03:38 h
[INFO] Finished at: 2017-01-02T18:15:23-06:00
[INFO] Final Memory: 64M/2498M
[INFO] ------------------------------------------------------------------------
[ERROR] Failed to execute goal org.apache.maven.plugins:maven-failsafe-plugin:2.17:verify
(default) on project systemml: There are test failures.
[ERROR] 
[ERROR] Please refer to <https://sparktc.ibmcloud.com/jenkins/job/SystemML-DailyTest/ws/target/failsafe-reports>
for the individual test results.
[ERROR] -> [Help 1]
[ERROR] 
[ERROR] To see the full stack trace of the errors, re-run Maven with the -e switch.
[ERROR] Re-run Maven using the -X switch to enable full debug logging.
[ERROR] 
[ERROR] For more information about the errors and possible solutions, please read the following
articles:
[ERROR] [Help 1] http://cwiki.apache.org/confluence/display/MAVEN/MojoFailureException
Build step 'Execute shell' marked build as failure
Run condition [Always] enabling perform for step [[]]

Mime
View raw message