systemml-dev mailing list archives

Site index · List index
Message view « Date » · « Thread »
Top « Date » · « Thread »
From Deron Eriksson <deroneriks...@gmail.com>
Subject Re: Build failed in Jenkins: SystemML-DailyTest #635
Date Fri, 18 Nov 2016 23:40:05 GMT
That's great. Thank you Glenn.

Deron


On Fri, Nov 18, 2016 at 3:28 PM, Glenn Weidner <gweidner@us.ibm.com> wrote:

> We've modified the Jenkins Daily Test job configuration so the workspace
> does not get deleted right after the build completes. Next time, the
> detailed test logs will be available at:
>
> https://sparktc.ibmcloud.com/jenkins/job/SystemML-
> DailyTest/ws/target/failsafe-reports/
>
> Thanks,
> Glenn
>
> [image: Inactive hide details for jenkins---11/18/2016 03:12:48 PM---See
> <https://sparktc.ibmcloud.com/jenkins/job/SystemML-DailyTest/6]jenkins---11/18/2016
> 03:12:48 PM---See <https://sparktc.ibmcloud.com/jenkins/job/SystemML-
> DailyTest/635/changes> Changes:
>
> From: jenkins@spark.tc
> To: Michael W Dusenberry/San Francisco/IBM@IBMUS, lresende@apache.org,
> dev@systemml.incubator.apache.org, Deron Eriksson/San Francisco/IBM@IBMUS
> Date: 11/18/2016 03:12 PM
> Subject: Build failed in Jenkins: SystemML-DailyTest #635
> ------------------------------
>
>
>
> See <https://sparktc.ibmcloud.com/jenkins/job/SystemML-
> DailyTest/635/changes>
>
> Changes:
>
> [Deron Eriksson] [SYSTEMML-1084] Change .tar.gz artifact extensions to .tgz
>
> [Deron Eriksson] [SYSTEMML-1119] Fix duplicate declaration of
> exec-maven-plugin
>
> ------------------------------------------
> [...truncated 9779 lines...]
> 16/11/18 16:05:59 INFO handler.ContextHandler: stopped
> o.s.j.s.ServletContextHandler{/SQL28/execution/json,null}
> 16/11/18 16:05:59 INFO handler.ContextHandler: stopped
> o.s.j.s.ServletContextHandler{/SQL28/execution,null}
> 16/11/18 16:05:59 INFO handler.ContextHandler: stopped
> o.s.j.s.ServletContextHandler{/SQL28/json,null}
> 16/11/18 16:05:59 INFO handler.ContextHandler: stopped
> o.s.j.s.ServletContextHandler{/SQL28,null}
> 16/11/18 16:05:59 INFO handler.ContextHandler: stopped
> o.s.j.s.ServletContextHandler{/static/sql,null}
> 16/11/18 16:05:59 INFO handler.ContextHandler: stopped
> o.s.j.s.ServletContextHandler{/SQL27/execution/json,null}
> 16/11/18 16:05:59 INFO handler.ContextHandler: stopped
> o.s.j.s.ServletContextHandler{/SQL27/execution,null}
> 16/11/18 16:05:59 INFO handler.ContextHandler: stopped
> o.s.j.s.ServletContextHandler{/SQL27/json,null}
> 16/11/18 16:05:59 INFO handler.ContextHandler: stopped
> o.s.j.s.ServletContextHandler{/SQL27,null}
> 16/11/18 16:05:59 INFO handler.ContextHandler: stopped
> o.s.j.s.ServletContextHandler{/static/sql,null}
> 16/11/18 16:05:59 INFO handler.ContextHandler: stopped
> o.s.j.s.ServletContextHandler{/SQL26/execution/json,null}
> 16/11/18 16:05:59 INFO handler.ContextHandler: stopped
> o.s.j.s.ServletContextHandler{/SQL26/execution,null}
> 16/11/18 16:05:59 INFO handler.ContextHandler: stopped
> o.s.j.s.ServletContextHandler{/SQL26/json,null}
> 16/11/18 16:05:59 INFO handler.ContextHandler: stopped
> o.s.j.s.ServletContextHandler{/SQL26,null}
> 16/11/18 16:05:59 INFO handler.ContextHandler: stopped
> o.s.j.s.ServletContextHandler{/static/sql,null}
> 16/11/18 16:05:59 INFO handler.ContextHandler: stopped
> o.s.j.s.ServletContextHandler{/SQL25/execution/json,null}
> 16/11/18 16:05:59 INFO handler.ContextHandler: stopped
> o.s.j.s.ServletContextHandler{/SQL25/execution,null}
> 16/11/18 16:05:59 INFO handler.ContextHandler: stopped
> o.s.j.s.ServletContextHandler{/SQL25/json,null}
> 16/11/18 16:05:59 INFO handler.ContextHandler: stopped
> o.s.j.s.ServletContextHandler{/SQL25,null}
> 16/11/18 16:05:59 INFO handler.ContextHandler: stopped
> o.s.j.s.ServletContextHandler{/static/sql,null}
> 16/11/18 16:05:59 INFO handler.ContextHandler: stopped
> o.s.j.s.ServletContextHandler{/SQL24/execution/json,null}
> 16/11/18 16:05:59 INFO handler.ContextHandler: stopped
> o.s.j.s.ServletContextHandler{/SQL24/execution,null}
> 16/11/18 16:05:59 INFO handler.ContextHandler: stopped
> o.s.j.s.ServletContextHandler{/SQL24/json,null}
> 16/11/18 16:05:59 INFO handler.ContextHandler: stopped
> o.s.j.s.ServletContextHandler{/SQL24,null}
> 16/11/18 16:05:59 INFO handler.ContextHandler: stopped
> o.s.j.s.ServletContextHandler{/static/sql,null}
> 16/11/18 16:05:59 INFO handler.ContextHandler: stopped
> o.s.j.s.ServletContextHandler{/SQL23/execution/json,null}
> 16/11/18 16:05:59 INFO handler.ContextHandler: stopped
> o.s.j.s.ServletContextHandler{/SQL23/execution,null}
> 16/11/18 16:05:59 INFO handler.ContextHandler: stopped
> o.s.j.s.ServletContextHandler{/SQL23/json,null}
> 16/11/18 16:05:59 INFO handler.ContextHandler: stopped
> o.s.j.s.ServletContextHandler{/SQL23,null}
> 16/11/18 16:05:59 INFO handler.ContextHandler: stopped
> o.s.j.s.ServletContextHandler{/static/sql,null}
> 16/11/18 16:05:59 INFO handler.ContextHandler: stopped
> o.s.j.s.ServletContextHandler{/SQL22/execution/json,null}
> 16/11/18 16:05:59 INFO handler.ContextHandler: stopped
> o.s.j.s.ServletContextHandler{/SQL22/execution,null}
> 16/11/18 16:05:59 INFO handler.ContextHandler: stopped
> o.s.j.s.ServletContextHandler{/SQL22/json,null}
> 16/11/18 16:05:59 INFO handler.ContextHandler: stopped
> o.s.j.s.ServletContextHandler{/SQL22,null}
> 16/11/18 16:05:59 INFO handler.ContextHandler: stopped
> o.s.j.s.ServletContextHandler{/static/sql,null}
> 16/11/18 16:05:59 INFO handler.ContextHandler: stopped
> o.s.j.s.ServletContextHandler{/SQL21/execution/json,null}
> 16/11/18 16:05:59 INFO handler.ContextHandler: stopped
> o.s.j.s.ServletContextHandler{/SQL21/execution,null}
> 16/11/18 16:05:59 INFO handler.ContextHandler: stopped
> o.s.j.s.ServletContextHandler{/SQL21/json,null}
> 16/11/18 16:05:59 INFO handler.ContextHandler: stopped
> o.s.j.s.ServletContextHandler{/SQL21,null}
> 16/11/18 16:05:59 INFO handler.ContextHandler: stopped
> o.s.j.s.ServletContextHandler{/static/sql,null}
> 16/11/18 16:05:59 INFO handler.ContextHandler: stopped
> o.s.j.s.ServletContextHandler{/SQL20/execution/json,null}
> 16/11/18 16:05:59 INFO handler.ContextHandler: stopped
> o.s.j.s.ServletContextHandler{/SQL20/execution,null}
> 16/11/18 16:05:59 INFO handler.ContextHandler: stopped
> o.s.j.s.ServletContextHandler{/SQL20/json,null}
> 16/11/18 16:05:59 INFO handler.ContextHandler: stopped
> o.s.j.s.ServletContextHandler{/SQL20,null}
> 16/11/18 16:05:59 INFO handler.ContextHandler: stopped
> o.s.j.s.ServletContextHandler{/static/sql,null}
> 16/11/18 16:05:59 INFO handler.ContextHandler: stopped
> o.s.j.s.ServletContextHandler{/SQL19/execution/json,null}
> 16/11/18 16:05:59 INFO handler.ContextHandler: stopped
> o.s.j.s.ServletContextHandler{/SQL19/execution,null}
> 16/11/18 16:05:59 INFO handler.ContextHandler: stopped
> o.s.j.s.ServletContextHandler{/SQL19/json,null}
> 16/11/18 16:05:59 INFO handler.ContextHandler: stopped
> o.s.j.s.ServletContextHandler{/SQL19,null}
> 16/11/18 16:05:59 INFO handler.ContextHandler: stopped
> o.s.j.s.ServletContextHandler{/static/sql,null}
> 16/11/18 16:05:59 INFO handler.ContextHandler: stopped
> o.s.j.s.ServletContextHandler{/SQL18/execution/json,null}
> 16/11/18 16:05:59 INFO handler.ContextHandler: stopped
> o.s.j.s.ServletContextHandler{/SQL18/execution,null}
> 16/11/18 16:05:59 INFO handler.ContextHandler: stopped
> o.s.j.s.ServletContextHandler{/SQL18/json,null}
> 16/11/18 16:05:59 INFO handler.ContextHandler: stopped
> o.s.j.s.ServletContextHandler{/SQL18,null}
> 16/11/18 16:05:59 INFO handler.ContextHandler: stopped
> o.s.j.s.ServletContextHandler{/static/sql,null}
> 16/11/18 16:05:59 INFO handler.ContextHandler: stopped
> o.s.j.s.ServletContextHandler{/SQL17/execution/json,null}
> 16/11/18 16:05:59 INFO handler.ContextHandler: stopped
> o.s.j.s.ServletContextHandler{/SQL17/execution,null}
> 16/11/18 16:05:59 INFO handler.ContextHandler: stopped
> o.s.j.s.ServletContextHandler{/SQL17/json,null}
> 16/11/18 16:05:59 INFO handler.ContextHandler: stopped
> o.s.j.s.ServletContextHandler{/SQL17,null}
> 16/11/18 16:05:59 INFO handler.ContextHandler: stopped
> o.s.j.s.ServletContextHandler{/static/sql,null}
> 16/11/18 16:05:59 INFO handler.ContextHandler: stopped
> o.s.j.s.ServletContextHandler{/SQL16/execution/json,null}
> 16/11/18 16:05:59 INFO handler.ContextHandler: stopped
> o.s.j.s.ServletContextHandler{/SQL16/execution,null}
> 16/11/18 16:05:59 INFO handler.ContextHandler: stopped
> o.s.j.s.ServletContextHandler{/SQL16/json,null}
> 16/11/18 16:05:59 INFO handler.ContextHandler: stopped
> o.s.j.s.ServletContextHandler{/SQL16,null}
> 16/11/18 16:05:59 INFO handler.ContextHandler: stopped
> o.s.j.s.ServletContextHandler{/static/sql,null}
> 16/11/18 16:05:59 INFO handler.ContextHandler: stopped
> o.s.j.s.ServletContextHandler{/SQL15/execution/json,null}
> 16/11/18 16:05:59 INFO handler.ContextHandler: stopped
> o.s.j.s.ServletContextHandler{/SQL15/execution,null}
> 16/11/18 16:05:59 INFO handler.ContextHandler: stopped
> o.s.j.s.ServletContextHandler{/SQL15/json,null}
> 16/11/18 16:05:59 INFO handler.ContextHandler: stopped
> o.s.j.s.ServletContextHandler{/SQL15,null}
> 16/11/18 16:05:59 INFO handler.ContextHandler: stopped
> o.s.j.s.ServletContextHandler{/static/sql,null}
> 16/11/18 16:05:59 INFO handler.ContextHandler: stopped
> o.s.j.s.ServletContextHandler{/SQL14/execution/json,null}
> 16/11/18 16:05:59 INFO handler.ContextHandler: stopped
> o.s.j.s.ServletContextHandler{/SQL14/execution,null}
> 16/11/18 16:05:59 INFO handler.ContextHandler: stopped
> o.s.j.s.ServletContextHandler{/SQL14/json,null}
> 16/11/18 16:05:59 INFO handler.ContextHandler: stopped
> o.s.j.s.ServletContextHandler{/SQL14,null}
> 16/11/18 16:05:59 INFO handler.ContextHandler: stopped
> o.s.j.s.ServletContextHandler{/static/sql,null}
> 16/11/18 16:05:59 INFO handler.ContextHandler: stopped
> o.s.j.s.ServletContextHandler{/SQL13/execution/json,null}
> 16/11/18 16:05:59 INFO handler.ContextHandler: stopped
> o.s.j.s.ServletContextHandler{/SQL13/execution,null}
> 16/11/18 16:05:59 INFO handler.ContextHandler: stopped
> o.s.j.s.ServletContextHandler{/SQL13/json,null}
> 16/11/18 16:05:59 INFO handler.ContextHandler: stopped
> o.s.j.s.ServletContextHandler{/SQL13,null}
> 16/11/18 16:05:59 INFO handler.ContextHandler: stopped
> o.s.j.s.ServletContextHandler{/static/sql,null}
> 16/11/18 16:05:59 INFO handler.ContextHandler: stopped
> o.s.j.s.ServletContextHandler{/SQL12/execution/json,null}
> 16/11/18 16:05:59 INFO handler.ContextHandler: stopped
> o.s.j.s.ServletContextHandler{/SQL12/execution,null}
> 16/11/18 16:05:59 INFO handler.ContextHandler: stopped
> o.s.j.s.ServletContextHandler{/SQL12/json,null}
> 16/11/18 16:05:59 INFO handler.ContextHandler: stopped
> o.s.j.s.ServletContextHandler{/SQL12,null}
> 16/11/18 16:05:59 INFO handler.ContextHandler: stopped
> o.s.j.s.ServletContextHandler{/metrics/json,null}
> 16/11/18 16:05:59 INFO handler.ContextHandler: stopped
> o.s.j.s.ServletContextHandler{/stages/stage/kill,null}
> 16/11/18 16:05:59 INFO handler.ContextHandler: stopped
> o.s.j.s.ServletContextHandler{/api,null}
> 16/11/18 16:05:59 INFO handler.ContextHandler: stopped
> o.s.j.s.ServletContextHandler{/,null}
> 16/11/18 16:05:59 INFO handler.ContextHandler: stopped
> o.s.j.s.ServletContextHandler{/static,null}
> 16/11/18 16:05:59 INFO handler.ContextHandler: stopped
> o.s.j.s.ServletContextHandler{/executors/threadDump/json,null}
> 16/11/18 16:05:59 INFO handler.ContextHandler: stopped
> o.s.j.s.ServletContextHandler{/executors/threadDump,null}
> 16/11/18 16:05:59 INFO handler.ContextHandler: stopped
> o.s.j.s.ServletContextHandler{/executors/json,null}
> 16/11/18 16:05:59 INFO handler.ContextHandler: stopped
> o.s.j.s.ServletContextHandler{/executors,null}
> 16/11/18 16:05:59 INFO handler.ContextHandler: stopped
> o.s.j.s.ServletContextHandler{/environment/json,null}
> 16/11/18 16:05:59 INFO handler.ContextHandler: stopped
> o.s.j.s.ServletContextHandler{/environment,null}
> 16/11/18 16:05:59 INFO handler.ContextHandler: stopped
> o.s.j.s.ServletContextHandler{/storage/rdd/json,null}
> 16/11/18 16:05:59 INFO handler.ContextHandler: stopped
> o.s.j.s.ServletContextHandler{/storage/rdd,null}
> 16/11/18 16:05:59 INFO handler.ContextHandler: stopped
> o.s.j.s.ServletContextHandler{/storage/json,null}
> 16/11/18 16:05:59 INFO handler.ContextHandler: stopped
> o.s.j.s.ServletContextHandler{/storage,null}
> 16/11/18 16:05:59 INFO handler.ContextHandler: stopped
> o.s.j.s.ServletContextHandler{/stages/pool/json,null}
> 16/11/18 16:05:59 INFO handler.ContextHandler: stopped
> o.s.j.s.ServletContextHandler{/stages/pool,null}
> 16/11/18 16:05:59 INFO handler.ContextHandler: stopped
> o.s.j.s.ServletContextHandler{/stages/stage/json,null}
> 16/11/18 16:05:59 INFO handler.ContextHandler: stopped
> o.s.j.s.ServletContextHandler{/stages/stage,null}
> 16/11/18 16:05:59 INFO handler.ContextHandler: stopped
> o.s.j.s.ServletContextHandler{/stages/json,null}
> 16/11/18 16:05:59 INFO handler.ContextHandler: stopped
> o.s.j.s.ServletContextHandler{/stages,null}
> 16/11/18 16:05:59 INFO handler.ContextHandler: stopped
> o.s.j.s.ServletContextHandler{/jobs/job/json,null}
> 16/11/18 16:05:59 INFO handler.ContextHandler: stopped
> o.s.j.s.ServletContextHandler{/jobs/job,null}
> 16/11/18 16:05:59 INFO handler.ContextHandler: stopped
> o.s.j.s.ServletContextHandler{/jobs/json,null}
> 16/11/18 16:05:59 INFO handler.ContextHandler: stopped
> o.s.j.s.ServletContextHandler{/jobs,null}
> 16/11/18 16:05:59 INFO ui.SparkUI: Stopped Spark web UI at
> http://localhost:4040
> 16/11/18 16:05:59 INFO spark.MapOutputTrackerMasterEndpoint:
> MapOutputTrackerMasterEndpoint stopped!
> 16/11/18 16:05:59 INFO storage.MemoryStore: MemoryStore cleared
> 16/11/18 16:05:59 INFO storage.BlockManager: BlockManager stopped
> 16/11/18 16:05:59 INFO storage.BlockManagerMaster: BlockManagerMaster
> stopped
> 16/11/18 16:05:59 INFO scheduler.OutputCommitCoordinator$
> OutputCommitCoordinatorEndpoint: OutputCommitCoordinator stopped!
> 16/11/18 16:05:59 INFO spark.SparkContext: Successfully stopped
> SparkContext
> 16/11/18 16:05:59 INFO remote.RemoteActorRefProvider$RemotingTerminator:
> Shutting down remote daemon.
> 16/11/18 16:05:59 INFO remote.RemoteActorRefProvider$RemotingTerminator:
> Remote daemon shut down; proceeding with flushing remote transports.
> Running org.apache.sysml.test.integration.mlcontext.MLContextTest
> 16/11/18 16:05:59 INFO remote.RemoteActorRefProvider$RemotingTerminator:
> Remoting shut down.
> Tests run: 130, Failures: 0, Errors: 0, Skipped: 0, Time elapsed: 44.209
> sec - in org.apache.sysml.test.integration.mlcontext.MLContextTest
> 16/11/18 16:05:59 INFO util.ShutdownHookManager: Shutdown hook called
> 16/11/18 16:05:59 INFO util.ShutdownHookManager: Deleting directory
> /tmp/spark-e034f0dd-1d2f-4cfc-aaa6-9be254e96630
> Running org.apache.sysml.test.integration.functions.
> quaternary.WeightedSigmoidTest
> Tests run: 56, Failures: 0, Errors: 0, Skipped: 0, Time elapsed: 1,014.05
> sec - in org.apache.sysml.test.integration.functions.
> quaternary.WeightedSigmoidTest
> 16/11/18 16:07:50 INFO util.ShutdownHookManager: Shutdown hook called
> 16/11/18 16:07:50 INFO util.ShutdownHookManager: Deleting directory
> /tmp/spark-af991cde-1a80-4b00-9620-4e66c0960ff3
> Running org.apache.sysml.test.integration.functions.
> indexing.LeftIndexingTest
> Tests run: 3, Failures: 0, Errors: 0, Skipped: 0, Time elapsed: 658.126
> sec - in org.apache.sysml.test.integration.functions.
> indexing.LeftIndexingTest
> Running org.apache.sysml.test.integration.applications.
> parfor.ParForCorrelationTest
> Tests run: 12, Failures: 0, Errors: 0, Skipped: 0, Time elapsed: 271.441
> sec - in org.apache.sysml.test.integration.applications.
> parfor.ParForCorrelationTest
> Running org.apache.sysml.test.integration.applications.descriptivestats.
> UnivariateUnweightedScaleDenseTest
> Tests run: 24, Failures: 0, Errors: 0, Skipped: 0, Time elapsed: 321.156
> sec - in org.apache.sysml.test.integration.applications.descriptivestats.
> UnivariateUnweightedScaleDenseTest
> Running org.apache.sysml.test.integration.functions.reorg.FullOrderTest
> Tests run: 132, Failures: 0, Errors: 0, Skipped: 0, Time elapsed:
> 1,375.882 sec - in org.apache.sysml.test.integration.functions.reorg.
> FullOrderTest
> Running org.apache.sysml.test.integration.applications.parfor.
> ParForCorrelationTestLarge
> Tests run: 2, Failures: 0, Errors: 0, Skipped: 0, Time elapsed: 47.966 sec
> - in org.apache.sysml.test.integration.applications.parfor.
> ParForCorrelationTestLarge
> Running org.apache.sysml.test.integration.functions.quaternary.
> WeightedDivMatrixMultTest
> Tests run: 90, Failures: 0, Errors: 0, Skipped: 0, Time elapsed: 1,480.417
> sec - in org.apache.sysml.test.integration.functions.quaternary.
> WeightedDivMatrixMultTest
> 16/11/18 16:15:06 INFO util.ShutdownHookManager: Shutdown hook called
> 16/11/18 16:15:06 INFO util.ShutdownHookManager: Deleting directory
> /tmp/spark-5402e463-234e-41a2-abf5-f15347fcc1b8
> Running org.apache.sysml.test.integration.applications.descriptivestats.
> UnivariateWeightedScaleDenseTest
> Tests run: 24, Failures: 0, Errors: 0, Skipped: 0, Time elapsed: 366.103
> sec - in org.apache.sysml.test.integration.applications.descriptivestats.
> UnivariateWeightedScaleDenseTest
> Running org.apache.sysml.test.integration.functions.append.AppendChainTest
> Tests run: 12, Failures: 0, Errors: 0, Skipped: 0, Time elapsed: 1,074.724
> sec - in org.apache.sysml.test.integration.functions.append.
> AppendChainTest
> Running org.apache.sysml.test.integration.applications.
> parfor.ParForNaiveBayesTest
> Tests run: 10, Failures: 0, Errors: 0, Skipped: 0, Time elapsed: 524.573
> sec - in org.apache.sysml.test.integration.applications.
> parfor.ParForNaiveBayesTest
> Running org.apache.sysml.test.integration.applications.descriptivestats.
> UnivariateUnweightedScaleSparseTest
> Tests run: 24, Failures: 0, Errors: 0, Skipped: 0, Time elapsed: 291.528
> sec - in org.apache.sysml.test.integration.applications.descriptivestats.
> UnivariateUnweightedScaleSparseTest
> Running org.apache.sysml.test.integration.applications.dml.HITSDMLTest
> Tests run: 1, Failures: 0, Errors: 0, Skipped: 0, Time elapsed: 91.214 sec
> - in org.apache.sysml.test.integration.applications.dml.HITSDMLTest
> Running org.apache.sysml.test.integration.applications.descriptivestats.
> UnivariateWeightedScaleSparseTest
> Tests run: 24, Failures: 0, Errors: 0, Skipped: 0, Time elapsed: 335.843
> sec - in org.apache.sysml.test.integration.applications.descriptivestats.
> UnivariateWeightedScaleSparseTest
> Running org.apache.sysml.test.integration.functions.append.
> AppendMatrixTest
> Tests run: 22, Failures: 0, Errors: 0, Skipped: 0, Time elapsed: 1,679.487
> sec - in org.apache.sysml.test.integration.functions.append.
> AppendMatrixTest
> Running org.apache.sysml.test.integration.applications.
> pydml.ArimaPyDMLTest
> Tests run: 1, Failures: 0, Errors: 0, Skipped: 0, Time elapsed: 49.611 sec
> - in org.apache.sysml.test.integration.applications.pydml.ArimaPyDMLTest
> Running org.apache.sysml.test.integration.applications.pydml.HITSPyDMLTest
> Tests run: 1, Failures: 0, Errors: 0, Skipped: 0, Time elapsed: 78.317 sec
> - in org.apache.sysml.test.integration.applications.pydml.HITSPyDMLTest
> Running org.apache.sysml.test.integration.applications.dml.
> LinearRegressionDMLTest
> Tests run: 7, Failures: 0, Errors: 0, Skipped: 0, Time elapsed: 54.969 sec
> - in org.apache.sysml.test.integration.applications.dml.
> LinearRegressionDMLTest
> Running org.apache.sysml.test.integration.applications.
> pydml.CsplineDSPyDMLTest
> Tests run: 3, Failures: 0, Errors: 0, Skipped: 0, Time elapsed: 6.852 sec
> - in org.apache.sysml.test.integration.applications.
> pydml.CsplineDSPyDMLTest
> Running org.apache.sysml.test.integration.applications.
> pydml.LinearLogRegPyDMLTest
> Tests run: 7, Failures: 0, Errors: 0, Skipped: 0, Time elapsed: 87.886 sec
> - in org.apache.sysml.test.integration.applications.
> pydml.LinearLogRegPyDMLTest
> Running org.apache.sysml.test.integration.applications.
> pydml.NaiveBayesPyDMLTest
> Tests run: 6, Failures: 0, Errors: 0, Skipped: 0, Time elapsed: 81.048 sec
> - in org.apache.sysml.test.integration.applications.
> pydml.NaiveBayesPyDMLTest
> Running org.apache.sysml.test.integration.applications.dml.
> CsplineCGDMLTest
> Tests run: 3, Failures: 0, Errors: 0, Skipped: 0, Time elapsed: 10.952 sec
> - in org.apache.sysml.test.integration.applications.dml.CsplineCGDMLTest
> Running org.apache.sysml.test.integration.applications.dml.L2SVMDMLTest
> Tests run: 9, Failures: 0, Errors: 0, Skipped: 0, Time elapsed: 64.817 sec
> - in org.apache.sysml.test.integration.applications.dml.L2SVMDMLTest
> Running org.apache.sysml.test.integration.applications.pydml.
> MDABivariateStatsPyDMLTest
> Tests run: 4, Failures: 0, Errors: 0, Skipped: 0, Time elapsed: 295.071
> sec - in org.apache.sysml.test.integration.applications.pydml.
> MDABivariateStatsPyDMLTest
> Running org.apache.sysml.test.integration.applications.
> pydml.PageRankPyDMLTest
> Tests run: 3, Failures: 0, Errors: 0, Skipped: 0, Time elapsed: 6.299 sec
> - in org.apache.sysml.test.integration.applications.
> pydml.PageRankPyDMLTest
> Running org.apache.sysml.test.integration.applications.pydml.
> NaiveBayesParforPyDMLTest
> Tests run: 6, Failures: 0, Errors: 0, Skipped: 0, Time elapsed: 81.13 sec
> - in org.apache.sysml.test.integration.applications.pydml.
> NaiveBayesParforPyDMLTest
> Running org.apache.sysml.test.integration.applications.dml.
> NaiveBayesDMLTest
> Tests run: 6, Failures: 0, Errors: 0, Skipped: 0, Time elapsed: 82.394 sec
> - in org.apache.sysml.test.integration.applications.dml.NaiveBayesDMLTest
> Running org.apache.sysml.test.integration.applications.dml.
> MDABivariateStatsDMLTest
> Tests run: 4, Failures: 0, Errors: 0, Skipped: 0, Time elapsed: 293.595
> sec - in org.apache.sysml.test.integration.applications.dml.
> MDABivariateStatsDMLTest
> Running org.apache.sysml.test.integration.applications.dml.PageRankDMLTest
> Tests run: 3, Failures: 0, Errors: 0, Skipped: 0, Time elapsed: 6.323 sec
> - in org.apache.sysml.test.integration.applications.dml.PageRankDMLTest
> Running org.apache.sysml.test.integration.applications.pydml.GLMPyDMLTest
> Tests run: 30, Failures: 0, Errors: 0, Skipped: 0, Time elapsed: 585.578
> sec - in org.apache.sysml.test.integration.applications.pydml.GLMPyDMLTest
> Running org.apache.sysml.test.integration.applications.
> pydml.MultiClassSVMPyDMLTest
> Tests run: 9, Failures: 0, Errors: 0, Skipped: 0, Time elapsed: 87.499 sec
> - in org.apache.sysml.test.integration.applications.
> pydml.MultiClassSVMPyDMLTest
> Running org.apache.sysml.test.integration.applications.dml.ID3DMLTest
> Tests run: 2, Failures: 0, Errors: 0, Skipped: 0, Time elapsed: 375.923
> sec - in org.apache.sysml.test.integration.applications.dml.ID3DMLTest
> Running org.apache.sysml.test.integration.applications.dml.GLMDMLTest
> Tests run: 30, Failures: 0, Errors: 0, Skipped: 0, Time elapsed: 864.367
> sec - in org.apache.sysml.test.integration.applications.dml.GLMDMLTest
> Running org.apache.sysml.test.integration.applications.
> pydml.CsplineCGPyDMLTest
> Tests run: 3, Failures: 0, Errors: 0, Skipped: 0, Time elapsed: 6.229 sec
> - in org.apache.sysml.test.integration.applications.
> pydml.CsplineCGPyDMLTest
> Running org.apache.sysml.test.integration.applications.
> pydml.WelchTPyDMLTest
> Tests run: 3, Failures: 0, Errors: 0, Skipped: 0, Time elapsed: 6.563 sec
> - in org.apache.sysml.test.integration.applications.pydml.WelchTPyDMLTest
> Running org.apache.sysml.test.integration.applications.dml.
> MultiClassSVMDMLTest
> Tests run: 9, Failures: 0, Errors: 0, Skipped: 0, Time elapsed: 90.291 sec
> - in org.apache.sysml.test.integration.applications.dml.
> MultiClassSVMDMLTest
> Running org.apache.sysml.test.integration.applications.dml.
> CsplineDSDMLTest
> Tests run: 3, Failures: 0, Errors: 0, Skipped: 0, Time elapsed: 13.62 sec
> - in org.apache.sysml.test.integration.applications.dml.CsplineDSDMLTest
> Running org.apache.sysml.test.integration.applications.
> pydml.ApplyTransformPyDMLTest
> Tests run: 7, Failures: 0, Errors: 0, Skipped: 0, Time elapsed: 1.285 sec
> - in org.apache.sysml.test.integration.applications.
> pydml.ApplyTransformPyDMLTest
> Running org.apache.sysml.test.integration.applications.dml.
> NaiveBayesParforDMLTest
> Tests run: 6, Failures: 0, Errors: 0, Skipped: 0, Time elapsed: 82.021 sec
> - in org.apache.sysml.test.integration.applications.dml.
> NaiveBayesParforDMLTest
> Running org.apache.sysml.test.integration.applications.
> pydml.L2SVMPyDMLTest
> Tests run: 9, Failures: 0, Errors: 0, Skipped: 0, Time elapsed: 64.849 sec
> - in org.apache.sysml.test.integration.applications.pydml.L2SVMPyDMLTest
> Running org.apache.sysml.test.integration.applications.pydml.
> LinearRegressionPyDMLTest
> Tests run: 7, Failures: 0, Errors: 0, Skipped: 0, Time elapsed: 51.167 sec
> - in org.apache.sysml.test.integration.applications.pydml.
> LinearRegressionPyDMLTest
> Running org.apache.sysml.test.integration.applications.dml.
> LinearLogRegDMLTest
> Tests run: 7, Failures: 0, Errors: 0, Skipped: 0, Time elapsed: 61.079 sec
> - in org.apache.sysml.test.integration.applications.dml.
> LinearLogRegDMLTest
> Running org.apache.sysml.test.integration.applications.dml.GNMFDMLTest
> Tests run: 3, Failures: 0, Errors: 0, Skipped: 0, Time elapsed: 70.499 sec
> - in org.apache.sysml.test.integration.applications.dml.GNMFDMLTest
> Running org.apache.sysml.test.integration.applications.dml.WelchTDMLTest
> Tests run: 3, Failures: 0, Errors: 0, Skipped: 0, Time elapsed: 6.67 sec -
> in org.apache.sysml.test.integration.applications.dml.WelchTDMLTest
> Running org.apache.sysml.test.integration.applications.dml.
> ApplyTransformDMLTest
> Tests run: 7, Failures: 0, Errors: 0, Skipped: 0, Time elapsed: 13.927 sec
> - in org.apache.sysml.test.integration.applications.dml.
> ApplyTransformDMLTest
> Running org.apache.sysml.test.integration.applications.pydml.ID3PyDMLTest
> Tests run: 2, Failures: 0, Errors: 0, Skipped: 0, Time elapsed: 329.041
> sec - in org.apache.sysml.test.integration.applications.pydml.ID3PyDMLTest
> Running org.apache.sysml.test.integration.applications.pydml.GNMFPyDMLTest
> Tests run: 3, Failures: 0, Errors: 0, Skipped: 0, Time elapsed: 56.337 sec
> - in org.apache.sysml.test.integration.applications.pydml.GNMFPyDMLTest
>
> Results :
>
> Failed tests:
>  TanTest.testRandom:127->AutomatedTestBase.compareResults:1362 for file
> target/testTemp/functions/unary/scalar/TanTest/out/int 2 values are not
> equal
>
> Tests run: 6392, Failures: 1, Errors: 0, Skipped: 0
>
> [INFO]
> [INFO] --- maven-failsafe-plugin:2.17:verify (default) @ systemml ---
> [INFO] Failsafe report directory: <https://sparktc.ibmcloud.com/
> jenkins/job/SystemML-DailyTest/ws/target/failsafe-reports>
> [INFO] ------------------------------------------------------------
> ------------
> [INFO] BUILD FAILURE
> [INFO] ------------------------------------------------------------
> ------------
> [INFO] Total time: 02:33 h
> [INFO] Finished at: 2016-11-18T17:12:22-06:00
> [INFO] Final Memory: 63M/2453M
> [INFO] ------------------------------------------------------------
> ------------
> [ERROR] Failed to execute goal org.apache.maven.plugins:
> maven-failsafe-plugin:2.17:verify (default) on project systemml: There
> are test failures.
> [ERROR]
> [ERROR] Please refer to <https://sparktc.ibmcloud.com/
> jenkins/job/SystemML-DailyTest/ws/target/failsafe-reports> for the
> individual test results.
> [ERROR] -> [Help 1]
> [ERROR]
> [ERROR] To see the full stack trace of the errors, re-run Maven with the
> -e switch.
> [ERROR] Re-run Maven using the -X switch to enable full debug logging.
> [ERROR]
> [ERROR] For more information about the errors and possible solutions,
> please read the following articles:
> [ERROR] [Help 1] http://cwiki.apache.org/confluence/display/MAVEN/
> MojoFailureException
> Build step 'Execute shell' marked build as failure
> Run condition [Always] enabling perform for step [[]]
>
>
>
>
>

Mime
  • Unnamed multipart/alternative (inline, None, 0 bytes)
View raw message