systemml-dev mailing list archives

Site index · List index
Message view « Date » · « Thread »
Top « Date » · « Thread »
From jenk...@spark.tc
Subject Build failed in Jenkins: SystemML-DailyTest #652
Date Sun, 27 Nov 2016 10:54:38 GMT
See <https://sparktc.ibmcloud.com/jenkins/job/SystemML-DailyTest/652/>

------------------------------------------
[...truncated 9835 lines...]
16/11/27 03:48:50 INFO handler.ContextHandler: stopped o.s.j.s.ServletContextHandler{/SQL28/execution/json,null}
16/11/27 03:48:50 INFO handler.ContextHandler: stopped o.s.j.s.ServletContextHandler{/SQL28/execution,null}
16/11/27 03:48:50 INFO handler.ContextHandler: stopped o.s.j.s.ServletContextHandler{/SQL28/json,null}
16/11/27 03:48:50 INFO handler.ContextHandler: stopped o.s.j.s.ServletContextHandler{/SQL28,null}
16/11/27 03:48:50 INFO handler.ContextHandler: stopped o.s.j.s.ServletContextHandler{/static/sql,null}
16/11/27 03:48:50 INFO handler.ContextHandler: stopped o.s.j.s.ServletContextHandler{/SQL27/execution/json,null}
16/11/27 03:48:50 INFO handler.ContextHandler: stopped o.s.j.s.ServletContextHandler{/SQL27/execution,null}
16/11/27 03:48:50 INFO handler.ContextHandler: stopped o.s.j.s.ServletContextHandler{/SQL27/json,null}
16/11/27 03:48:50 INFO handler.ContextHandler: stopped o.s.j.s.ServletContextHandler{/SQL27,null}
16/11/27 03:48:50 INFO handler.ContextHandler: stopped o.s.j.s.ServletContextHandler{/static/sql,null}
16/11/27 03:48:50 INFO handler.ContextHandler: stopped o.s.j.s.ServletContextHandler{/SQL26/execution/json,null}
16/11/27 03:48:50 INFO handler.ContextHandler: stopped o.s.j.s.ServletContextHandler{/SQL26/execution,null}
16/11/27 03:48:50 INFO handler.ContextHandler: stopped o.s.j.s.ServletContextHandler{/SQL26/json,null}
16/11/27 03:48:50 INFO handler.ContextHandler: stopped o.s.j.s.ServletContextHandler{/SQL26,null}
16/11/27 03:48:50 INFO handler.ContextHandler: stopped o.s.j.s.ServletContextHandler{/static/sql,null}
16/11/27 03:48:50 INFO handler.ContextHandler: stopped o.s.j.s.ServletContextHandler{/SQL25/execution/json,null}
16/11/27 03:48:50 INFO handler.ContextHandler: stopped o.s.j.s.ServletContextHandler{/SQL25/execution,null}
16/11/27 03:48:50 INFO handler.ContextHandler: stopped o.s.j.s.ServletContextHandler{/SQL25/json,null}
16/11/27 03:48:50 INFO handler.ContextHandler: stopped o.s.j.s.ServletContextHandler{/SQL25,null}
16/11/27 03:48:50 INFO handler.ContextHandler: stopped o.s.j.s.ServletContextHandler{/static/sql,null}
16/11/27 03:48:50 INFO handler.ContextHandler: stopped o.s.j.s.ServletContextHandler{/SQL24/execution/json,null}
16/11/27 03:48:50 INFO handler.ContextHandler: stopped o.s.j.s.ServletContextHandler{/SQL24/execution,null}
16/11/27 03:48:50 INFO handler.ContextHandler: stopped o.s.j.s.ServletContextHandler{/SQL24/json,null}
16/11/27 03:48:50 INFO handler.ContextHandler: stopped o.s.j.s.ServletContextHandler{/SQL24,null}
16/11/27 03:48:50 INFO handler.ContextHandler: stopped o.s.j.s.ServletContextHandler{/static/sql,null}
16/11/27 03:48:50 INFO handler.ContextHandler: stopped o.s.j.s.ServletContextHandler{/SQL23/execution/json,null}
16/11/27 03:48:50 INFO handler.ContextHandler: stopped o.s.j.s.ServletContextHandler{/SQL23/execution,null}
16/11/27 03:48:50 INFO handler.ContextHandler: stopped o.s.j.s.ServletContextHandler{/SQL23/json,null}
16/11/27 03:48:50 INFO handler.ContextHandler: stopped o.s.j.s.ServletContextHandler{/SQL23,null}
16/11/27 03:48:50 INFO handler.ContextHandler: stopped o.s.j.s.ServletContextHandler{/static/sql,null}
16/11/27 03:48:50 INFO handler.ContextHandler: stopped o.s.j.s.ServletContextHandler{/SQL22/execution/json,null}
16/11/27 03:48:50 INFO handler.ContextHandler: stopped o.s.j.s.ServletContextHandler{/SQL22/execution,null}
16/11/27 03:48:50 INFO handler.ContextHandler: stopped o.s.j.s.ServletContextHandler{/SQL22/json,null}
16/11/27 03:48:50 INFO handler.ContextHandler: stopped o.s.j.s.ServletContextHandler{/SQL22,null}
16/11/27 03:48:50 INFO handler.ContextHandler: stopped o.s.j.s.ServletContextHandler{/static/sql,null}
16/11/27 03:48:50 INFO handler.ContextHandler: stopped o.s.j.s.ServletContextHandler{/SQL21/execution/json,null}
16/11/27 03:48:50 INFO handler.ContextHandler: stopped o.s.j.s.ServletContextHandler{/SQL21/execution,null}
16/11/27 03:48:50 INFO handler.ContextHandler: stopped o.s.j.s.ServletContextHandler{/SQL21/json,null}
16/11/27 03:48:50 INFO handler.ContextHandler: stopped o.s.j.s.ServletContextHandler{/SQL21,null}
16/11/27 03:48:50 INFO handler.ContextHandler: stopped o.s.j.s.ServletContextHandler{/static/sql,null}
16/11/27 03:48:50 INFO handler.ContextHandler: stopped o.s.j.s.ServletContextHandler{/SQL20/execution/json,null}
16/11/27 03:48:50 INFO handler.ContextHandler: stopped o.s.j.s.ServletContextHandler{/SQL20/execution,null}
16/11/27 03:48:50 INFO handler.ContextHandler: stopped o.s.j.s.ServletContextHandler{/SQL20/json,null}
16/11/27 03:48:50 INFO handler.ContextHandler: stopped o.s.j.s.ServletContextHandler{/SQL20,null}
16/11/27 03:48:50 INFO handler.ContextHandler: stopped o.s.j.s.ServletContextHandler{/static/sql,null}
16/11/27 03:48:50 INFO handler.ContextHandler: stopped o.s.j.s.ServletContextHandler{/SQL19/execution/json,null}
16/11/27 03:48:50 INFO handler.ContextHandler: stopped o.s.j.s.ServletContextHandler{/SQL19/execution,null}
16/11/27 03:48:50 INFO handler.ContextHandler: stopped o.s.j.s.ServletContextHandler{/SQL19/json,null}
16/11/27 03:48:50 INFO handler.ContextHandler: stopped o.s.j.s.ServletContextHandler{/SQL19,null}
16/11/27 03:48:50 INFO handler.ContextHandler: stopped o.s.j.s.ServletContextHandler{/static/sql,null}
16/11/27 03:48:50 INFO handler.ContextHandler: stopped o.s.j.s.ServletContextHandler{/SQL18/execution/json,null}
16/11/27 03:48:50 INFO handler.ContextHandler: stopped o.s.j.s.ServletContextHandler{/SQL18/execution,null}
16/11/27 03:48:50 INFO handler.ContextHandler: stopped o.s.j.s.ServletContextHandler{/SQL18/json,null}
16/11/27 03:48:50 INFO handler.ContextHandler: stopped o.s.j.s.ServletContextHandler{/SQL18,null}
16/11/27 03:48:50 INFO handler.ContextHandler: stopped o.s.j.s.ServletContextHandler{/static/sql,null}
16/11/27 03:48:50 INFO handler.ContextHandler: stopped o.s.j.s.ServletContextHandler{/SQL17/execution/json,null}
16/11/27 03:48:50 INFO handler.ContextHandler: stopped o.s.j.s.ServletContextHandler{/SQL17/execution,null}
16/11/27 03:48:50 INFO handler.ContextHandler: stopped o.s.j.s.ServletContextHandler{/SQL17/json,null}
16/11/27 03:48:50 INFO handler.ContextHandler: stopped o.s.j.s.ServletContextHandler{/SQL17,null}
16/11/27 03:48:50 INFO handler.ContextHandler: stopped o.s.j.s.ServletContextHandler{/static/sql,null}
16/11/27 03:48:50 INFO handler.ContextHandler: stopped o.s.j.s.ServletContextHandler{/SQL16/execution/json,null}
16/11/27 03:48:50 INFO handler.ContextHandler: stopped o.s.j.s.ServletContextHandler{/SQL16/execution,null}
16/11/27 03:48:50 INFO handler.ContextHandler: stopped o.s.j.s.ServletContextHandler{/SQL16/json,null}
16/11/27 03:48:50 INFO handler.ContextHandler: stopped o.s.j.s.ServletContextHandler{/SQL16,null}
16/11/27 03:48:50 INFO handler.ContextHandler: stopped o.s.j.s.ServletContextHandler{/static/sql,null}
16/11/27 03:48:50 INFO handler.ContextHandler: stopped o.s.j.s.ServletContextHandler{/SQL15/execution/json,null}
16/11/27 03:48:50 INFO handler.ContextHandler: stopped o.s.j.s.ServletContextHandler{/SQL15/execution,null}
16/11/27 03:48:50 INFO handler.ContextHandler: stopped o.s.j.s.ServletContextHandler{/SQL15/json,null}
16/11/27 03:48:50 INFO handler.ContextHandler: stopped o.s.j.s.ServletContextHandler{/SQL15,null}
16/11/27 03:48:50 INFO handler.ContextHandler: stopped o.s.j.s.ServletContextHandler{/static/sql,null}
16/11/27 03:48:50 INFO handler.ContextHandler: stopped o.s.j.s.ServletContextHandler{/SQL14/execution/json,null}
16/11/27 03:48:50 INFO handler.ContextHandler: stopped o.s.j.s.ServletContextHandler{/SQL14/execution,null}
16/11/27 03:48:50 INFO handler.ContextHandler: stopped o.s.j.s.ServletContextHandler{/SQL14/json,null}
16/11/27 03:48:50 INFO handler.ContextHandler: stopped o.s.j.s.ServletContextHandler{/SQL14,null}
16/11/27 03:48:50 INFO handler.ContextHandler: stopped o.s.j.s.ServletContextHandler{/static/sql,null}
16/11/27 03:48:50 INFO handler.ContextHandler: stopped o.s.j.s.ServletContextHandler{/SQL13/execution/json,null}
16/11/27 03:48:50 INFO handler.ContextHandler: stopped o.s.j.s.ServletContextHandler{/SQL13/execution,null}
16/11/27 03:48:50 INFO handler.ContextHandler: stopped o.s.j.s.ServletContextHandler{/SQL13/json,null}
16/11/27 03:48:50 INFO handler.ContextHandler: stopped o.s.j.s.ServletContextHandler{/SQL13,null}
16/11/27 03:48:50 INFO handler.ContextHandler: stopped o.s.j.s.ServletContextHandler{/static/sql,null}
16/11/27 03:48:50 INFO handler.ContextHandler: stopped o.s.j.s.ServletContextHandler{/SQL12/execution/json,null}
16/11/27 03:48:50 INFO handler.ContextHandler: stopped o.s.j.s.ServletContextHandler{/SQL12/execution,null}
16/11/27 03:48:50 INFO handler.ContextHandler: stopped o.s.j.s.ServletContextHandler{/SQL12/json,null}
16/11/27 03:48:50 INFO handler.ContextHandler: stopped o.s.j.s.ServletContextHandler{/SQL12,null}
16/11/27 03:48:50 INFO handler.ContextHandler: stopped o.s.j.s.ServletContextHandler{/metrics/json,null}
16/11/27 03:48:50 INFO handler.ContextHandler: stopped o.s.j.s.ServletContextHandler{/stages/stage/kill,null}
16/11/27 03:48:50 INFO handler.ContextHandler: stopped o.s.j.s.ServletContextHandler{/api,null}
16/11/27 03:48:50 INFO handler.ContextHandler: stopped o.s.j.s.ServletContextHandler{/,null}
16/11/27 03:48:50 INFO handler.ContextHandler: stopped o.s.j.s.ServletContextHandler{/static,null}
16/11/27 03:48:50 INFO handler.ContextHandler: stopped o.s.j.s.ServletContextHandler{/executors/threadDump/json,null}
16/11/27 03:48:50 INFO handler.ContextHandler: stopped o.s.j.s.ServletContextHandler{/executors/threadDump,null}
16/11/27 03:48:50 INFO handler.ContextHandler: stopped o.s.j.s.ServletContextHandler{/executors/json,null}
16/11/27 03:48:50 INFO handler.ContextHandler: stopped o.s.j.s.ServletContextHandler{/executors,null}
16/11/27 03:48:50 INFO handler.ContextHandler: stopped o.s.j.s.ServletContextHandler{/environment/json,null}
16/11/27 03:48:50 INFO handler.ContextHandler: stopped o.s.j.s.ServletContextHandler{/environment,null}
16/11/27 03:48:50 INFO handler.ContextHandler: stopped o.s.j.s.ServletContextHandler{/storage/rdd/json,null}
16/11/27 03:48:50 INFO handler.ContextHandler: stopped o.s.j.s.ServletContextHandler{/storage/rdd,null}
16/11/27 03:48:50 INFO handler.ContextHandler: stopped o.s.j.s.ServletContextHandler{/storage/json,null}
16/11/27 03:48:50 INFO handler.ContextHandler: stopped o.s.j.s.ServletContextHandler{/storage,null}
16/11/27 03:48:50 INFO handler.ContextHandler: stopped o.s.j.s.ServletContextHandler{/stages/pool/json,null}
16/11/27 03:48:50 INFO handler.ContextHandler: stopped o.s.j.s.ServletContextHandler{/stages/pool,null}
16/11/27 03:48:50 INFO handler.ContextHandler: stopped o.s.j.s.ServletContextHandler{/stages/stage/json,null}
16/11/27 03:48:50 INFO handler.ContextHandler: stopped o.s.j.s.ServletContextHandler{/stages/stage,null}
16/11/27 03:48:50 INFO handler.ContextHandler: stopped o.s.j.s.ServletContextHandler{/stages/json,null}
16/11/27 03:48:50 INFO handler.ContextHandler: stopped o.s.j.s.ServletContextHandler{/stages,null}
16/11/27 03:48:50 INFO handler.ContextHandler: stopped o.s.j.s.ServletContextHandler{/jobs/job/json,null}
16/11/27 03:48:50 INFO handler.ContextHandler: stopped o.s.j.s.ServletContextHandler{/jobs/job,null}
16/11/27 03:48:50 INFO handler.ContextHandler: stopped o.s.j.s.ServletContextHandler{/jobs/json,null}
16/11/27 03:48:50 INFO handler.ContextHandler: stopped o.s.j.s.ServletContextHandler{/jobs,null}
16/11/27 03:48:50 INFO ui.SparkUI: Stopped Spark web UI at http://localhost:4040
16/11/27 03:48:50 INFO spark.MapOutputTrackerMasterEndpoint: MapOutputTrackerMasterEndpoint
stopped!
16/11/27 03:48:50 INFO storage.MemoryStore: MemoryStore cleared
16/11/27 03:48:50 INFO storage.BlockManager: BlockManager stopped
16/11/27 03:48:50 INFO storage.BlockManagerMaster: BlockManagerMaster stopped
16/11/27 03:48:50 INFO scheduler.OutputCommitCoordinator$OutputCommitCoordinatorEndpoint:
OutputCommitCoordinator stopped!
16/11/27 03:48:50 INFO remote.RemoteActorRefProvider$RemotingTerminator: Shutting down remote
daemon.
16/11/27 03:48:50 INFO remote.RemoteActorRefProvider$RemotingTerminator: Remote daemon shut
down; proceeding with flushing remote transports.
16/11/27 03:48:50 INFO spark.SparkContext: Successfully stopped SparkContext
Running org.apache.sysml.test.integration.mlcontext.MLContextTest
16/11/27 03:48:50 INFO remote.RemoteActorRefProvider$RemotingTerminator: Remoting shut down.
Tests run: 130, Failures: 0, Errors: 0, Skipped: 0, Time elapsed: 46.339 sec - in org.apache.sysml.test.integration.mlcontext.MLContextTest
16/11/27 03:48:50 INFO util.ShutdownHookManager: Shutdown hook called
16/11/27 03:48:50 INFO util.ShutdownHookManager: Deleting directory /tmp/spark-0d2b149f-7f97-4d71-a75b-aa100d0db9a9
Running org.apache.sysml.test.integration.functions.quaternary.WeightedSigmoidTest
Tests run: 56, Failures: 0, Errors: 0, Skipped: 0, Time elapsed: 1,014.068 sec - in org.apache.sysml.test.integration.functions.quaternary.WeightedSigmoidTest
16/11/27 03:50:36 INFO util.ShutdownHookManager: Shutdown hook called
16/11/27 03:50:36 INFO util.ShutdownHookManager: Deleting directory /tmp/spark-06deaee3-84f8-4651-9d6e-ae523fd8bda3
Running org.apache.sysml.test.integration.functions.indexing.LeftIndexingTest
Tests run: 3, Failures: 0, Errors: 0, Skipped: 0, Time elapsed: 662.98 sec - in org.apache.sysml.test.integration.functions.indexing.LeftIndexingTest
Running org.apache.sysml.test.integration.applications.parfor.ParForCorrelationTest
Tests run: 12, Failures: 0, Errors: 0, Skipped: 0, Time elapsed: 269.908 sec - in org.apache.sysml.test.integration.applications.parfor.ParForCorrelationTest
Running org.apache.sysml.test.integration.applications.descriptivestats.UnivariateUnweightedScaleDenseTest
Tests run: 24, Failures: 0, Errors: 0, Skipped: 0, Time elapsed: 329.168 sec - in org.apache.sysml.test.integration.applications.descriptivestats.UnivariateUnweightedScaleDenseTest
Running org.apache.sysml.test.integration.functions.reorg.FullOrderTest
Tests run: 132, Failures: 0, Errors: 0, Skipped: 0, Time elapsed: 1,366.84 sec - in org.apache.sysml.test.integration.functions.reorg.FullOrderTest
Running org.apache.sysml.test.integration.applications.parfor.ParForCorrelationTestLarge
Tests run: 2, Failures: 0, Errors: 0, Skipped: 0, Time elapsed: 47.004 sec - in org.apache.sysml.test.integration.applications.parfor.ParForCorrelationTestLarge
Running org.apache.sysml.test.integration.functions.quaternary.WeightedDivMatrixMultTest
Tests run: 90, Failures: 0, Errors: 0, Skipped: 0, Time elapsed: 1,503.642 sec - in org.apache.sysml.test.integration.functions.quaternary.WeightedDivMatrixMultTest
16/11/27 03:58:10 INFO util.ShutdownHookManager: Shutdown hook called
16/11/27 03:58:10 INFO util.ShutdownHookManager: Deleting directory /tmp/spark-b48e387c-bca2-4c47-96d1-db5539ab0863
Running org.apache.sysml.test.integration.applications.descriptivestats.UnivariateWeightedScaleDenseTest
Tests run: 24, Failures: 0, Errors: 0, Skipped: 0, Time elapsed: 359.705 sec - in org.apache.sysml.test.integration.applications.descriptivestats.UnivariateWeightedScaleDenseTest
Running org.apache.sysml.test.integration.functions.append.AppendChainTest
Tests run: 12, Failures: 0, Errors: 0, Skipped: 0, Time elapsed: 1,088.989 sec - in org.apache.sysml.test.integration.functions.append.AppendChainTest
Running org.apache.sysml.test.integration.applications.parfor.ParForNaiveBayesTest
Tests run: 10, Failures: 0, Errors: 0, Skipped: 0, Time elapsed: 521.418 sec - in org.apache.sysml.test.integration.applications.parfor.ParForNaiveBayesTest
Running org.apache.sysml.test.integration.applications.descriptivestats.UnivariateUnweightedScaleSparseTest
Tests run: 24, Failures: 0, Errors: 0, Skipped: 0, Time elapsed: 296.426 sec - in org.apache.sysml.test.integration.applications.descriptivestats.UnivariateUnweightedScaleSparseTest
Running org.apache.sysml.test.integration.applications.dml.HITSDMLTest
Tests run: 1, Failures: 0, Errors: 0, Skipped: 0, Time elapsed: 85.939 sec - in org.apache.sysml.test.integration.applications.dml.HITSDMLTest
Running org.apache.sysml.test.integration.functions.append.AppendMatrixTest
Tests run: 22, Failures: 0, Errors: 0, Skipped: 0, Time elapsed: 1,412.485 sec - in org.apache.sysml.test.integration.functions.append.AppendMatrixTest
Running org.apache.sysml.test.integration.applications.descriptivestats.UnivariateWeightedScaleSparseTest
Tests run: 24, Failures: 0, Errors: 0, Skipped: 0, Time elapsed: 347.386 sec - in org.apache.sysml.test.integration.applications.descriptivestats.UnivariateWeightedScaleSparseTest
Running org.apache.sysml.test.integration.applications.pydml.ArimaPyDMLTest
Tests run: 1, Failures: 0, Errors: 0, Skipped: 0, Time elapsed: 50.213 sec - in org.apache.sysml.test.integration.applications.pydml.ArimaPyDMLTest
Running org.apache.sysml.test.integration.applications.pydml.HITSPyDMLTest
Tests run: 1, Failures: 0, Errors: 0, Skipped: 0, Time elapsed: 78.353 sec - in org.apache.sysml.test.integration.applications.pydml.HITSPyDMLTest
Running org.apache.sysml.test.integration.applications.dml.LinearRegressionDMLTest
Tests run: 7, Failures: 0, Errors: 0, Skipped: 0, Time elapsed: 51.32 sec - in org.apache.sysml.test.integration.applications.dml.LinearRegressionDMLTest
Running org.apache.sysml.test.integration.applications.pydml.CsplineDSPyDMLTest
Tests run: 3, Failures: 0, Errors: 0, Skipped: 0, Time elapsed: 6.88 sec - in org.apache.sysml.test.integration.applications.pydml.CsplineDSPyDMLTest
Running org.apache.sysml.test.integration.applications.pydml.LinearLogRegPyDMLTest
Tests run: 7, Failures: 0, Errors: 0, Skipped: 0, Time elapsed: 83.098 sec - in org.apache.sysml.test.integration.applications.pydml.LinearLogRegPyDMLTest
Running org.apache.sysml.test.integration.applications.pydml.NaiveBayesPyDMLTest
Tests run: 6, Failures: 0, Errors: 0, Skipped: 0, Time elapsed: 81.286 sec - in org.apache.sysml.test.integration.applications.pydml.NaiveBayesPyDMLTest
Running org.apache.sysml.test.integration.applications.dml.CsplineCGDMLTest
Tests run: 3, Failures: 0, Errors: 0, Skipped: 0, Time elapsed: 13.023 sec - in org.apache.sysml.test.integration.applications.dml.CsplineCGDMLTest
Running org.apache.sysml.test.integration.applications.dml.L2SVMDMLTest
Tests run: 9, Failures: 0, Errors: 0, Skipped: 0, Time elapsed: 65.04 sec - in org.apache.sysml.test.integration.applications.dml.L2SVMDMLTest
Running org.apache.sysml.test.integration.applications.pydml.MDABivariateStatsPyDMLTest
Tests run: 4, Failures: 0, Errors: 0, Skipped: 0, Time elapsed: 293.512 sec - in org.apache.sysml.test.integration.applications.pydml.MDABivariateStatsPyDMLTest
Running org.apache.sysml.test.integration.applications.pydml.PageRankPyDMLTest
Tests run: 3, Failures: 0, Errors: 0, Skipped: 0, Time elapsed: 6.223 sec - in org.apache.sysml.test.integration.applications.pydml.PageRankPyDMLTest
Running org.apache.sysml.test.integration.applications.pydml.NaiveBayesParforPyDMLTest
Tests run: 6, Failures: 0, Errors: 0, Skipped: 0, Time elapsed: 81.32 sec - in org.apache.sysml.test.integration.applications.pydml.NaiveBayesParforPyDMLTest
Running org.apache.sysml.test.integration.applications.dml.NaiveBayesDMLTest
Tests run: 6, Failures: 0, Errors: 0, Skipped: 0, Time elapsed: 81.51 sec - in org.apache.sysml.test.integration.applications.dml.NaiveBayesDMLTest
Running org.apache.sysml.test.integration.applications.dml.MDABivariateStatsDMLTest
Tests run: 4, Failures: 0, Errors: 0, Skipped: 0, Time elapsed: 294.098 sec - in org.apache.sysml.test.integration.applications.dml.MDABivariateStatsDMLTest
Running org.apache.sysml.test.integration.applications.dml.PageRankDMLTest
Tests run: 3, Failures: 0, Errors: 0, Skipped: 0, Time elapsed: 6.281 sec - in org.apache.sysml.test.integration.applications.dml.PageRankDMLTest
Running org.apache.sysml.test.integration.applications.pydml.GLMPyDMLTest
Tests run: 30, Failures: 0, Errors: 0, Skipped: 0, Time elapsed: 585.738 sec - in org.apache.sysml.test.integration.applications.pydml.GLMPyDMLTest
Running org.apache.sysml.test.integration.applications.pydml.MultiClassSVMPyDMLTest
Tests run: 9, Failures: 0, Errors: 0, Skipped: 0, Time elapsed: 87.802 sec - in org.apache.sysml.test.integration.applications.pydml.MultiClassSVMPyDMLTest
Running org.apache.sysml.test.integration.applications.dml.ID3DMLTest
Tests run: 2, Failures: 0, Errors: 0, Skipped: 0, Time elapsed: 374.31 sec - in org.apache.sysml.test.integration.applications.dml.ID3DMLTest
Running org.apache.sysml.test.integration.applications.dml.GLMDMLTest
Tests run: 30, Failures: 0, Errors: 0, Skipped: 0, Time elapsed: 859.753 sec - in org.apache.sysml.test.integration.applications.dml.GLMDMLTest
Running org.apache.sysml.test.integration.applications.pydml.CsplineCGPyDMLTest
Tests run: 3, Failures: 0, Errors: 0, Skipped: 0, Time elapsed: 6.252 sec - in org.apache.sysml.test.integration.applications.pydml.CsplineCGPyDMLTest
Running org.apache.sysml.test.integration.applications.pydml.WelchTPyDMLTest
Tests run: 3, Failures: 0, Errors: 0, Skipped: 0, Time elapsed: 6.612 sec - in org.apache.sysml.test.integration.applications.pydml.WelchTPyDMLTest
Running org.apache.sysml.test.integration.applications.dml.MultiClassSVMDMLTest
Tests run: 9, Failures: 0, Errors: 0, Skipped: 0, Time elapsed: 89.803 sec - in org.apache.sysml.test.integration.applications.dml.MultiClassSVMDMLTest
Running org.apache.sysml.test.integration.applications.dml.CsplineDSDMLTest
Tests run: 3, Failures: 0, Errors: 0, Skipped: 0, Time elapsed: 10.785 sec - in org.apache.sysml.test.integration.applications.dml.CsplineDSDMLTest
Running org.apache.sysml.test.integration.applications.pydml.ApplyTransformPyDMLTest
Tests run: 7, Failures: 0, Errors: 0, Skipped: 0, Time elapsed: 1.258 sec - in org.apache.sysml.test.integration.applications.pydml.ApplyTransformPyDMLTest
Running org.apache.sysml.test.integration.applications.dml.NaiveBayesParforDMLTest
Tests run: 6, Failures: 0, Errors: 0, Skipped: 0, Time elapsed: 81.42 sec - in org.apache.sysml.test.integration.applications.dml.NaiveBayesParforDMLTest
Running org.apache.sysml.test.integration.applications.pydml.L2SVMPyDMLTest
Tests run: 9, Failures: 0, Errors: 0, Skipped: 0, Time elapsed: 64.457 sec - in org.apache.sysml.test.integration.applications.pydml.L2SVMPyDMLTest
Running org.apache.sysml.test.integration.applications.pydml.LinearRegressionPyDMLTest
Tests run: 7, Failures: 0, Errors: 0, Skipped: 0, Time elapsed: 51.935 sec - in org.apache.sysml.test.integration.applications.pydml.LinearRegressionPyDMLTest
Running org.apache.sysml.test.integration.applications.dml.LinearLogRegDMLTest
Tests run: 7, Failures: 0, Errors: 0, Skipped: 0, Time elapsed: 61.586 sec - in org.apache.sysml.test.integration.applications.dml.LinearLogRegDMLTest
Running org.apache.sysml.test.integration.applications.dml.GNMFDMLTest
Tests run: 3, Failures: 0, Errors: 0, Skipped: 0, Time elapsed: 66.526 sec - in org.apache.sysml.test.integration.applications.dml.GNMFDMLTest
Running org.apache.sysml.test.integration.applications.dml.WelchTDMLTest
Tests run: 3, Failures: 0, Errors: 0, Skipped: 0, Time elapsed: 6.538 sec - in org.apache.sysml.test.integration.applications.dml.WelchTDMLTest
Running org.apache.sysml.test.integration.applications.dml.ApplyTransformDMLTest
Tests run: 7, Failures: 0, Errors: 0, Skipped: 0, Time elapsed: 13.285 sec - in org.apache.sysml.test.integration.applications.dml.ApplyTransformDMLTest
Running org.apache.sysml.test.integration.applications.pydml.ID3PyDMLTest
Tests run: 2, Failures: 0, Errors: 0, Skipped: 0, Time elapsed: 331.088 sec - in org.apache.sysml.test.integration.applications.pydml.ID3PyDMLTest
Running org.apache.sysml.test.integration.applications.pydml.GNMFPyDMLTest
Tests run: 3, Failures: 0, Errors: 0, Skipped: 0, Time elapsed: 58.487 sec - in org.apache.sysml.test.integration.applications.pydml.GNMFPyDMLTest

Results :

Failed tests: 
  FullReblockTest.testTextCellSingeMSparseMR:161->runReblockTest:479 37 values are not
in equal

Tests run: 6392, Failures: 1, Errors: 0, Skipped: 0

[INFO] 
[INFO] --- maven-failsafe-plugin:2.17:verify (default) @ systemml ---
[INFO] Failsafe report directory: <https://sparktc.ibmcloud.com/jenkins/job/SystemML-DailyTest/ws/target/failsafe-reports>
[INFO] ------------------------------------------------------------------------
[INFO] BUILD FAILURE
[INFO] ------------------------------------------------------------------------
[INFO] Total time: 02:22 h
[INFO] Finished at: 2016-11-27T04:54:38-06:00
[INFO] Final Memory: 59M/2366M
[INFO] ------------------------------------------------------------------------
[ERROR] Failed to execute goal org.apache.maven.plugins:maven-failsafe-plugin:2.17:verify
(default) on project systemml: There are test failures.
[ERROR] 
[ERROR] Please refer to <https://sparktc.ibmcloud.com/jenkins/job/SystemML-DailyTest/ws/target/failsafe-reports>
for the individual test results.
[ERROR] -> [Help 1]
[ERROR] 
[ERROR] To see the full stack trace of the errors, re-run Maven with the -e switch.
[ERROR] Re-run Maven using the -X switch to enable full debug logging.
[ERROR] 
[ERROR] For more information about the errors and possible solutions, please read the following
articles:
[ERROR] [Help 1] http://cwiki.apache.org/confluence/display/MAVEN/MojoFailureException
Build step 'Execute shell' marked build as failure
Run condition [Always] enabling perform for step [[]]

Mime
View raw message