systemml-dev mailing list archives

Site index · List index
Message view « Date » · « Thread »
Top « Date » · « Thread »
From jenk...@spark.tc
Subject Build failed in Jenkins: SystemML-DailyTest #631
Date Thu, 17 Nov 2016 01:03:33 GMT
See <https://sparktc.ibmcloud.com/jenkins/job/SystemML-DailyTest/631/>

------------------------------------------
[...truncated 9857 lines...]
16/11/16 17:57:03 INFO handler.ContextHandler: stopped o.s.j.s.ServletContextHandler{/SQL28/json,null}
16/11/16 17:57:03 INFO handler.ContextHandler: stopped o.s.j.s.ServletContextHandler{/SQL28,null}
16/11/16 17:57:03 INFO handler.ContextHandler: stopped o.s.j.s.ServletContextHandler{/static/sql,null}
16/11/16 17:57:03 INFO handler.ContextHandler: stopped o.s.j.s.ServletContextHandler{/SQL27/execution/json,null}
16/11/16 17:57:03 INFO handler.ContextHandler: stopped o.s.j.s.ServletContextHandler{/SQL27/execution,null}
16/11/16 17:57:03 INFO handler.ContextHandler: stopped o.s.j.s.ServletContextHandler{/SQL27/json,null}
16/11/16 17:57:03 INFO handler.ContextHandler: stopped o.s.j.s.ServletContextHandler{/SQL27,null}
16/11/16 17:57:03 INFO handler.ContextHandler: stopped o.s.j.s.ServletContextHandler{/static/sql,null}
16/11/16 17:57:03 INFO handler.ContextHandler: stopped o.s.j.s.ServletContextHandler{/SQL26/execution/json,null}
16/11/16 17:57:03 INFO handler.ContextHandler: stopped o.s.j.s.ServletContextHandler{/SQL26/execution,null}
16/11/16 17:57:03 INFO handler.ContextHandler: stopped o.s.j.s.ServletContextHandler{/SQL26/json,null}
16/11/16 17:57:03 INFO handler.ContextHandler: stopped o.s.j.s.ServletContextHandler{/SQL26,null}
16/11/16 17:57:03 INFO handler.ContextHandler: stopped o.s.j.s.ServletContextHandler{/static/sql,null}
16/11/16 17:57:03 INFO handler.ContextHandler: stopped o.s.j.s.ServletContextHandler{/SQL25/execution/json,null}
16/11/16 17:57:03 INFO handler.ContextHandler: stopped o.s.j.s.ServletContextHandler{/SQL25/execution,null}
16/11/16 17:57:03 INFO handler.ContextHandler: stopped o.s.j.s.ServletContextHandler{/SQL25/json,null}
16/11/16 17:57:03 INFO handler.ContextHandler: stopped o.s.j.s.ServletContextHandler{/SQL25,null}
16/11/16 17:57:03 INFO handler.ContextHandler: stopped o.s.j.s.ServletContextHandler{/static/sql,null}
16/11/16 17:57:03 INFO handler.ContextHandler: stopped o.s.j.s.ServletContextHandler{/SQL24/execution/json,null}
16/11/16 17:57:03 INFO handler.ContextHandler: stopped o.s.j.s.ServletContextHandler{/SQL24/execution,null}
16/11/16 17:57:03 INFO handler.ContextHandler: stopped o.s.j.s.ServletContextHandler{/SQL24/json,null}
16/11/16 17:57:03 INFO handler.ContextHandler: stopped o.s.j.s.ServletContextHandler{/SQL24,null}
16/11/16 17:57:03 INFO handler.ContextHandler: stopped o.s.j.s.ServletContextHandler{/static/sql,null}
16/11/16 17:57:03 INFO handler.ContextHandler: stopped o.s.j.s.ServletContextHandler{/SQL23/execution/json,null}
16/11/16 17:57:03 INFO handler.ContextHandler: stopped o.s.j.s.ServletContextHandler{/SQL23/execution,null}
16/11/16 17:57:03 INFO handler.ContextHandler: stopped o.s.j.s.ServletContextHandler{/SQL23/json,null}
16/11/16 17:57:03 INFO handler.ContextHandler: stopped o.s.j.s.ServletContextHandler{/SQL23,null}
16/11/16 17:57:03 INFO handler.ContextHandler: stopped o.s.j.s.ServletContextHandler{/static/sql,null}
16/11/16 17:57:03 INFO handler.ContextHandler: stopped o.s.j.s.ServletContextHandler{/SQL22/execution/json,null}
16/11/16 17:57:03 INFO handler.ContextHandler: stopped o.s.j.s.ServletContextHandler{/SQL22/execution,null}
16/11/16 17:57:03 INFO handler.ContextHandler: stopped o.s.j.s.ServletContextHandler{/SQL22/json,null}
16/11/16 17:57:03 INFO handler.ContextHandler: stopped o.s.j.s.ServletContextHandler{/SQL22,null}
16/11/16 17:57:03 INFO handler.ContextHandler: stopped o.s.j.s.ServletContextHandler{/static/sql,null}
16/11/16 17:57:03 INFO handler.ContextHandler: stopped o.s.j.s.ServletContextHandler{/SQL21/execution/json,null}
16/11/16 17:57:03 INFO handler.ContextHandler: stopped o.s.j.s.ServletContextHandler{/SQL21/execution,null}
16/11/16 17:57:03 INFO handler.ContextHandler: stopped o.s.j.s.ServletContextHandler{/SQL21/json,null}
16/11/16 17:57:03 INFO handler.ContextHandler: stopped o.s.j.s.ServletContextHandler{/SQL21,null}
16/11/16 17:57:03 INFO handler.ContextHandler: stopped o.s.j.s.ServletContextHandler{/static/sql,null}
16/11/16 17:57:03 INFO handler.ContextHandler: stopped o.s.j.s.ServletContextHandler{/SQL20/execution/json,null}
16/11/16 17:57:03 INFO handler.ContextHandler: stopped o.s.j.s.ServletContextHandler{/SQL20/execution,null}
16/11/16 17:57:03 INFO handler.ContextHandler: stopped o.s.j.s.ServletContextHandler{/SQL20/json,null}
16/11/16 17:57:03 INFO handler.ContextHandler: stopped o.s.j.s.ServletContextHandler{/SQL20,null}
16/11/16 17:57:03 INFO handler.ContextHandler: stopped o.s.j.s.ServletContextHandler{/static/sql,null}
16/11/16 17:57:03 INFO handler.ContextHandler: stopped o.s.j.s.ServletContextHandler{/SQL19/execution/json,null}
16/11/16 17:57:03 INFO handler.ContextHandler: stopped o.s.j.s.ServletContextHandler{/SQL19/execution,null}
16/11/16 17:57:03 INFO handler.ContextHandler: stopped o.s.j.s.ServletContextHandler{/SQL19/json,null}
16/11/16 17:57:03 INFO handler.ContextHandler: stopped o.s.j.s.ServletContextHandler{/SQL19,null}
16/11/16 17:57:03 INFO handler.ContextHandler: stopped o.s.j.s.ServletContextHandler{/static/sql,null}
16/11/16 17:57:03 INFO handler.ContextHandler: stopped o.s.j.s.ServletContextHandler{/SQL18/execution/json,null}
16/11/16 17:57:03 INFO handler.ContextHandler: stopped o.s.j.s.ServletContextHandler{/SQL18/execution,null}
16/11/16 17:57:03 INFO handler.ContextHandler: stopped o.s.j.s.ServletContextHandler{/SQL18/json,null}
16/11/16 17:57:03 INFO handler.ContextHandler: stopped o.s.j.s.ServletContextHandler{/SQL18,null}
16/11/16 17:57:03 INFO handler.ContextHandler: stopped o.s.j.s.ServletContextHandler{/static/sql,null}
16/11/16 17:57:03 INFO handler.ContextHandler: stopped o.s.j.s.ServletContextHandler{/SQL17/execution/json,null}
16/11/16 17:57:03 INFO handler.ContextHandler: stopped o.s.j.s.ServletContextHandler{/SQL17/execution,null}
16/11/16 17:57:03 INFO handler.ContextHandler: stopped o.s.j.s.ServletContextHandler{/SQL17/json,null}
16/11/16 17:57:03 INFO handler.ContextHandler: stopped o.s.j.s.ServletContextHandler{/SQL17,null}
16/11/16 17:57:03 INFO handler.ContextHandler: stopped o.s.j.s.ServletContextHandler{/static/sql,null}
16/11/16 17:57:03 INFO handler.ContextHandler: stopped o.s.j.s.ServletContextHandler{/SQL16/execution/json,null}
16/11/16 17:57:03 INFO handler.ContextHandler: stopped o.s.j.s.ServletContextHandler{/SQL16/execution,null}
16/11/16 17:57:03 INFO handler.ContextHandler: stopped o.s.j.s.ServletContextHandler{/SQL16/json,null}
16/11/16 17:57:03 INFO handler.ContextHandler: stopped o.s.j.s.ServletContextHandler{/SQL16,null}
16/11/16 17:57:03 INFO handler.ContextHandler: stopped o.s.j.s.ServletContextHandler{/static/sql,null}
16/11/16 17:57:03 INFO handler.ContextHandler: stopped o.s.j.s.ServletContextHandler{/SQL15/execution/json,null}
16/11/16 17:57:03 INFO handler.ContextHandler: stopped o.s.j.s.ServletContextHandler{/SQL15/execution,null}
16/11/16 17:57:03 INFO handler.ContextHandler: stopped o.s.j.s.ServletContextHandler{/SQL15/json,null}
16/11/16 17:57:03 INFO handler.ContextHandler: stopped o.s.j.s.ServletContextHandler{/SQL15,null}
16/11/16 17:57:03 INFO handler.ContextHandler: stopped o.s.j.s.ServletContextHandler{/static/sql,null}
16/11/16 17:57:03 INFO handler.ContextHandler: stopped o.s.j.s.ServletContextHandler{/SQL14/execution/json,null}
16/11/16 17:57:03 INFO handler.ContextHandler: stopped o.s.j.s.ServletContextHandler{/SQL14/execution,null}
16/11/16 17:57:03 INFO handler.ContextHandler: stopped o.s.j.s.ServletContextHandler{/SQL14/json,null}
16/11/16 17:57:03 INFO handler.ContextHandler: stopped o.s.j.s.ServletContextHandler{/SQL14,null}
16/11/16 17:57:03 INFO handler.ContextHandler: stopped o.s.j.s.ServletContextHandler{/static/sql,null}
16/11/16 17:57:03 INFO handler.ContextHandler: stopped o.s.j.s.ServletContextHandler{/SQL13/execution/json,null}
16/11/16 17:57:03 INFO handler.ContextHandler: stopped o.s.j.s.ServletContextHandler{/SQL13/execution,null}
16/11/16 17:57:03 INFO handler.ContextHandler: stopped o.s.j.s.ServletContextHandler{/SQL13/json,null}
16/11/16 17:57:03 INFO handler.ContextHandler: stopped o.s.j.s.ServletContextHandler{/SQL13,null}
16/11/16 17:57:03 INFO handler.ContextHandler: stopped o.s.j.s.ServletContextHandler{/static/sql,null}
16/11/16 17:57:03 INFO handler.ContextHandler: stopped o.s.j.s.ServletContextHandler{/SQL12/execution/json,null}
16/11/16 17:57:03 INFO handler.ContextHandler: stopped o.s.j.s.ServletContextHandler{/SQL12/execution,null}
16/11/16 17:57:03 INFO handler.ContextHandler: stopped o.s.j.s.ServletContextHandler{/SQL12/json,null}
16/11/16 17:57:03 INFO handler.ContextHandler: stopped o.s.j.s.ServletContextHandler{/SQL12,null}
16/11/16 17:57:03 INFO handler.ContextHandler: stopped o.s.j.s.ServletContextHandler{/metrics/json,null}
16/11/16 17:57:03 INFO handler.ContextHandler: stopped o.s.j.s.ServletContextHandler{/stages/stage/kill,null}
16/11/16 17:57:03 INFO handler.ContextHandler: stopped o.s.j.s.ServletContextHandler{/api,null}
16/11/16 17:57:03 INFO handler.ContextHandler: stopped o.s.j.s.ServletContextHandler{/,null}
16/11/16 17:57:03 INFO handler.ContextHandler: stopped o.s.j.s.ServletContextHandler{/static,null}
16/11/16 17:57:03 INFO handler.ContextHandler: stopped o.s.j.s.ServletContextHandler{/executors/threadDump/json,null}
16/11/16 17:57:03 INFO handler.ContextHandler: stopped o.s.j.s.ServletContextHandler{/executors/threadDump,null}
16/11/16 17:57:03 INFO handler.ContextHandler: stopped o.s.j.s.ServletContextHandler{/executors/json,null}
16/11/16 17:57:03 INFO handler.ContextHandler: stopped o.s.j.s.ServletContextHandler{/executors,null}
16/11/16 17:57:03 INFO handler.ContextHandler: stopped o.s.j.s.ServletContextHandler{/environment/json,null}
16/11/16 17:57:03 INFO handler.ContextHandler: stopped o.s.j.s.ServletContextHandler{/environment,null}
16/11/16 17:57:03 INFO handler.ContextHandler: stopped o.s.j.s.ServletContextHandler{/storage/rdd/json,null}
16/11/16 17:57:03 INFO handler.ContextHandler: stopped o.s.j.s.ServletContextHandler{/storage/rdd,null}
16/11/16 17:57:03 INFO handler.ContextHandler: stopped o.s.j.s.ServletContextHandler{/storage/json,null}
16/11/16 17:57:03 INFO handler.ContextHandler: stopped o.s.j.s.ServletContextHandler{/storage,null}
16/11/16 17:57:03 INFO handler.ContextHandler: stopped o.s.j.s.ServletContextHandler{/stages/pool/json,null}
16/11/16 17:57:03 INFO handler.ContextHandler: stopped o.s.j.s.ServletContextHandler{/stages/pool,null}
16/11/16 17:57:03 INFO handler.ContextHandler: stopped o.s.j.s.ServletContextHandler{/stages/stage/json,null}
16/11/16 17:57:03 INFO handler.ContextHandler: stopped o.s.j.s.ServletContextHandler{/stages/stage,null}
16/11/16 17:57:03 INFO handler.ContextHandler: stopped o.s.j.s.ServletContextHandler{/stages/json,null}
16/11/16 17:57:03 INFO handler.ContextHandler: stopped o.s.j.s.ServletContextHandler{/stages,null}
16/11/16 17:57:03 INFO handler.ContextHandler: stopped o.s.j.s.ServletContextHandler{/jobs/job/json,null}
16/11/16 17:57:03 INFO handler.ContextHandler: stopped o.s.j.s.ServletContextHandler{/jobs/job,null}
16/11/16 17:57:03 INFO handler.ContextHandler: stopped o.s.j.s.ServletContextHandler{/jobs/json,null}
16/11/16 17:57:03 INFO handler.ContextHandler: stopped o.s.j.s.ServletContextHandler{/jobs,null}
16/11/16 17:57:03 INFO ui.SparkUI: Stopped Spark web UI at http://localhost:4040
16/11/16 17:57:03 INFO spark.MapOutputTrackerMasterEndpoint: MapOutputTrackerMasterEndpoint
stopped!
16/11/16 17:57:03 INFO storage.MemoryStore: MemoryStore cleared
16/11/16 17:57:03 INFO storage.BlockManager: BlockManager stopped
16/11/16 17:57:03 INFO storage.BlockManagerMaster: BlockManagerMaster stopped
16/11/16 17:57:03 INFO scheduler.OutputCommitCoordinator$OutputCommitCoordinatorEndpoint:
OutputCommitCoordinator stopped!
16/11/16 17:57:03 INFO remote.RemoteActorRefProvider$RemotingTerminator: Shutting down remote
daemon.
16/11/16 17:57:03 INFO remote.RemoteActorRefProvider$RemotingTerminator: Remote daemon shut
down; proceeding with flushing remote transports.
16/11/16 17:57:03 INFO spark.SparkContext: Successfully stopped SparkContext
Running org.apache.sysml.test.integration.mlcontext.MLContextTest
16/11/16 17:57:03 INFO remote.RemoteActorRefProvider$RemotingTerminator: Remoting shut down.
Tests run: 130, Failures: 0, Errors: 0, Skipped: 0, Time elapsed: 44.547 sec - in org.apache.sysml.test.integration.mlcontext.MLContextTest
16/11/16 17:57:03 INFO util.ShutdownHookManager: Shutdown hook called
16/11/16 17:57:03 INFO util.ShutdownHookManager: Deleting directory /tmp/spark-bcd39e45-94ba-49f2-9dfd-91faf42a2d13
Running org.apache.sysml.test.integration.functions.append.AppendVectorTest
Tests run: 6, Failures: 0, Errors: 0, Skipped: 0, Time elapsed: 418.427 sec - in org.apache.sysml.test.integration.functions.append.AppendVectorTest
Running org.apache.sysml.test.integration.functions.quaternary.WeightedSigmoidTest
Tests run: 56, Failures: 0, Errors: 0, Skipped: 0, Time elapsed: 1,013.29 sec - in org.apache.sysml.test.integration.functions.quaternary.WeightedSigmoidTest
16/11/16 17:58:41 INFO util.ShutdownHookManager: Shutdown hook called
16/11/16 17:58:41 INFO util.ShutdownHookManager: Deleting directory /tmp/spark-55ae6ff1-ccdb-4ee7-987c-16a428e052fa
Running org.apache.sysml.test.integration.functions.indexing.LeftIndexingTest
Tests run: 3, Failures: 0, Errors: 0, Skipped: 0, Time elapsed: 675.848 sec - in org.apache.sysml.test.integration.functions.indexing.LeftIndexingTest
Running org.apache.sysml.test.integration.applications.parfor.ParForCorrelationTest
Tests run: 12, Failures: 0, Errors: 0, Skipped: 0, Time elapsed: 267.213 sec - in org.apache.sysml.test.integration.applications.parfor.ParForCorrelationTest
Running org.apache.sysml.test.integration.applications.parfor.ParForCorrelationTestLarge
Tests run: 2, Failures: 0, Errors: 0, Skipped: 0, Time elapsed: 50.503 sec - in org.apache.sysml.test.integration.applications.parfor.ParForCorrelationTestLarge
Running org.apache.sysml.test.integration.applications.descriptivestats.UnivariateUnweightedScaleDenseTest
Tests run: 24, Failures: 0, Errors: 0, Skipped: 0, Time elapsed: 344.528 sec - in org.apache.sysml.test.integration.applications.descriptivestats.UnivariateUnweightedScaleDenseTest
Running org.apache.sysml.test.integration.functions.reorg.FullOrderTest
Tests run: 132, Failures: 0, Errors: 0, Skipped: 0, Time elapsed: 1,404.812 sec - in org.apache.sysml.test.integration.functions.reorg.FullOrderTest
Running org.apache.sysml.test.integration.functions.quaternary.WeightedDivMatrixMultTest
Tests run: 90, Failures: 0, Errors: 0, Skipped: 0, Time elapsed: 1,529.381 sec - in org.apache.sysml.test.integration.functions.quaternary.WeightedDivMatrixMultTest
16/11/16 18:06:24 INFO util.ShutdownHookManager: Shutdown hook called
16/11/16 18:06:24 INFO util.ShutdownHookManager: Deleting directory /tmp/spark-552d5e59-c1ff-447d-b9d1-af2f16f6d3ff
Running org.apache.sysml.test.integration.applications.descriptivestats.UnivariateWeightedScaleDenseTest
Tests run: 24, Failures: 0, Errors: 0, Skipped: 0, Time elapsed: 367.509 sec - in org.apache.sysml.test.integration.applications.descriptivestats.UnivariateWeightedScaleDenseTest
Running org.apache.sysml.test.integration.functions.append.AppendChainTest
Tests run: 12, Failures: 0, Errors: 0, Skipped: 0, Time elapsed: 1,099.491 sec - in org.apache.sysml.test.integration.functions.append.AppendChainTest
Running org.apache.sysml.test.integration.applications.parfor.ParForNaiveBayesTest
Tests run: 10, Failures: 0, Errors: 0, Skipped: 0, Time elapsed: 530.16 sec - in org.apache.sysml.test.integration.applications.parfor.ParForNaiveBayesTest
Running org.apache.sysml.test.integration.applications.descriptivestats.UnivariateUnweightedScaleSparseTest
Tests run: 24, Failures: 0, Errors: 0, Skipped: 0, Time elapsed: 299.251 sec - in org.apache.sysml.test.integration.applications.descriptivestats.UnivariateUnweightedScaleSparseTest
Running org.apache.sysml.test.integration.applications.dml.HITSDMLTest
Tests run: 1, Failures: 0, Errors: 0, Skipped: 0, Time elapsed: 83.557 sec - in org.apache.sysml.test.integration.applications.dml.HITSDMLTest
Running org.apache.sysml.test.integration.functions.append.AppendMatrixTest
Tests run: 22, Failures: 0, Errors: 0, Skipped: 0, Time elapsed: 1,485.979 sec - in org.apache.sysml.test.integration.functions.append.AppendMatrixTest
Running org.apache.sysml.test.integration.applications.descriptivestats.UnivariateWeightedScaleSparseTest
Tests run: 24, Failures: 0, Errors: 0, Skipped: 0, Time elapsed: 358.621 sec - in org.apache.sysml.test.integration.applications.descriptivestats.UnivariateWeightedScaleSparseTest
Running org.apache.sysml.test.integration.applications.pydml.ArimaPyDMLTest
Tests run: 1, Failures: 0, Errors: 0, Skipped: 0, Time elapsed: 49.503 sec - in org.apache.sysml.test.integration.applications.pydml.ArimaPyDMLTest
Running org.apache.sysml.test.integration.applications.pydml.HITSPyDMLTest
Tests run: 1, Failures: 0, Errors: 0, Skipped: 0, Time elapsed: 78.719 sec - in org.apache.sysml.test.integration.applications.pydml.HITSPyDMLTest
Running org.apache.sysml.test.integration.applications.dml.LinearRegressionDMLTest
Tests run: 7, Failures: 0, Errors: 0, Skipped: 0, Time elapsed: 55.852 sec - in org.apache.sysml.test.integration.applications.dml.LinearRegressionDMLTest
Running org.apache.sysml.test.integration.applications.pydml.CsplineDSPyDMLTest
Tests run: 3, Failures: 0, Errors: 0, Skipped: 0, Time elapsed: 6.916 sec - in org.apache.sysml.test.integration.applications.pydml.CsplineDSPyDMLTest
Running org.apache.sysml.test.integration.applications.pydml.LinearLogRegPyDMLTest
Tests run: 7, Failures: 0, Errors: 0, Skipped: 0, Time elapsed: 87.813 sec - in org.apache.sysml.test.integration.applications.pydml.LinearLogRegPyDMLTest
Running org.apache.sysml.test.integration.applications.pydml.NaiveBayesPyDMLTest
Tests run: 6, Failures: 0, Errors: 0, Skipped: 0, Time elapsed: 81.12 sec - in org.apache.sysml.test.integration.applications.pydml.NaiveBayesPyDMLTest
Running org.apache.sysml.test.integration.applications.dml.CsplineCGDMLTest
Tests run: 3, Failures: 0, Errors: 0, Skipped: 0, Time elapsed: 13.888 sec - in org.apache.sysml.test.integration.applications.dml.CsplineCGDMLTest
Running org.apache.sysml.test.integration.applications.dml.L2SVMDMLTest
Tests run: 9, Failures: 0, Errors: 0, Skipped: 0, Time elapsed: 63.572 sec - in org.apache.sysml.test.integration.applications.dml.L2SVMDMLTest
Running org.apache.sysml.test.integration.applications.pydml.MDABivariateStatsPyDMLTest
Tests run: 4, Failures: 0, Errors: 0, Skipped: 0, Time elapsed: 293.87 sec - in org.apache.sysml.test.integration.applications.pydml.MDABivariateStatsPyDMLTest
Running org.apache.sysml.test.integration.applications.pydml.PageRankPyDMLTest
Tests run: 3, Failures: 0, Errors: 0, Skipped: 0, Time elapsed: 6.3 sec - in org.apache.sysml.test.integration.applications.pydml.PageRankPyDMLTest
Running org.apache.sysml.test.integration.applications.pydml.NaiveBayesParforPyDMLTest
Tests run: 6, Failures: 0, Errors: 0, Skipped: 0, Time elapsed: 81.383 sec - in org.apache.sysml.test.integration.applications.pydml.NaiveBayesParforPyDMLTest
Running org.apache.sysml.test.integration.applications.dml.NaiveBayesDMLTest
Tests run: 6, Failures: 0, Errors: 0, Skipped: 0, Time elapsed: 82.541 sec - in org.apache.sysml.test.integration.applications.dml.NaiveBayesDMLTest
Running org.apache.sysml.test.integration.applications.dml.MDABivariateStatsDMLTest
Tests run: 4, Failures: 0, Errors: 0, Skipped: 0, Time elapsed: 293.483 sec - in org.apache.sysml.test.integration.applications.dml.MDABivariateStatsDMLTest
Running org.apache.sysml.test.integration.applications.dml.PageRankDMLTest
Tests run: 3, Failures: 0, Errors: 0, Skipped: 0, Time elapsed: 6.208 sec - in org.apache.sysml.test.integration.applications.dml.PageRankDMLTest
Running org.apache.sysml.test.integration.applications.pydml.GLMPyDMLTest
Tests run: 30, Failures: 0, Errors: 0, Skipped: 0, Time elapsed: 585.375 sec - in org.apache.sysml.test.integration.applications.pydml.GLMPyDMLTest
Running org.apache.sysml.test.integration.applications.pydml.MultiClassSVMPyDMLTest
Tests run: 9, Failures: 0, Errors: 0, Skipped: 0, Time elapsed: 89.992 sec - in org.apache.sysml.test.integration.applications.pydml.MultiClassSVMPyDMLTest
Running org.apache.sysml.test.integration.applications.dml.ID3DMLTest
Tests run: 2, Failures: 0, Errors: 0, Skipped: 0, Time elapsed: 382.797 sec - in org.apache.sysml.test.integration.applications.dml.ID3DMLTest
Running org.apache.sysml.test.integration.applications.dml.GLMDMLTest
Tests run: 30, Failures: 0, Errors: 0, Skipped: 0, Time elapsed: 883.659 sec - in org.apache.sysml.test.integration.applications.dml.GLMDMLTest
Running org.apache.sysml.test.integration.applications.pydml.CsplineCGPyDMLTest
Tests run: 3, Failures: 0, Errors: 0, Skipped: 0, Time elapsed: 6.191 sec - in org.apache.sysml.test.integration.applications.pydml.CsplineCGPyDMLTest
Running org.apache.sysml.test.integration.applications.pydml.WelchTPyDMLTest
Tests run: 3, Failures: 0, Errors: 0, Skipped: 0, Time elapsed: 6.599 sec - in org.apache.sysml.test.integration.applications.pydml.WelchTPyDMLTest
Running org.apache.sysml.test.integration.applications.dml.MultiClassSVMDMLTest
Tests run: 9, Failures: 0, Errors: 0, Skipped: 0, Time elapsed: 89.139 sec - in org.apache.sysml.test.integration.applications.dml.MultiClassSVMDMLTest
Running org.apache.sysml.test.integration.applications.dml.CsplineDSDMLTest
Tests run: 3, Failures: 0, Errors: 0, Skipped: 0, Time elapsed: 12.347 sec - in org.apache.sysml.test.integration.applications.dml.CsplineDSDMLTest
Running org.apache.sysml.test.integration.applications.pydml.ApplyTransformPyDMLTest
Tests run: 7, Failures: 0, Errors: 0, Skipped: 0, Time elapsed: 1.318 sec - in org.apache.sysml.test.integration.applications.pydml.ApplyTransformPyDMLTest
Running org.apache.sysml.test.integration.applications.dml.NaiveBayesParforDMLTest
Tests run: 6, Failures: 0, Errors: 0, Skipped: 0, Time elapsed: 81.67 sec - in org.apache.sysml.test.integration.applications.dml.NaiveBayesParforDMLTest
Running org.apache.sysml.test.integration.applications.pydml.L2SVMPyDMLTest
Tests run: 9, Failures: 0, Errors: 0, Skipped: 0, Time elapsed: 63.968 sec - in org.apache.sysml.test.integration.applications.pydml.L2SVMPyDMLTest
Running org.apache.sysml.test.integration.applications.pydml.LinearRegressionPyDMLTest
Tests run: 7, Failures: 0, Errors: 0, Skipped: 0, Time elapsed: 51.253 sec - in org.apache.sysml.test.integration.applications.pydml.LinearRegressionPyDMLTest
Running org.apache.sysml.test.integration.applications.dml.LinearLogRegDMLTest
Tests run: 7, Failures: 0, Errors: 0, Skipped: 0, Time elapsed: 62.342 sec - in org.apache.sysml.test.integration.applications.dml.LinearLogRegDMLTest
Running org.apache.sysml.test.integration.applications.dml.GNMFDMLTest
Tests run: 3, Failures: 0, Errors: 0, Skipped: 0, Time elapsed: 66.345 sec - in org.apache.sysml.test.integration.applications.dml.GNMFDMLTest
Running org.apache.sysml.test.integration.applications.dml.WelchTDMLTest
Tests run: 3, Failures: 0, Errors: 0, Skipped: 0, Time elapsed: 6.468 sec - in org.apache.sysml.test.integration.applications.dml.WelchTDMLTest
Running org.apache.sysml.test.integration.applications.dml.ApplyTransformDMLTest
Tests run: 7, Failures: 0, Errors: 0, Skipped: 0, Time elapsed: 12.984 sec - in org.apache.sysml.test.integration.applications.dml.ApplyTransformDMLTest
Running org.apache.sysml.test.integration.applications.pydml.ID3PyDMLTest
Tests run: 2, Failures: 0, Errors: 0, Skipped: 0, Time elapsed: 332.941 sec - in org.apache.sysml.test.integration.applications.pydml.ID3PyDMLTest
Running org.apache.sysml.test.integration.applications.pydml.GNMFPyDMLTest
Tests run: 3, Failures: 0, Errors: 0, Skipped: 0, Time elapsed: 57.792 sec - in org.apache.sysml.test.integration.applications.pydml.GNMFPyDMLTest

Results :

Failed tests: 
  FullReblockTest.testTextCellSingeMSparseSP:125->runReblockTest:479 33 values are not
in equal

Tests run: 6392, Failures: 1, Errors: 0, Skipped: 0

[INFO] 
[INFO] --- maven-failsafe-plugin:2.17:verify (default) @ systemml ---
[INFO] Failsafe report directory: <https://sparktc.ibmcloud.com/jenkins/job/SystemML-DailyTest/ws/target/failsafe-reports>
[INFO] ------------------------------------------------------------------------
[INFO] BUILD FAILURE
[INFO] ------------------------------------------------------------------------
[INFO] Total time: 02:37 h
[INFO] Finished at: 2016-11-16T19:03:32-06:00
[INFO] Final Memory: 64M/2367M
[INFO] ------------------------------------------------------------------------
[ERROR] Failed to execute goal org.apache.maven.plugins:maven-failsafe-plugin:2.17:verify
(default) on project systemml: There are test failures.
[ERROR] 
[ERROR] Please refer to <https://sparktc.ibmcloud.com/jenkins/job/SystemML-DailyTest/ws/target/failsafe-reports>
for the individual test results.
[ERROR] -> [Help 1]
[ERROR] 
[ERROR] To see the full stack trace of the errors, re-run Maven with the -e switch.
[ERROR] Re-run Maven using the -X switch to enable full debug logging.
[ERROR] 
[ERROR] For more information about the errors and possible solutions, please read the following
articles:
[ERROR] [Help 1] http://cwiki.apache.org/confluence/display/MAVEN/MojoFailureException
Build step 'Execute shell' marked build as failure
Run condition [Always] enabling perform for step [[]]

Mime
View raw message