systemml-dev mailing list archives

Site index · List index
Message view « Date » · « Thread »
Top « Date » · « Thread »
From jenk...@spark.tc
Subject Build failed in Jenkins: SystemML-DailyTest #536
Date Fri, 30 Sep 2016 09:55:28 GMT
See <https://sparktc.ibmcloud.com/jenkins/job/SystemML-DailyTest/536/changes>

Changes:

[Matthias Boehm] [SYSTEMML-964] Revert of data output stream handling for frames

[Matthias Boehm] [SYSTEMML-969] Extended dataframe-frame converter (mixed vector schema)

------------------------------------------
[...truncated 9447 lines...]
16/09/30 03:47:53 INFO executor.Executor: Running task 0.0 in stage 67.0 (TID 66)
16/09/30 03:47:53 INFO executor.Executor: Finished task 0.0 in stage 67.0 (TID 66). 911 bytes
result sent to driver
16/09/30 03:47:53 INFO scheduler.TaskSetManager: Finished task 0.0 in stage 67.0 (TID 66)
in 5 ms on localhost (1/1)
16/09/30 03:47:53 INFO scheduler.DAGScheduler: ResultStage 67 (collect at SparkExecutionContext.java:988)
finished in 0.006 s
16/09/30 03:47:53 INFO scheduler.TaskSchedulerImpl: Removed TaskSet 67.0, whose tasks have
all completed, from pool 
16/09/30 03:47:53 INFO scheduler.DAGScheduler: Got job 50 (collect at SparkExecutionContext.java:988)
with 1 output partitions (allowLocal=false)
16/09/30 03:47:53 INFO scheduler.DAGScheduler: Final stage: ResultStage 68(collect at SparkExecutionContext.java:988)
16/09/30 03:47:53 INFO scheduler.DAGScheduler: Parents of final stage: List()
16/09/30 03:47:53 INFO scheduler.DAGScheduler: Missing parents: List()
16/09/30 03:47:53 INFO scheduler.DAGScheduler: Submitting ResultStage 68 (MapPartitionsRDD[269]
at mapPartitionsToPair at FrameRDDConverterUtils.java:122), which has no missing parents
16/09/30 03:47:53 INFO storage.MemoryStore: ensureFreeSpace(3616) called with curMem=361926,
maxMem=1145485393
16/09/30 03:47:53 INFO storage.MemoryStore: Block broadcast_69 stored as values in memory
(estimated size 3.5 KB, free 1092.1 MB)
16/09/30 03:47:53 INFO storage.MemoryStore: ensureFreeSpace(2097) called with curMem=365542,
maxMem=1145485393
16/09/30 03:47:53 INFO storage.MemoryStore: Block broadcast_69_piece0 stored as bytes in memory
(estimated size 2.0 KB, free 1092.1 MB)
16/09/30 03:47:53 INFO storage.BlockManagerInfo: Added broadcast_69_piece0 in memory on localhost:39474
(size: 2.0 KB, free: 1092.4 MB)
16/09/30 03:47:53 INFO spark.SparkContext: Created broadcast 69 from broadcast at DAGScheduler.scala:874
16/09/30 03:47:53 INFO scheduler.DAGScheduler: Submitting 1 missing tasks from ResultStage
68 (MapPartitionsRDD[269] at mapPartitionsToPair at FrameRDDConverterUtils.java:122)
16/09/30 03:47:53 INFO scheduler.TaskSchedulerImpl: Adding task set 68.0 with 1 tasks
16/09/30 03:47:53 INFO scheduler.TaskSetManager: Starting task 0.0 in stage 68.0 (TID 67,
localhost, PROCESS_LOCAL, 1518 bytes)
16/09/30 03:47:53 INFO executor.Executor: Running task 0.0 in stage 68.0 (TID 67)
16/09/30 03:47:53 INFO executor.Executor: Finished task 0.0 in stage 68.0 (TID 67). 873 bytes
result sent to driver
16/09/30 03:47:53 INFO scheduler.TaskSetManager: Finished task 0.0 in stage 68.0 (TID 67)
in 5 ms on localhost (1/1)
16/09/30 03:47:53 INFO scheduler.DAGScheduler: ResultStage 68 (collect at SparkExecutionContext.java:988)
finished in 0.005 s
16/09/30 03:47:53 INFO scheduler.TaskSchedulerImpl: Removed TaskSet 68.0, whose tasks have
all completed, from pool 
16/09/30 03:47:53 INFO scheduler.DAGScheduler: Got job 51 (collect at MLContextFrameTest.java:325)
with 1 output partitions (allowLocal=false)
16/09/30 03:47:53 INFO scheduler.DAGScheduler: Final stage: ResultStage 69(collect at MLContextFrameTest.java:325)
16/09/30 03:47:53 INFO scheduler.DAGScheduler: Parents of final stage: List()
16/09/30 03:47:53 INFO scheduler.DAGScheduler: Missing parents: List()
16/09/30 03:47:53 INFO scheduler.DAGScheduler: Submitting ResultStage 69 (ParallelCollectionRDD[270]
at parallelize at MLContextConversionUtil.java:845), which has no missing parents
16/09/30 03:47:53 INFO storage.MemoryStore: ensureFreeSpace(1496) called with curMem=367639,
maxMem=1145485393
16/09/30 03:47:53 INFO storage.MemoryStore: Block broadcast_70 stored as values in memory
(estimated size 1496.0 B, free 1092.1 MB)
16/09/30 03:47:53 INFO storage.MemoryStore: ensureFreeSpace(964) called with curMem=369135,
maxMem=1145485393
16/09/30 03:47:53 INFO storage.MemoryStore: Block broadcast_70_piece0 stored as bytes in memory
(estimated size 964.0 B, free 1092.1 MB)
16/09/30 03:47:53 INFO storage.BlockManagerInfo: Added broadcast_70_piece0 in memory on localhost:39474
(size: 964.0 B, free: 1092.4 MB)
16/09/30 03:47:53 INFO spark.SparkContext: Created broadcast 70 from broadcast at DAGScheduler.scala:874
16/09/30 03:47:53 INFO scheduler.DAGScheduler: Submitting 1 missing tasks from ResultStage
69 (ParallelCollectionRDD[270] at parallelize at MLContextConversionUtil.java:845)
16/09/30 03:47:53 INFO scheduler.TaskSchedulerImpl: Adding task set 69.0 with 1 tasks
16/09/30 03:47:53 INFO scheduler.TaskSetManager: Starting task 0.0 in stage 69.0 (TID 68,
localhost, PROCESS_LOCAL, 1430 bytes)
16/09/30 03:47:53 INFO executor.Executor: Running task 0.0 in stage 69.0 (TID 68)
16/09/30 03:47:53 INFO executor.Executor: Finished task 0.0 in stage 69.0 (TID 68). 679 bytes
result sent to driver
16/09/30 03:47:53 INFO scheduler.TaskSetManager: Finished task 0.0 in stage 69.0 (TID 68)
in 3 ms on localhost (1/1)
16/09/30 03:47:53 INFO scheduler.TaskSchedulerImpl: Removed TaskSet 69.0, whose tasks have
all completed, from pool 
16/09/30 03:47:53 INFO scheduler.DAGScheduler: ResultStage 69 (collect at MLContextFrameTest.java:325)
finished in 0.004 s
16/09/30 03:47:53 INFO scheduler.DAGScheduler: Got job 52 (collect at MLContextFrameTest.java:331)
with 1 output partitions (allowLocal=false)
16/09/30 03:47:53 INFO scheduler.DAGScheduler: Final stage: ResultStage 70(collect at MLContextFrameTest.java:331)
16/09/30 03:47:53 INFO scheduler.DAGScheduler: Parents of final stage: List()
16/09/30 03:47:53 INFO scheduler.DAGScheduler: Missing parents: List()
16/09/30 03:47:53 INFO scheduler.DAGScheduler: Submitting ResultStage 70 (ParallelCollectionRDD[271]
at parallelize at MLContextConversionUtil.java:845), which has no missing parents
16/09/30 03:47:53 INFO storage.MemoryStore: ensureFreeSpace(1496) called with curMem=370099,
maxMem=1145485393
16/09/30 03:47:53 INFO storage.MemoryStore: Block broadcast_71 stored as values in memory
(estimated size 1496.0 B, free 1092.1 MB)
16/09/30 03:47:53 INFO storage.MemoryStore: ensureFreeSpace(964) called with curMem=371595,
maxMem=1145485393
16/09/30 03:47:53 INFO storage.MemoryStore: Block broadcast_71_piece0 stored as bytes in memory
(estimated size 964.0 B, free 1092.1 MB)
16/09/30 03:47:53 INFO storage.BlockManagerInfo: Added broadcast_71_piece0 in memory on localhost:39474
(size: 964.0 B, free: 1092.4 MB)
16/09/30 03:47:53 INFO spark.SparkContext: Created broadcast 71 from broadcast at DAGScheduler.scala:874
16/09/30 03:47:53 INFO scheduler.DAGScheduler: Submitting 1 missing tasks from ResultStage
70 (ParallelCollectionRDD[271] at parallelize at MLContextConversionUtil.java:845)
16/09/30 03:47:53 INFO scheduler.TaskSchedulerImpl: Adding task set 70.0 with 1 tasks
16/09/30 03:47:53 INFO scheduler.TaskSetManager: Starting task 0.0 in stage 70.0 (TID 69,
localhost, PROCESS_LOCAL, 1397 bytes)
16/09/30 03:47:53 INFO executor.Executor: Running task 0.0 in stage 70.0 (TID 69)
16/09/30 03:47:53 INFO executor.Executor: Finished task 0.0 in stage 70.0 (TID 69). 646 bytes
result sent to driver
16/09/30 03:47:53 INFO scheduler.TaskSetManager: Finished task 0.0 in stage 70.0 (TID 69)
in 2 ms on localhost (1/1)
16/09/30 03:47:53 INFO scheduler.DAGScheduler: ResultStage 70 (collect at MLContextFrameTest.java:331)
finished in 0.002 s
16/09/30 03:47:53 INFO scheduler.TaskSchedulerImpl: Removed TaskSet 70.0, whose tasks have
all completed, from pool 
16/09/30 03:47:53 INFO storage.BlockManagerInfo: Removed broadcast_68_piece0 on localhost:39474
in memory (size: 2.1 KB, free: 1092.4 MB)
16/09/30 03:47:53 INFO storage.BlockManagerInfo: Removed broadcast_69_piece0 on localhost:39474
in memory (size: 2.0 KB, free: 1092.4 MB)
16/09/30 03:47:53 INFO storage.BlockManagerInfo: Removed broadcast_71_piece0 on localhost:39474
in memory (size: 964.0 B, free: 1092.4 MB)
16/09/30 03:47:53 INFO storage.BlockManagerInfo: Removed broadcast_70_piece0 on localhost:39474
in memory (size: 964.0 B, free: 1092.4 MB)
16/09/30 03:47:53 INFO handler.ContextHandler: stopped o.s.j.s.ServletContextHandler{/metrics/json,null}
16/09/30 03:47:53 INFO handler.ContextHandler: stopped o.s.j.s.ServletContextHandler{/stages/stage/kill,null}
16/09/30 03:47:53 INFO handler.ContextHandler: stopped o.s.j.s.ServletContextHandler{/api,null}
16/09/30 03:47:53 INFO handler.ContextHandler: stopped o.s.j.s.ServletContextHandler{/,null}
16/09/30 03:47:53 INFO handler.ContextHandler: stopped o.s.j.s.ServletContextHandler{/static,null}
16/09/30 03:47:53 INFO handler.ContextHandler: stopped o.s.j.s.ServletContextHandler{/executors/threadDump/json,null}
16/09/30 03:47:53 INFO handler.ContextHandler: stopped o.s.j.s.ServletContextHandler{/executors/threadDump,null}
16/09/30 03:47:53 INFO handler.ContextHandler: stopped o.s.j.s.ServletContextHandler{/executors/json,null}
16/09/30 03:47:53 INFO handler.ContextHandler: stopped o.s.j.s.ServletContextHandler{/executors,null}
16/09/30 03:47:53 INFO handler.ContextHandler: stopped o.s.j.s.ServletContextHandler{/environment/json,null}
16/09/30 03:47:53 INFO handler.ContextHandler: stopped o.s.j.s.ServletContextHandler{/environment,null}
16/09/30 03:47:53 INFO handler.ContextHandler: stopped o.s.j.s.ServletContextHandler{/storage/rdd/json,null}
16/09/30 03:47:53 INFO handler.ContextHandler: stopped o.s.j.s.ServletContextHandler{/storage/rdd,null}
16/09/30 03:47:53 INFO handler.ContextHandler: stopped o.s.j.s.ServletContextHandler{/storage/json,null}
16/09/30 03:47:53 INFO handler.ContextHandler: stopped o.s.j.s.ServletContextHandler{/storage,null}
16/09/30 03:47:53 INFO handler.ContextHandler: stopped o.s.j.s.ServletContextHandler{/stages/pool/json,null}
16/09/30 03:47:53 INFO handler.ContextHandler: stopped o.s.j.s.ServletContextHandler{/stages/pool,null}
16/09/30 03:47:53 INFO handler.ContextHandler: stopped o.s.j.s.ServletContextHandler{/stages/stage/json,null}
16/09/30 03:47:53 INFO handler.ContextHandler: stopped o.s.j.s.ServletContextHandler{/stages/stage,null}
16/09/30 03:47:53 INFO handler.ContextHandler: stopped o.s.j.s.ServletContextHandler{/stages/json,null}
16/09/30 03:47:53 INFO handler.ContextHandler: stopped o.s.j.s.ServletContextHandler{/stages,null}
16/09/30 03:47:53 INFO handler.ContextHandler: stopped o.s.j.s.ServletContextHandler{/jobs/job/json,null}
16/09/30 03:47:53 INFO handler.ContextHandler: stopped o.s.j.s.ServletContextHandler{/jobs/job,null}
16/09/30 03:47:53 INFO handler.ContextHandler: stopped o.s.j.s.ServletContextHandler{/jobs/json,null}
16/09/30 03:47:53 INFO handler.ContextHandler: stopped o.s.j.s.ServletContextHandler{/jobs,null}
16/09/30 03:47:53 WARN thread.QueuedThreadPool: 1 threads could not be stopped
16/09/30 03:47:53 INFO thread.QueuedThreadPool: Couldn't stop Thread[qtp1375307570-308,5,]
16/09/30 03:47:53 INFO ui.SparkUI: Stopped Spark web UI at http://localhost:4040
16/09/30 03:47:53 INFO scheduler.DAGScheduler: Stopping DAGScheduler
16/09/30 03:47:53 INFO spark.MapOutputTrackerMasterEndpoint: MapOutputTrackerMasterEndpoint
stopped!
16/09/30 03:47:54 INFO util.Utils: path = /tmp/spark-18ebe96b-1150-4fa4-809c-9606ba1ad6c7/blockmgr-cdbbe913-eed1-4c00-941f-e119588f68a7,
already present as root for deletion.
16/09/30 03:47:54 INFO storage.MemoryStore: MemoryStore cleared
16/09/30 03:47:54 INFO storage.BlockManager: BlockManager stopped
16/09/30 03:47:54 INFO storage.BlockManagerMaster: BlockManagerMaster stopped
16/09/30 03:47:54 INFO scheduler.OutputCommitCoordinator$OutputCommitCoordinatorEndpoint:
OutputCommitCoordinator stopped!
16/09/30 03:47:54 INFO spark.SparkContext: Successfully stopped SparkContext
16/09/30 03:47:54 INFO remote.RemoteActorRefProvider$RemotingTerminator: Shutting down remote
daemon.
16/09/30 03:47:54 INFO remote.RemoteActorRefProvider$RemotingTerminator: Remote daemon shut
down; proceeding with flushing remote transports.
Running org.apache.sysml.test.integration.mlcontext.MLContextFrameTest
16/09/30 03:47:54 INFO remote.RemoteActorRefProvider$RemotingTerminator: Remoting shut down.
Tests run: 21, Failures: 0, Errors: 0, Skipped: 0, Time elapsed: 11.322 sec - in org.apache.sysml.test.integration.mlcontext.MLContextFrameTest
16/09/30 03:47:54 INFO util.Utils: Shutdown hook called
16/09/30 03:47:54 INFO util.Utils: Deleting directory /tmp/spark-18ebe96b-1150-4fa4-809c-9606ba1ad6c7
Running org.apache.sysml.test.integration.scalability.LinearRegressionTest
Tests run: 1, Failures: 0, Errors: 0, Skipped: 0, Time elapsed: 1.463 sec - in org.apache.sysml.test.integration.scalability.LinearRegressionTest
Running org.apache.sysml.test.integration.scalability.PageRankTest
Tests run: 1, Failures: 0, Errors: 0, Skipped: 0, Time elapsed: 0.888 sec - in org.apache.sysml.test.integration.scalability.PageRankTest
Running org.apache.sysml.test.integration.applications.dml.ArimaDMLTest
Tests run: 1, Failures: 0, Errors: 0, Skipped: 0, Time elapsed: 83.485 sec - in org.apache.sysml.test.integration.applications.dml.ArimaDMLTest
Running org.apache.sysml.test.integration.applications.parfor.ParForCVMulticlassSVMTest
Tests run: 6, Failures: 0, Errors: 0, Skipped: 0, Time elapsed: 38.197 sec - in org.apache.sysml.test.integration.applications.parfor.ParForCVMulticlassSVMTest
Running org.apache.sysml.test.integration.applications.parfor.ParForUnivariateStatsTest
Tests run: 3, Failures: 0, Errors: 0, Skipped: 0, Time elapsed: 17.712 sec - in org.apache.sysml.test.integration.applications.parfor.ParForUnivariateStatsTest
Running org.apache.sysml.test.integration.functions.append.AppendVectorTest
Tests run: 6, Failures: 0, Errors: 0, Skipped: 0, Time elapsed: 482.984 sec - in org.apache.sysml.test.integration.functions.append.AppendVectorTest
Running org.apache.sysml.test.integration.functions.quaternary.WeightedSigmoidTest
Tests run: 56, Failures: 0, Errors: 0, Skipped: 0, Time elapsed: 1,022.632 sec - in org.apache.sysml.test.integration.functions.quaternary.WeightedSigmoidTest
16/09/30 03:51:49 INFO util.Utils: Shutdown hook called
16/09/30 03:51:49 INFO util.Utils: Deleting directory /tmp/spark-ad656d3d-d9a9-451a-a45d-e64ee92d16ce
Running org.apache.sysml.test.integration.functions.indexing.LeftIndexingTest
Tests run: 3, Failures: 0, Errors: 0, Skipped: 0, Time elapsed: 695.624 sec - in org.apache.sysml.test.integration.functions.indexing.LeftIndexingTest
Running org.apache.sysml.test.integration.functions.indexing.Jdk7IssueRightIndexingTest
Tests run: 8, Failures: 0, Errors: 0, Skipped: 0, Time elapsed: 774.427 sec - in org.apache.sysml.test.integration.functions.indexing.Jdk7IssueRightIndexingTest
Running org.apache.sysml.test.integration.applications.parfor.ParForCorrelationTest
Tests run: 12, Failures: 0, Errors: 0, Skipped: 0, Time elapsed: 287.427 sec - in org.apache.sysml.test.integration.applications.parfor.ParForCorrelationTest
Running org.apache.sysml.test.integration.applications.descriptivestats.UnivariateUnweightedScaleDenseTest
Tests run: 24, Failures: 0, Errors: 0, Skipped: 0, Time elapsed: 346.68 sec - in org.apache.sysml.test.integration.applications.descriptivestats.UnivariateUnweightedScaleDenseTest
Running org.apache.sysml.test.integration.applications.parfor.ParForCorrelationTestLarge
Tests run: 2, Failures: 0, Errors: 0, Skipped: 0, Time elapsed: 44.332 sec - in org.apache.sysml.test.integration.applications.parfor.ParForCorrelationTestLarge
Running org.apache.sysml.test.integration.functions.reorg.FullOrderTest
Tests run: 132, Failures: 0, Errors: 0, Skipped: 0, Time elapsed: 1,382.585 sec - in org.apache.sysml.test.integration.functions.reorg.FullOrderTest
Running org.apache.sysml.test.integration.functions.quaternary.WeightedDivMatrixMultTest
Tests run: 90, Failures: 0, Errors: 0, Skipped: 0, Time elapsed: 1,523.065 sec - in org.apache.sysml.test.integration.functions.quaternary.WeightedDivMatrixMultTest
16/09/30 03:59:17 INFO util.Utils: Shutdown hook called
16/09/30 03:59:17 INFO util.Utils: Deleting directory /tmp/spark-6fe9d4d6-a91c-4af4-95ab-998b452b6526
Running org.apache.sysml.test.integration.applications.descriptivestats.UnivariateWeightedScaleDenseTest
Tests run: 24, Failures: 0, Errors: 0, Skipped: 0, Time elapsed: 372.572 sec - in org.apache.sysml.test.integration.applications.descriptivestats.UnivariateWeightedScaleDenseTest
Running org.apache.sysml.test.integration.functions.append.AppendChainTest
Tests run: 12, Failures: 0, Errors: 0, Skipped: 0, Time elapsed: 1,119.848 sec - in org.apache.sysml.test.integration.functions.append.AppendChainTest
Running org.apache.sysml.test.integration.applications.parfor.ParForNaiveBayesTest
Tests run: 10, Failures: 0, Errors: 0, Skipped: 0, Time elapsed: 530.598 sec - in org.apache.sysml.test.integration.applications.parfor.ParForNaiveBayesTest
Running org.apache.sysml.test.integration.applications.descriptivestats.UnivariateUnweightedScaleSparseTest
Tests run: 24, Failures: 0, Errors: 0, Skipped: 0, Time elapsed: 289.881 sec - in org.apache.sysml.test.integration.applications.descriptivestats.UnivariateUnweightedScaleSparseTest
Running org.apache.sysml.test.integration.applications.dml.HITSDMLTest
Tests run: 1, Failures: 0, Errors: 0, Skipped: 0, Time elapsed: 88.827 sec - in org.apache.sysml.test.integration.applications.dml.HITSDMLTest
Running org.apache.sysml.test.integration.functions.append.AppendMatrixTest
Tests run: 22, Failures: 0, Errors: 0, Skipped: 0, Time elapsed: 1,548.455 sec - in org.apache.sysml.test.integration.functions.append.AppendMatrixTest
Running org.apache.sysml.test.integration.applications.descriptivestats.UnivariateWeightedScaleSparseTest
Tests run: 24, Failures: 0, Errors: 0, Skipped: 0, Time elapsed: 342.246 sec - in org.apache.sysml.test.integration.applications.descriptivestats.UnivariateWeightedScaleSparseTest
Running org.apache.sysml.test.integration.applications.pydml.ArimaPyDMLTest
Tests run: 1, Failures: 0, Errors: 0, Skipped: 0, Time elapsed: 48.994 sec - in org.apache.sysml.test.integration.applications.pydml.ArimaPyDMLTest
Running org.apache.sysml.test.integration.applications.pydml.HITSPyDMLTest
Tests run: 1, Failures: 0, Errors: 0, Skipped: 0, Time elapsed: 76.994 sec - in org.apache.sysml.test.integration.applications.pydml.HITSPyDMLTest
Running org.apache.sysml.test.integration.applications.dml.LinearRegressionDMLTest
Tests run: 7, Failures: 0, Errors: 0, Skipped: 0, Time elapsed: 51.01 sec - in org.apache.sysml.test.integration.applications.dml.LinearRegressionDMLTest
Running org.apache.sysml.test.integration.applications.pydml.CsplineDSPyDMLTest
Tests run: 3, Failures: 0, Errors: 0, Skipped: 0, Time elapsed: 6.811 sec - in org.apache.sysml.test.integration.applications.pydml.CsplineDSPyDMLTest
Running org.apache.sysml.test.integration.applications.pydml.LinearLogRegPyDMLTest
Tests run: 7, Failures: 0, Errors: 0, Skipped: 0, Time elapsed: 103.52 sec - in org.apache.sysml.test.integration.applications.pydml.LinearLogRegPyDMLTest
Running org.apache.sysml.test.integration.applications.pydml.NaiveBayesPyDMLTest
Tests run: 6, Failures: 0, Errors: 0, Skipped: 0, Time elapsed: 80.858 sec - in org.apache.sysml.test.integration.applications.pydml.NaiveBayesPyDMLTest
Running org.apache.sysml.test.integration.applications.dml.CsplineCGDMLTest
Tests run: 3, Failures: 0, Errors: 0, Skipped: 0, Time elapsed: 15.278 sec - in org.apache.sysml.test.integration.applications.dml.CsplineCGDMLTest
Running org.apache.sysml.test.integration.applications.dml.L2SVMDMLTest
Tests run: 9, Failures: 0, Errors: 0, Skipped: 0, Time elapsed: 64.289 sec - in org.apache.sysml.test.integration.applications.dml.L2SVMDMLTest
Running org.apache.sysml.test.integration.applications.pydml.MDABivariateStatsPyDMLTest
Tests run: 4, Failures: 0, Errors: 0, Skipped: 0, Time elapsed: 292.029 sec - in org.apache.sysml.test.integration.applications.pydml.MDABivariateStatsPyDMLTest
Running org.apache.sysml.test.integration.applications.pydml.PageRankPyDMLTest
Tests run: 3, Failures: 0, Errors: 0, Skipped: 0, Time elapsed: 6.158 sec - in org.apache.sysml.test.integration.applications.pydml.PageRankPyDMLTest
Running org.apache.sysml.test.integration.applications.pydml.NaiveBayesParforPyDMLTest
Tests run: 6, Failures: 0, Errors: 0, Skipped: 0, Time elapsed: 80.861 sec - in org.apache.sysml.test.integration.applications.pydml.NaiveBayesParforPyDMLTest
Running org.apache.sysml.test.integration.applications.dml.NaiveBayesDMLTest
Tests run: 6, Failures: 0, Errors: 0, Skipped: 0, Time elapsed: 81.016 sec - in org.apache.sysml.test.integration.applications.dml.NaiveBayesDMLTest
Running org.apache.sysml.test.integration.applications.dml.MDABivariateStatsDMLTest
Tests run: 4, Failures: 0, Errors: 0, Skipped: 0, Time elapsed: 292.342 sec - in org.apache.sysml.test.integration.applications.dml.MDABivariateStatsDMLTest
Running org.apache.sysml.test.integration.applications.dml.PageRankDMLTest
Tests run: 3, Failures: 0, Errors: 0, Skipped: 0, Time elapsed: 6.057 sec - in org.apache.sysml.test.integration.applications.dml.PageRankDMLTest
Running org.apache.sysml.test.integration.applications.pydml.GLMPyDMLTest
Tests run: 30, Failures: 0, Errors: 0, Skipped: 0, Time elapsed: 581.934 sec - in org.apache.sysml.test.integration.applications.pydml.GLMPyDMLTest
Running org.apache.sysml.test.integration.applications.pydml.MultiClassSVMPyDMLTest
Tests run: 9, Failures: 0, Errors: 0, Skipped: 0, Time elapsed: 87.581 sec - in org.apache.sysml.test.integration.applications.pydml.MultiClassSVMPyDMLTest
Running org.apache.sysml.test.integration.applications.dml.ID3DMLTest
Tests run: 2, Failures: 0, Errors: 0, Skipped: 0, Time elapsed: 371.301 sec - in org.apache.sysml.test.integration.applications.dml.ID3DMLTest
Running org.apache.sysml.test.integration.applications.dml.GLMDMLTest
Tests run: 30, Failures: 0, Errors: 0, Skipped: 0, Time elapsed: 887.944 sec - in org.apache.sysml.test.integration.applications.dml.GLMDMLTest
Running org.apache.sysml.test.integration.applications.pydml.CsplineCGPyDMLTest
Tests run: 3, Failures: 0, Errors: 0, Skipped: 0, Time elapsed: 6.171 sec - in org.apache.sysml.test.integration.applications.pydml.CsplineCGPyDMLTest
Running org.apache.sysml.test.integration.applications.pydml.WelchTPyDMLTest
Tests run: 3, Failures: 0, Errors: 0, Skipped: 0, Time elapsed: 6.543 sec - in org.apache.sysml.test.integration.applications.pydml.WelchTPyDMLTest
Running org.apache.sysml.test.integration.applications.dml.MultiClassSVMDMLTest
Tests run: 9, Failures: 0, Errors: 0, Skipped: 0, Time elapsed: 88.488 sec - in org.apache.sysml.test.integration.applications.dml.MultiClassSVMDMLTest
Running org.apache.sysml.test.integration.applications.dml.CsplineDSDMLTest
Tests run: 3, Failures: 0, Errors: 0, Skipped: 0, Time elapsed: 14.111 sec - in org.apache.sysml.test.integration.applications.dml.CsplineDSDMLTest
Running org.apache.sysml.test.integration.applications.pydml.ApplyTransformPyDMLTest
Tests run: 7, Failures: 0, Errors: 0, Skipped: 0, Time elapsed: 1.268 sec - in org.apache.sysml.test.integration.applications.pydml.ApplyTransformPyDMLTest
Running org.apache.sysml.test.integration.applications.dml.NaiveBayesParforDMLTest
Tests run: 6, Failures: 0, Errors: 0, Skipped: 0, Time elapsed: 81.031 sec - in org.apache.sysml.test.integration.applications.dml.NaiveBayesParforDMLTest
Running org.apache.sysml.test.integration.applications.pydml.L2SVMPyDMLTest
Tests run: 9, Failures: 0, Errors: 0, Skipped: 0, Time elapsed: 64.117 sec - in org.apache.sysml.test.integration.applications.pydml.L2SVMPyDMLTest
Running org.apache.sysml.test.integration.applications.pydml.LinearRegressionPyDMLTest
Tests run: 7, Failures: 0, Errors: 0, Skipped: 0, Time elapsed: 50.722 sec - in org.apache.sysml.test.integration.applications.pydml.LinearRegressionPyDMLTest
Running org.apache.sysml.test.integration.applications.dml.LinearLogRegDMLTest
Tests run: 7, Failures: 0, Errors: 0, Skipped: 0, Time elapsed: 61.004 sec - in org.apache.sysml.test.integration.applications.dml.LinearLogRegDMLTest
Running org.apache.sysml.test.integration.applications.dml.GNMFDMLTest
Tests run: 3, Failures: 0, Errors: 0, Skipped: 0, Time elapsed: 59.133 sec - in org.apache.sysml.test.integration.applications.dml.GNMFDMLTest
Running org.apache.sysml.test.integration.applications.dml.WelchTDMLTest
Tests run: 3, Failures: 0, Errors: 0, Skipped: 0, Time elapsed: 6.624 sec - in org.apache.sysml.test.integration.applications.dml.WelchTDMLTest
Running org.apache.sysml.test.integration.applications.dml.ApplyTransformDMLTest
Tests run: 7, Failures: 0, Errors: 0, Skipped: 0, Time elapsed: 16.99 sec - in org.apache.sysml.test.integration.applications.dml.ApplyTransformDMLTest
Running org.apache.sysml.test.integration.applications.pydml.ID3PyDMLTest
Tests run: 2, Failures: 0, Errors: 0, Skipped: 0, Time elapsed: 327.157 sec - in org.apache.sysml.test.integration.applications.pydml.ID3PyDMLTest
Running org.apache.sysml.test.integration.applications.pydml.GNMFPyDMLTest
Tests run: 3, Failures: 0, Errors: 0, Skipped: 0, Time elapsed: 55.918 sec - in org.apache.sysml.test.integration.applications.pydml.GNMFPyDMLTest

Results :

Failed tests: 
  FullReblockTest.testTextCellMultipleMSparseMR:182->runReblockTest:463 34 values are not
in equal

Tests run: 6308, Failures: 1, Errors: 0, Skipped: 0

[INFO] 
[INFO] --- maven-failsafe-plugin:2.17:verify (default) @ systemml ---
[INFO] Failsafe report directory: <https://sparktc.ibmcloud.com/jenkins/job/SystemML-DailyTest/ws/target/failsafe-reports>
[INFO] ------------------------------------------------------------------------
[INFO] BUILD FAILURE
[INFO] ------------------------------------------------------------------------
[INFO] Total time: 02:23 h
[INFO] Finished at: 2016-09-30T04:55:27-05:00
[INFO] Final Memory: 62M/2562M
[INFO] ------------------------------------------------------------------------
[ERROR] Failed to execute goal org.apache.maven.plugins:maven-failsafe-plugin:2.17:verify
(default) on project systemml: There are test failures.
[ERROR] 
[ERROR] Please refer to <https://sparktc.ibmcloud.com/jenkins/job/SystemML-DailyTest/ws/target/failsafe-reports>
for the individual test results.
[ERROR] -> [Help 1]
[ERROR] 
[ERROR] To see the full stack trace of the errors, re-run Maven with the -e switch.
[ERROR] Re-run Maven using the -X switch to enable full debug logging.
[ERROR] 
[ERROR] For more information about the errors and possible solutions, please read the following
articles:
[ERROR] [Help 1] http://cwiki.apache.org/confluence/display/MAVEN/MojoFailureException
Build step 'Execute shell' marked build as failure
Run condition [Always] enabling perform for step [[]]

Mime
View raw message