systemml-dev mailing list archives

Site index · List index
Message view « Date » · « Thread »
Top « Date » · « Thread »
From "Matthias Boehm" <mbo...@us.ibm.com>
Subject Re: Build failed in Jenkins: SystemML-DailyTest #332
Date Tue, 21 Jun 2016 23:27:51 GMT

just FYI - this seems to be a race condition (that occasionally leads to
checksum errors), caused by the recent update-in-place extension and I'm
looking into it.

Regards,
Matthias



From:	jenkins@spark.tc
To:	Michael W Dusenberry/San Francisco/IBM@IBMUS,
            lresende@apache.org, dev@systemml.incubator.apache.org, Glenn
            Weidner/Silicon Valley/IBM@IBMUS
Date:	06/21/2016 03:37 PM
Subject:	Build failed in Jenkins: SystemML-DailyTest #332



See <https://sparktc.ibmcloud.com/jenkins/job/SystemML-DailyTest/332/>

------------------------------------------
[...truncated 2287 lines...]
Running
org.apache.sysml.test.integration.functions.append.RBindCBindMatrixTest
Tests run: 12, Failures: 0, Errors: 0, Skipped: 0, Time elapsed: 204.902
sec - in
org.apache.sysml.test.integration.functions.append.RBindCBindMatrixTest
Running org.apache.sysml.test.integration.scalability.LinearRegressionTest
Tests run: 1, Failures: 0, Errors: 0, Skipped: 0, Time elapsed: 3.283 sec -
in org.apache.sysml.test.integration.scalability.LinearRegressionTest
Running
org.apache.sysml.test.integration.applications.descriptivestats.UnivariateCategoricalTest

Tests run: 2, Failures: 0, Errors: 0, Skipped: 0, Time elapsed: 14.004 sec
- in
org.apache.sysml.test.integration.applications.descriptivestats.UnivariateCategoricalTest

Running org.apache.sysml.test.integration.scalability.PageRankTest
Tests run: 1, Failures: 0, Errors: 0, Skipped: 0, Time elapsed: 2.422 sec -
in org.apache.sysml.test.integration.scalability.PageRankTest
Running org.apache.sysml.test.integration.applications.dml.ArimaDMLTest
Tests run: 1, Failures: 0, Errors: 0, Skipped: 0, Time elapsed: 120.006 sec
- in org.apache.sysml.test.integration.applications.dml.ArimaDMLTest
Running
org.apache.sysml.test.integration.applications.parfor.ParForCVMulticlassSVMTest

Tests run: 6, Failures: 0, Errors: 0, Skipped: 0, Time elapsed: 65.747 sec
- in
org.apache.sysml.test.integration.applications.parfor.ParForCVMulticlassSVMTest

Running
org.apache.sysml.test.integration.applications.parfor.ParForUnivariateStatsTest

Tests run: 3, Failures: 0, Errors: 0, Skipped: 0, Time elapsed: 26.182 sec
- in
org.apache.sysml.test.integration.applications.parfor.ParForUnivariateStatsTest

Running org.apache.sysml.test.integration.functions.append.AppendVectorTest
Tests run: 6, Failures: 0, Errors: 0, Skipped: 0, Time elapsed: 719.319 sec
- in org.apache.sysml.test.integration.functions.append.AppendVectorTest
Running
org.apache.sysml.test.integration.functions.quaternary.WeightedDivMatrixMultTest

Tests run: 90, Failures: 0, Errors: 0, Skipped: 0, Time elapsed: 1,596.86
sec - in
org.apache.sysml.test.integration.functions.quaternary.WeightedDivMatrixMultTest

16/06/21 16:12:46 INFO util.Utils: Shutdown hook called
16/06/21 16:12:46 INFO util.Utils: Deleting
directory /tmp/spark-68ade790-3f5f-4fe3-97ed-2ffe2a1b589e
Running
org.apache.sysml.test.integration.functions.indexing.Jdk7IssueRightIndexingTest

Tests run: 8, Failures: 0, Errors: 0, Skipped: 0, Time elapsed: 1,237.034
sec - in
org.apache.sysml.test.integration.functions.indexing.Jdk7IssueRightIndexingTest

Running
org.apache.sysml.test.integration.functions.quaternary.WeightedSigmoidTest
Tests run: 56, Failures: 0, Errors: 0, Skipped: 0, Time elapsed: 1,443.895
sec - in
org.apache.sysml.test.integration.functions.quaternary.WeightedSigmoidTest
16/06/21 16:13:33 INFO util.Utils: Shutdown hook called
16/06/21 16:13:33 INFO util.Utils: Deleting
directory /tmp/spark-33fab861-0a8c-4f3e-9784-64f6537745b1
Running
org.apache.sysml.test.integration.applications.descriptivestats.UnivariateUnweightedScaleDenseTest

Tests run: 24, Failures: 0, Errors: 0, Skipped: 0, Time elapsed: 467.896
sec - in
org.apache.sysml.test.integration.applications.descriptivestats.UnivariateUnweightedScaleDenseTest

Running
org.apache.sysml.test.integration.applications.parfor.ParForCorrelationTest
Tests run: 12, Failures: 0, Errors: 0, Skipped: 0, Time elapsed: 405.545
sec - in
org.apache.sysml.test.integration.applications.parfor.ParForCorrelationTest
Running
org.apache.sysml.test.integration.functions.indexing.LeftIndexingTest
Tests run: 3, Failures: 0, Errors: 0, Skipped: 0, Time elapsed: 1,085.596
sec - in
org.apache.sysml.test.integration.functions.indexing.LeftIndexingTest
Running
org.apache.sysml.test.integration.applications.parfor.ParForCorrelationTestLarge

Tests run: 2, Failures: 0, Errors: 0, Skipped: 0, Time elapsed: 85.706 sec
- in
org.apache.sysml.test.integration.applications.parfor.ParForCorrelationTestLarge

Running org.apache.sysml.test.integration.functions.reorg.FullOrderTest
Tests run: 132, Failures: 0, Errors: 0, Skipped: 0, Time elapsed: 1,915.908
sec - in org.apache.sysml.test.integration.functions.reorg.FullOrderTest
Running
org.apache.sysml.test.integration.applications.descriptivestats.UnivariateWeightedScaleDenseTest

Tests run: 24, Failures: 0, Errors: 0, Skipped: 0, Time elapsed: 493.567
sec - in
org.apache.sysml.test.integration.applications.descriptivestats.UnivariateWeightedScaleDenseTest

Running
org.apache.sysml.test.integration.applications.descriptivestats.UnivariateUnweightedScaleSparseTest

Tests run: 24, Failures: 0, Errors: 0, Skipped: 0, Time elapsed: 421.343
sec - in
org.apache.sysml.test.integration.applications.descriptivestats.UnivariateUnweightedScaleSparseTest

Running
org.apache.sysml.test.integration.applications.parfor.ParForBivariateStatsTest

Tests run: 5, Failures: 1, Errors: 0, Skipped: 0, Time elapsed: 104.865 sec
<<< FAILURE! - in
org.apache.sysml.test.integration.applications.parfor.ParForBivariateStatsTest

testParForBivariateStatsLocalRemoteCP
(org.apache.sysml.test.integration.applications.parfor.ParForBivariateStatsTest)
  Time elapsed: 28.409 sec  <<< FAILURE!
java.lang.AssertionError: failed to run
script ./src/test/scripts/applications/parfor/parfor_bivariate.dml
exception: org.apache.sysml.api.DMLException:
org.apache.sysml.runtime.DMLRuntimeException:
org.apache.sysml.runtime.DMLRuntimeException: PARFOR: Failed to execute
loop in parallel.
message: org.apache.sysml.runtime.DMLRuntimeException:
org.apache.sysml.runtime.DMLRuntimeException: PARFOR: Failed to execute
loop in parallel.
stack trace:
>org.apache.sysml.api.DMLScript.executeScript(DMLScript.java:374)
>org.apache.sysml.api.DMLScript.main(DMLScript.java:198)
>org.apache.sysml.test.integration.AutomatedTestBase.runTest
(AutomatedTestBase.java:1193)
>org.apache.sysml.test.integration.applications.parfor.ParForBivariateStatsTest.runParForBivariateStatsTest
(ParForBivariateStatsTest.java:165)
>org.apache.sysml.test.integration.applications.parfor.ParForBivariateStatsTest.testParForBivariateStatsLocalRemoteCP
(ParForBivariateStatsTest.java:73)
>sun.reflect.NativeMethodAccessorImpl.invoke0(Native Method)
>sun.reflect.NativeMethodAccessorImpl.invoke
(NativeMethodAccessorImpl.java:62)
>sun.reflect.DelegatingMethodAccessorImpl.invoke
(DelegatingMethodAccessorImpl.java:43)
>java.lang.reflect.Method.invoke(Method.java:497)
>org.junit.runners.model.FrameworkMethod$1.runReflectiveCall
(FrameworkMethod.java:47)
>org.junit.internal.runners.model.ReflectiveCallable.run
(ReflectiveCallable.java:12)
>org.junit.runners.model.FrameworkMethod.invokeExplosively
(FrameworkMethod.java:44)
>org.junit.internal.runners.statements.InvokeMethod.evaluate
(InvokeMethod.java:17)
>org.junit.internal.runners.statements.RunBefores.evaluate
(RunBefores.java:26)
>org.junit.internal.runners.statements.RunAfters.evaluate
(RunAfters.java:27)
>org.junit.runners.ParentRunner.runLeaf(ParentRunner.java:271)
>org.junit.runners.BlockJUnit4ClassRunner.runChild
(BlockJUnit4ClassRunner.java:70)
>org.junit.runners.BlockJUnit4ClassRunner.runChild
(BlockJUnit4ClassRunner.java:50)
>org.junit.runners.ParentRunner$3.run(ParentRunner.java:238)
>org.apache.maven.surefire.junitcore.pc.Scheduler$1.run(Scheduler.java:318)
>org.apache.maven.surefire.junitcore.pc.InvokerStrategy.schedule
(InvokerStrategy.java:41)
>org.apache.maven.surefire.junitcore.pc.Scheduler.schedule
(Scheduler.java:274)
>org.junit.runners.ParentRunner.runChildren(ParentRunner.java:236)
>org.junit.runners.ParentRunner.access$000(ParentRunner.java:53)
>org.junit.runners.ParentRunner$2.evaluate(ParentRunner.java:229)
>org.junit.runners.ParentRunner.run(ParentRunner.java:309)
>org.junit.runners.Suite.runChild(Suite.java:127)
>org.junit.runners.Suite.runChild(Suite.java:26)
>org.junit.runners.ParentRunner$3.run(ParentRunner.java:238)
>org.apache.maven.surefire.junitcore.pc.Scheduler$1.run(Scheduler.java:318)
>org.apache.maven.surefire.junitcore.pc.InvokerStrategy.schedule
(InvokerStrategy.java:41)
>org.apache.maven.surefire.junitcore.pc.Scheduler.schedule
(Scheduler.java:274)
>org.junit.runners.ParentRunner.runChildren(ParentRunner.java:236)
>org.junit.runners.ParentRunner.access$000(ParentRunner.java:53)
>org.junit.runners.ParentRunner$2.evaluate(ParentRunner.java:229)
>org.junit.runners.ParentRunner.run(ParentRunner.java:309)
>org.junit.runners.Suite.runChild(Suite.java:127)
>org.junit.runners.Suite.runChild(Suite.java:26)
>org.junit.runners.ParentRunner$3.run(ParentRunner.java:238)
>org.apache.maven.surefire.junitcore.pc.Scheduler$1.run(Scheduler.java:318)
>java.util.concurrent.Executors$RunnableAdapter.call(Executors.java:511)
>java.util.concurrent.FutureTask.run(FutureTask.java:266)
>java.util.concurrent.ThreadPoolExecutor.runWorker
(ThreadPoolExecutor.java:1142)
>java.util.concurrent.ThreadPoolExecutor$Worker.run
(ThreadPoolExecutor.java:617)
>java.lang.Thread.run(Thread.java:745)
		 at org.junit.Assert.fail(Assert.java:88)
		 at org.apache.sysml.test.integration.AutomatedTestBase.runTest
(AutomatedTestBase.java:1213)
		 at
org.apache.sysml.test.integration.applications.parfor.ParForBivariateStatsTest.runParForBivariateStatsTest
(ParForBivariateStatsTest.java:165)
		 at
org.apache.sysml.test.integration.applications.parfor.ParForBivariateStatsTest.testParForBivariateStatsLocalRemoteCP
(ParForBivariateStatsTest.java:73)

Running
org.apache.sysml.test.integration.applications.parfor.ParForNaiveBayesTest
Tests run: 10, Failures: 0, Errors: 0, Skipped: 0, Time elapsed: 872.178
sec - in
org.apache.sysml.test.integration.applications.parfor.ParForNaiveBayesTest
Running org.apache.sysml.test.integration.functions.append.AppendChainTest
Tests run: 12, Failures: 0, Errors: 0, Skipped: 0, Time elapsed: 1,917.812
sec - in org.apache.sysml.test.integration.functions.append.AppendChainTest
Running
org.apache.sysml.test.integration.applications.descriptivestats.UnivariateWeightedScaleSparseTest

Tests run: 24, Failures: 0, Errors: 0, Skipped: 0, Time elapsed: 447.017
sec - in
org.apache.sysml.test.integration.applications.descriptivestats.UnivariateWeightedScaleSparseTest

Running org.apache.sysml.test.integration.applications.dml.HITSDMLTest
Tests run: 1, Failures: 0, Errors: 0, Skipped: 0, Time elapsed: 154.022 sec
- in org.apache.sysml.test.integration.applications.dml.HITSDMLTest
Running org.apache.sysml.test.integration.functions.append.AppendMatrixTest
Tests run: 22, Failures: 0, Errors: 0, Skipped: 0, Time elapsed: 2,552.993
sec - in
org.apache.sysml.test.integration.functions.append.AppendMatrixTest
Running org.apache.sysml.test.integration.applications.pydml.ArimaPyDMLTest
Tests run: 1, Failures: 0, Errors: 0, Skipped: 0, Time elapsed: 49.636 sec
- in org.apache.sysml.test.integration.applications.pydml.ArimaPyDMLTest
Running org.apache.sysml.test.integration.applications.pydml.HITSPyDMLTest
Tests run: 1, Failures: 0, Errors: 0, Skipped: 0, Time elapsed: 76.975 sec
- in org.apache.sysml.test.integration.applications.pydml.HITSPyDMLTest
Running
org.apache.sysml.test.integration.applications.dml.LinearRegressionDMLTest
Tests run: 7, Failures: 0, Errors: 0, Skipped: 0, Time elapsed: 64.225 sec
- in
org.apache.sysml.test.integration.applications.dml.LinearRegressionDMLTest
Running
org.apache.sysml.test.integration.applications.pydml.CsplineDSPyDMLTest
Tests run: 3, Failures: 0, Errors: 0, Skipped: 0, Time elapsed: 6.859 sec -
in org.apache.sysml.test.integration.applications.pydml.CsplineDSPyDMLTest
Running
org.apache.sysml.test.integration.applications.pydml.LinearLogRegPyDMLTest
Tests run: 7, Failures: 0, Errors: 0, Skipped: 0, Time elapsed: 90.6 sec -
in
org.apache.sysml.test.integration.applications.pydml.LinearLogRegPyDMLTest
Running
org.apache.sysml.test.integration.applications.pydml.NaiveBayesPyDMLTest
Tests run: 6, Failures: 0, Errors: 0, Skipped: 0, Time elapsed: 80.474 sec
- in
org.apache.sysml.test.integration.applications.pydml.NaiveBayesPyDMLTest
Running org.apache.sysml.test.integration.applications.dml.CsplineCGDMLTest
Tests run: 3, Failures: 0, Errors: 0, Skipped: 0, Time elapsed: 29.343 sec
- in org.apache.sysml.test.integration.applications.dml.CsplineCGDMLTest
Running org.apache.sysml.test.integration.applications.dml.L2SVMDMLTest
Tests run: 9, Failures: 0, Errors: 0, Skipped: 0, Time elapsed: 89.222 sec
- in org.apache.sysml.test.integration.applications.dml.L2SVMDMLTest
Running
org.apache.sysml.test.integration.applications.pydml.MDABivariateStatsPyDMLTest

Tests run: 4, Failures: 0, Errors: 0, Skipped: 0, Time elapsed: 291.927 sec
- in
org.apache.sysml.test.integration.applications.pydml.MDABivariateStatsPyDMLTest

Running
org.apache.sysml.test.integration.applications.pydml.PageRankPyDMLTest
Tests run: 3, Failures: 0, Errors: 0, Skipped: 0, Time elapsed: 6.4 sec -
in org.apache.sysml.test.integration.applications.pydml.PageRankPyDMLTest
Running
org.apache.sysml.test.integration.applications.pydml.NaiveBayesParforPyDMLTest

Tests run: 6, Failures: 0, Errors: 0, Skipped: 0, Time elapsed: 80.904 sec
- in
org.apache.sysml.test.integration.applications.pydml.NaiveBayesParforPyDMLTest

Running
org.apache.sysml.test.integration.applications.dml.NaiveBayesDMLTest
Tests run: 6, Failures: 0, Errors: 0, Skipped: 0, Time elapsed: 101.845 sec
- in org.apache.sysml.test.integration.applications.dml.NaiveBayesDMLTest
Running
org.apache.sysml.test.integration.applications.dml.MDABivariateStatsDMLTest
Tests run: 4, Failures: 0, Errors: 0, Skipped: 0, Time elapsed: 345.843 sec
- in
org.apache.sysml.test.integration.applications.dml.MDABivariateStatsDMLTest
Running org.apache.sysml.test.integration.applications.dml.PageRankDMLTest
Tests run: 3, Failures: 0, Errors: 0, Skipped: 0, Time elapsed: 6.373 sec -
in org.apache.sysml.test.integration.applications.dml.PageRankDMLTest
Running org.apache.sysml.test.integration.applications.pydml.GLMPyDMLTest
Tests run: 30, Failures: 0, Errors: 0, Skipped: 0, Time elapsed: 586.17 sec
- in org.apache.sysml.test.integration.applications.pydml.GLMPyDMLTest
Running
org.apache.sysml.test.integration.applications.pydml.MultiClassSVMPyDMLTest
Tests run: 9, Failures: 0, Errors: 0, Skipped: 0, Time elapsed: 87.969 sec
- in
org.apache.sysml.test.integration.applications.pydml.MultiClassSVMPyDMLTest
Running org.apache.sysml.test.integration.applications.dml.ID3DMLTest
Tests run: 2, Failures: 0, Errors: 0, Skipped: 0, Time elapsed: 546.884 sec
- in org.apache.sysml.test.integration.applications.dml.ID3DMLTest
Running org.apache.sysml.test.integration.applications.dml.GLMDMLTest
Tests run: 30, Failures: 0, Errors: 0, Skipped: 0, Time elapsed: 1,744.401
sec - in org.apache.sysml.test.integration.applications.dml.GLMDMLTest
Running
org.apache.sysml.test.integration.applications.pydml.CsplineCGPyDMLTest
Tests run: 3, Failures: 0, Errors: 0, Skipped: 0, Time elapsed: 6.191 sec -
in org.apache.sysml.test.integration.applications.pydml.CsplineCGPyDMLTest
Running
org.apache.sysml.test.integration.applications.pydml.WelchTPyDMLTest
Tests run: 3, Failures: 0, Errors: 0, Skipped: 0, Time elapsed: 6.51 sec -
in org.apache.sysml.test.integration.applications.pydml.WelchTPyDMLTest
Running
org.apache.sysml.test.integration.applications.dml.MultiClassSVMDMLTest
Tests run: 9, Failures: 0, Errors: 0, Skipped: 0, Time elapsed: 103.011 sec
- in
org.apache.sysml.test.integration.applications.dml.MultiClassSVMDMLTest
Running org.apache.sysml.test.integration.applications.dml.CsplineDSDMLTest
Tests run: 3, Failures: 0, Errors: 0, Skipped: 0, Time elapsed: 26.723 sec
- in org.apache.sysml.test.integration.applications.dml.CsplineDSDMLTest
Running
org.apache.sysml.test.integration.applications.pydml.ApplyTransformPyDMLTest

Tests run: 7, Failures: 0, Errors: 0, Skipped: 0, Time elapsed: 1.291 sec -
in
org.apache.sysml.test.integration.applications.pydml.ApplyTransformPyDMLTest

Running
org.apache.sysml.test.integration.applications.dml.NaiveBayesParforDMLTest
Tests run: 6, Failures: 0, Errors: 0, Skipped: 0, Time elapsed: 90.108 sec
- in
org.apache.sysml.test.integration.applications.dml.NaiveBayesParforDMLTest
Running org.apache.sysml.test.integration.applications.pydml.L2SVMPyDMLTest
Tests run: 9, Failures: 0, Errors: 0, Skipped: 0, Time elapsed: 65.312 sec
- in org.apache.sysml.test.integration.applications.pydml.L2SVMPyDMLTest
Running
org.apache.sysml.test.integration.applications.pydml.LinearRegressionPyDMLTest

Tests run: 7, Failures: 0, Errors: 0, Skipped: 0, Time elapsed: 51.613 sec
- in
org.apache.sysml.test.integration.applications.pydml.LinearRegressionPyDMLTest

Running
org.apache.sysml.test.integration.applications.dml.LinearLogRegDMLTest
Tests run: 7, Failures: 0, Errors: 0, Skipped: 0, Time elapsed: 97.32 sec -
in org.apache.sysml.test.integration.applications.dml.LinearLogRegDMLTest
Running org.apache.sysml.test.integration.applications.dml.GNMFDMLTest
Tests run: 3, Failures: 0, Errors: 0, Skipped: 0, Time elapsed: 110.37 sec
- in org.apache.sysml.test.integration.applications.dml.GNMFDMLTest
Running org.apache.sysml.test.integration.applications.dml.WelchTDMLTest
Tests run: 3, Failures: 0, Errors: 0, Skipped: 0, Time elapsed: 6.444 sec -
in org.apache.sysml.test.integration.applications.dml.WelchTDMLTest
Running
org.apache.sysml.test.integration.applications.dml.ApplyTransformDMLTest
Tests run: 7, Failures: 0, Errors: 0, Skipped: 0, Time elapsed: 24.396 sec
- in
org.apache.sysml.test.integration.applications.dml.ApplyTransformDMLTest
Running org.apache.sysml.test.integration.applications.pydml.ID3PyDMLTest
Tests run: 2, Failures: 0, Errors: 0, Skipped: 0, Time elapsed: 333.851 sec
- in org.apache.sysml.test.integration.applications.pydml.ID3PyDMLTest
Running org.apache.sysml.test.integration.applications.pydml.GNMFPyDMLTest
Tests run: 3, Failures: 0, Errors: 0, Skipped: 0, Time elapsed: 55.931 sec
- in org.apache.sysml.test.integration.applications.pydml.GNMFPyDMLTest

Results :

Failed tests:
  ParForBivariateStatsTest.testParForBivariateStatsLocalRemoteCP:73->
runParForBivariateStatsTest:165->AutomatedTestBase.runTest:1213 failed to
run script ./src/test/scripts/applications/parfor/parfor_bivariate.dml
exception: org.apache.sysml.api.DMLException:
org.apache.sysml.runtime.DMLRuntimeException:
org.apache.sysml.runtime.DMLRuntimeException: PARFOR: Failed to execute
loop in parallel.
message: org.apache.sysml.runtime.DMLRuntimeException:
org.apache.sysml.runtime.DMLRuntimeException: PARFOR: Failed to execute
loop in parallel.
stack trace:
>org.apache.sysml.api.DMLScript.executeScript(DMLScript.java:374)
>org.apache.sysml.api.DMLScript.main(DMLScript.java:198)
>org.apache.sysml.test.integration.AutomatedTestBase.runTest
(AutomatedTestBase.java:1193)
>org.apache.sysml.test.integration.applications.parfor.ParForBivariateStatsTest.runParForBivariateStatsTest
(ParForBivariateStatsTest.java:165)
>org.apache.sysml.test.integration.applications.parfor.ParForBivariateStatsTest.testParForBivariateStatsLocalRemoteCP
(ParForBivariateStatsTest.java:73)
>sun.reflect.NativeMethodAccessorImpl.invoke0(Native Method)
>sun.reflect.NativeMethodAccessorImpl.invoke
(NativeMethodAccessorImpl.java:62)
>sun.reflect.DelegatingMethodAccessorImpl.invoke
(DelegatingMethodAccessorImpl.java:43)
>java.lang.reflect.Method.invoke(Method.java:497)
>org.junit.runners.model.FrameworkMethod$1.runReflectiveCall
(FrameworkMethod.java:47)
>org.junit.internal.runners.model.ReflectiveCallable.run
(ReflectiveCallable.java:12)
>org.junit.runners.model.FrameworkMethod.invokeExplosively
(FrameworkMethod.java:44)
>org.junit.internal.runners.statements.InvokeMethod.evaluate
(InvokeMethod.java:17)
>org.junit.internal.runners.statements.RunBefores.evaluate
(RunBefores.java:26)
>org.junit.internal.runners.statements.RunAfters.evaluate
(RunAfters.java:27)
>org.junit.runners.ParentRunner.runLeaf(ParentRunner.java:271)
>org.junit.runners.BlockJUnit4ClassRunner.runChild
(BlockJUnit4ClassRunner.java:70)
>org.junit.runners.BlockJUnit4ClassRunner.runChild
(BlockJUnit4ClassRunner.java:50)
>org.junit.runners.ParentRunner$3.run(ParentRunner.java:238)
>org.apache.maven.surefire.junitcore.pc.Scheduler$1.run(Scheduler.java:318)
>org.apache.maven.surefire.junitcore.pc.InvokerStrategy.schedule
(InvokerStrategy.java:41)
>org.apache.maven.surefire.junitcore.pc.Scheduler.schedule
(Scheduler.java:274)
>org.junit.runners.ParentRunner.runChildren(ParentRunner.java:236)
>org.junit.runners.ParentRunner.access$000(ParentRunner.java:53)
>org.junit.runners.ParentRunner$2.evaluate(ParentRunner.java:229)
>org.junit.runners.ParentRunner.run(ParentRunner.java:309)
>org.junit.runners.Suite.runChild(Suite.java:127)
>org.junit.runners.Suite.runChild(Suite.java:26)
>org.junit.runners.ParentRunner$3.run(ParentRunner.java:238)
>org.apache.maven.surefire.junitcore.pc.Scheduler$1.run(Scheduler.java:318)
>org.apache.maven.surefire.junitcore.pc.InvokerStrategy.schedule
(InvokerStrategy.java:41)
>org.apache.maven.surefire.junitcore.pc.Scheduler.schedule
(Scheduler.java:274)
>org.junit.runners.ParentRunner.runChildren(ParentRunner.java:236)
>org.junit.runners.ParentRunner.access$000(ParentRunner.java:53)
>org.junit.runners.ParentRunner$2.evaluate(ParentRunner.java:229)
>org.junit.runners.ParentRunner.run(ParentRunner.java:309)
>org.junit.runners.Suite.runChild(Suite.java:127)
>org.junit.runners.Suite.runChild(Suite.java:26)
>org.junit.runners.ParentRunner$3.run(ParentRunner.java:238)
>org.apache.maven.surefire.junitcore.pc.Scheduler$1.run(Scheduler.java:318)
>java.util.concurrent.Executors$RunnableAdapter.call(Executors.java:511)
>java.util.concurrent.FutureTask.run(FutureTask.java:266)
>java.util.concurrent.ThreadPoolExecutor.runWorker
(ThreadPoolExecutor.java:1142)
>java.util.concurrent.ThreadPoolExecutor$Worker.run
(ThreadPoolExecutor.java:617)
>java.lang.Thread.run(Thread.java:745)

Tests run: 5111, Failures: 1, Errors: 0, Skipped: 0

[INFO]
[INFO] --- maven-failsafe-plugin:2.17:verify (default) @ systemml ---
[INFO] Failsafe report directory: <
https://sparktc.ibmcloud.com/jenkins/job/SystemML-DailyTest/ws/target/failsafe-reports
>
[INFO]
------------------------------------------------------------------------
[INFO] BUILD FAILURE
[INFO]
------------------------------------------------------------------------
[INFO] Total time: 03:00 h
[INFO] Finished at: 2016-06-21T17:36:45-05:00
[INFO] Final Memory: 58M/2424M
[INFO]
------------------------------------------------------------------------
[ERROR] Failed to execute goal
org.apache.maven.plugins:maven-failsafe-plugin:2.17:verify (default) on
project systemml: There are test failures.
[ERROR]
[ERROR] Please refer to <
https://sparktc.ibmcloud.com/jenkins/job/SystemML-DailyTest/ws/target/failsafe-reports
> for the individual test results.
[ERROR] -> [Help 1]
[ERROR]
[ERROR] To see the full stack trace of the errors, re-run Maven with the -e
switch.
[ERROR] Re-run Maven using the -X switch to enable full debug logging.
[ERROR]
[ERROR] For more information about the errors and possible solutions,
please read the following articles:
[ERROR] [Help 1]
http://cwiki.apache.org/confluence/display/MAVEN/MojoFailureException
Build step 'Execute shell' marked build as failure
Run condition [Always] enabling perform for step [[]]




Mime
  • Unnamed multipart/related (inline, None, 0 bytes)
View raw message