systemml-dev mailing list archives

Site index · List index
Message view « Date » · « Thread »
Top « Date » · « Thread »
From jenk...@spark.tc
Subject Build failed in Jenkins: SystemML-DailyTest #342
Date Sat, 25 Jun 2016 21:53:29 GMT
See <https://sparktc.ibmcloud.com/jenkins/job/SystemML-DailyTest/342/>

------------------------------------------
[...truncated 29776 lines...]
>java.util.concurrent.Executors$RunnableAdapter.call(Executors.java:511)
>java.util.concurrent.FutureTask.run(FutureTask.java:266)
>java.util.concurrent.ThreadPoolExecutor.runWorker(ThreadPoolExecutor.java:1142)
>java.util.concurrent.ThreadPoolExecutor$Worker.run(ThreadPoolExecutor.java:617)
>java.lang.Thread.run(Thread.java:745)
  UnivariateWeightedScaleSparseTest.testWeightedScale34:152->UnivariateStatsBase.testWeightedScaleWithR:260->AutomatedTestBase.runTest:1258
failed to run script ./src/test/scripts/applications/descriptivestats/WeightedScaleTest.dml
exception: org.apache.sysml.api.DMLException: org.apache.sysml.runtime.DMLRuntimeException:
org.apache.sysml.runtime.DMLRuntimeException: ERROR: Runtime error in program block generated
from statement block between lines 34 and 125 -- Error evaluating instruction: jobtype = COMBINE

input labels = [_mVar8736, _mVar8738] 
recReader inst =  
rand inst =  
mapper inst =  
shuffle inst = MR°combinebinary°true·SCALAR·BOOLEAN°0·MATRIX·DOUBLE°1·MATRIX·DOUBLE°2·MATRIX·DOUBLE‡MR°combinebinary°true·SCALAR·BOOLEAN°0·MATRIX·DOUBLE°1·MATRIX·DOUBLE°3·MATRIX·DOUBLE

agg inst =  
other inst =  
output labels = [_mVar8742, _mVar8743] 
result indices = ,2,3 
num reducers = 10 
replication = 1 

message: org.apache.sysml.runtime.DMLRuntimeException: org.apache.sysml.runtime.DMLRuntimeException:
ERROR: Runtime error in program block generated from statement block between lines 34 and
125 -- Error evaluating instruction: jobtype = COMBINE 
input labels = [_mVar8736, _mVar8738] 
recReader inst =  
rand inst =  
mapper inst =  
shuffle inst = MR°combinebinary°true·SCALAR·BOOLEAN°0·MATRIX·DOUBLE°1·MATRIX·DOUBLE°2·MATRIX·DOUBLE‡MR°combinebinary°true·SCALAR·BOOLEAN°0·MATRIX·DOUBLE°1·MATRIX·DOUBLE°3·MATRIX·DOUBLE

agg inst =  
other inst =  
output labels = [_mVar8742, _mVar8743] 
result indices = ,2,3 
num reducers = 10 
replication = 1 

stack trace:
>org.apache.sysml.api.DMLScript.executeScript(DMLScript.java:374)
>org.apache.sysml.api.DMLScript.main(DMLScript.java:198)
>org.apache.sysml.test.integration.AutomatedTestBase.runTest(AutomatedTestBase.java:1238)
>org.apache.sysml.test.integration.applications.descriptivestats.UnivariateStatsBase.testWeightedScaleWithR(UnivariateStatsBase.java:260)
>org.apache.sysml.test.integration.applications.descriptivestats.UnivariateWeightedScaleSparseTest.testWeightedScale34(UnivariateWeightedScaleSparseTest.java:152)
>sun.reflect.NativeMethodAccessorImpl.invoke0(Native Method)
>sun.reflect.NativeMethodAccessorImpl.invoke(NativeMethodAccessorImpl.java:62)
>sun.reflect.DelegatingMethodAccessorImpl.invoke(DelegatingMethodAccessorImpl.java:43)
>java.lang.reflect.Method.invoke(Method.java:497)
>org.junit.runners.model.FrameworkMethod$1.runReflectiveCall(FrameworkMethod.java:47)
>org.junit.internal.runners.model.ReflectiveCallable.run(ReflectiveCallable.java:12)
>org.junit.runners.model.FrameworkMethod.invokeExplosively(FrameworkMethod.java:44)
>org.junit.internal.runners.statements.InvokeMethod.evaluate(InvokeMethod.java:17)
>org.junit.internal.runners.statements.RunBefores.evaluate(RunBefores.java:26)
>org.junit.internal.runners.statements.RunAfters.evaluate(RunAfters.java:27)
>org.junit.runners.ParentRunner.runLeaf(ParentRunner.java:271)
>org.junit.runners.BlockJUnit4ClassRunner.runChild(BlockJUnit4ClassRunner.java:70)
>org.junit.runners.BlockJUnit4ClassRunner.runChild(BlockJUnit4ClassRunner.java:50)
>org.junit.runners.ParentRunner$3.run(ParentRunner.java:238)
>org.apache.maven.surefire.junitcore.pc.Scheduler$1.run(Scheduler.java:318)
>org.apache.maven.surefire.junitcore.pc.InvokerStrategy.schedule(InvokerStrategy.java:41)
>org.apache.maven.surefire.junitcore.pc.Scheduler.schedule(Scheduler.java:274)
>org.junit.runners.ParentRunner.runChildren(ParentRunner.java:236)
>org.junit.runners.ParentRunner.access$000(ParentRunner.java:53)
>org.junit.runners.ParentRunner$2.evaluate(ParentRunner.java:229)
>org.junit.runners.ParentRunner.run(ParentRunner.java:309)
>org.junit.runners.Suite.runChild(Suite.java:127)
>org.junit.runners.Suite.runChild(Suite.java:26)
>org.junit.runners.ParentRunner$3.run(ParentRunner.java:238)
>org.apache.maven.surefire.junitcore.pc.Scheduler$1.run(Scheduler.java:318)
>org.apache.maven.surefire.junitcore.pc.InvokerStrategy.schedule(InvokerStrategy.java:41)
>org.apache.maven.surefire.junitcore.pc.Scheduler.schedule(Scheduler.java:274)
>org.junit.runners.ParentRunner.runChildren(ParentRunner.java:236)
>org.junit.runners.ParentRunner.access$000(ParentRunner.java:53)
>org.junit.runners.ParentRunner$2.evaluate(ParentRunner.java:229)
>org.junit.runners.ParentRunner.run(ParentRunner.java:309)
>org.junit.runners.Suite.runChild(Suite.java:127)
>org.junit.runners.Suite.runChild(Suite.java:26)
>org.junit.runners.ParentRunner$3.run(ParentRunner.java:238)
>org.apache.maven.surefire.junitcore.pc.Scheduler$1.run(Scheduler.java:318)
>java.util.concurrent.Executors$RunnableAdapter.call(Executors.java:511)
>java.util.concurrent.FutureTask.run(FutureTask.java:266)
>java.util.concurrent.ThreadPoolExecutor.runWorker(ThreadPoolExecutor.java:1142)
>java.util.concurrent.ThreadPoolExecutor$Worker.run(ThreadPoolExecutor.java:617)
>java.lang.Thread.run(Thread.java:745)
  UnivariateWeightedScaleSparseTest.testWeightedScale35:157->UnivariateStatsBase.testWeightedScaleWithR:260->AutomatedTestBase.runTest:1258
failed to run script ./src/test/scripts/applications/descriptivestats/WeightedScaleTest.dml
exception: org.apache.sysml.api.DMLException: org.apache.sysml.runtime.DMLRuntimeException:
org.apache.sysml.runtime.DMLRuntimeException: ERROR: Runtime error in program block generated
from statement block between lines 34 and 125 -- Error evaluating instruction: jobtype = COMBINE

input labels = [_mVar8886, _mVar8888] 
recReader inst =  
rand inst =  
mapper inst =  
shuffle inst = MR°combinebinary°true·SCALAR·BOOLEAN°0·MATRIX·DOUBLE°1·MATRIX·DOUBLE°2·MATRIX·DOUBLE‡MR°combinebinary°true·SCALAR·BOOLEAN°0·MATRIX·DOUBLE°1·MATRIX·DOUBLE°3·MATRIX·DOUBLE

agg inst =  
other inst =  
output labels = [_mVar8892, _mVar8893] 
result indices = ,2,3 
num reducers = 10 
replication = 1 

message: org.apache.sysml.runtime.DMLRuntimeException: org.apache.sysml.runtime.DMLRuntimeException:
ERROR: Runtime error in program block generated from statement block between lines 34 and
125 -- Error evaluating instruction: jobtype = COMBINE 
input labels = [_mVar8886, _mVar8888] 
recReader inst =  
rand inst =  
mapper inst =  
shuffle inst = MR°combinebinary°true·SCALAR·BOOLEAN°0·MATRIX·DOUBLE°1·MATRIX·DOUBLE°2·MATRIX·DOUBLE‡MR°combinebinary°true·SCALAR·BOOLEAN°0·MATRIX·DOUBLE°1·MATRIX·DOUBLE°3·MATRIX·DOUBLE

agg inst =  
other inst =  
output labels = [_mVar8892, _mVar8893] 
result indices = ,2,3 
num reducers = 10 
replication = 1 

stack trace:
>org.apache.sysml.api.DMLScript.executeScript(DMLScript.java:374)
>org.apache.sysml.api.DMLScript.main(DMLScript.java:198)
>org.apache.sysml.test.integration.AutomatedTestBase.runTest(AutomatedTestBase.java:1238)
>org.apache.sysml.test.integration.applications.descriptivestats.UnivariateStatsBase.testWeightedScaleWithR(UnivariateStatsBase.java:260)
>org.apache.sysml.test.integration.applications.descriptivestats.UnivariateWeightedScaleSparseTest.testWeightedScale35(UnivariateWeightedScaleSparseTest.java:157)
>sun.reflect.NativeMethodAccessorImpl.invoke0(Native Method)
>sun.reflect.NativeMethodAccessorImpl.invoke(NativeMethodAccessorImpl.java:62)
>sun.reflect.DelegatingMethodAccessorImpl.invoke(DelegatingMethodAccessorImpl.java:43)
>java.lang.reflect.Method.invoke(Method.java:497)
>org.junit.runners.model.FrameworkMethod$1.runReflectiveCall(FrameworkMethod.java:47)
>org.junit.internal.runners.model.ReflectiveCallable.run(ReflectiveCallable.java:12)
>org.junit.runners.model.FrameworkMethod.invokeExplosively(FrameworkMethod.java:44)
>org.junit.internal.runners.statements.InvokeMethod.evaluate(InvokeMethod.java:17)
>org.junit.internal.runners.statements.RunBefores.evaluate(RunBefores.java:26)
>org.junit.internal.runners.statements.RunAfters.evaluate(RunAfters.java:27)
>org.junit.runners.ParentRunner.runLeaf(ParentRunner.java:271)
>org.junit.runners.BlockJUnit4ClassRunner.runChild(BlockJUnit4ClassRunner.java:70)
>org.junit.runners.BlockJUnit4ClassRunner.runChild(BlockJUnit4ClassRunner.java:50)
>org.junit.runners.ParentRunner$3.run(ParentRunner.java:238)
>org.apache.maven.surefire.junitcore.pc.Scheduler$1.run(Scheduler.java:318)
>org.apache.maven.surefire.junitcore.pc.InvokerStrategy.schedule(InvokerStrategy.java:41)
>org.apache.maven.surefire.junitcore.pc.Scheduler.schedule(Scheduler.java:274)
>org.junit.runners.ParentRunner.runChildren(ParentRunner.java:236)
>org.junit.runners.ParentRunner.access$000(ParentRunner.java:53)
>org.junit.runners.ParentRunner$2.evaluate(ParentRunner.java:229)
>org.junit.runners.ParentRunner.run(ParentRunner.java:309)
>org.junit.runners.Suite.runChild(Suite.java:127)
>org.junit.runners.Suite.runChild(Suite.java:26)
>org.junit.runners.ParentRunner$3.run(ParentRunner.java:238)
>org.apache.maven.surefire.junitcore.pc.Scheduler$1.run(Scheduler.java:318)
>org.apache.maven.surefire.junitcore.pc.InvokerStrategy.schedule(InvokerStrategy.java:41)
>org.apache.maven.surefire.junitcore.pc.Scheduler.schedule(Scheduler.java:274)
>org.junit.runners.ParentRunner.runChildren(ParentRunner.java:236)
>org.junit.runners.ParentRunner.access$000(ParentRunner.java:53)
>org.junit.runners.ParentRunner$2.evaluate(ParentRunner.java:229)
>org.junit.runners.ParentRunner.run(ParentRunner.java:309)
>org.junit.runners.Suite.runChild(Suite.java:127)
>org.junit.runners.Suite.runChild(Suite.java:26)
>org.junit.runners.ParentRunner$3.run(ParentRunner.java:238)
>org.apache.maven.surefire.junitcore.pc.Scheduler$1.run(Scheduler.java:318)
>java.util.concurrent.Executors$RunnableAdapter.call(Executors.java:511)
>java.util.concurrent.FutureTask.run(FutureTask.java:266)
>java.util.concurrent.ThreadPoolExecutor.runWorker(ThreadPoolExecutor.java:1142)
>java.util.concurrent.ThreadPoolExecutor$Worker.run(ThreadPoolExecutor.java:617)
>java.lang.Thread.run(Thread.java:745)
  UnivariateWeightedScaleSparseTest.testWeightedScale36:162->UnivariateStatsBase.testWeightedScaleWithR:260->AutomatedTestBase.runTest:1258
failed to run script ./src/test/scripts/applications/descriptivestats/WeightedScaleTest.dml
exception: org.apache.sysml.api.DMLException: org.apache.sysml.runtime.DMLRuntimeException:
org.apache.sysml.runtime.DMLRuntimeException: ERROR: Runtime error in program block generated
from statement block between lines 34 and 125 -- Error evaluating instruction: jobtype = COMBINE

input labels = [_mVar9036, _mVar9038] 
recReader inst =  
rand inst =  
mapper inst =  
shuffle inst = MR°combinebinary°true·SCALAR·BOOLEAN°0·MATRIX·DOUBLE°1·MATRIX·DOUBLE°2·MATRIX·DOUBLE‡MR°combinebinary°true·SCALAR·BOOLEAN°0·MATRIX·DOUBLE°1·MATRIX·DOUBLE°3·MATRIX·DOUBLE

agg inst =  
other inst =  
output labels = [_mVar9042, _mVar9043] 
result indices = ,2,3 
num reducers = 10 
replication = 1 

message: org.apache.sysml.runtime.DMLRuntimeException: org.apache.sysml.runtime.DMLRuntimeException:
ERROR: Runtime error in program block generated from statement block between lines 34 and
125 -- Error evaluating instruction: jobtype = COMBINE 
input labels = [_mVar9036, _mVar9038] 
recReader inst =  
rand inst =  
mapper inst =  
shuffle inst = MR°combinebinary°true·SCALAR·BOOLEAN°0·MATRIX·DOUBLE°1·MATRIX·DOUBLE°2·MATRIX·DOUBLE‡MR°combinebinary°true·SCALAR·BOOLEAN°0·MATRIX·DOUBLE°1·MATRIX·DOUBLE°3·MATRIX·DOUBLE

agg inst =  
other inst =  
output labels = [_mVar9042, _mVar9043] 
result indices = ,2,3 
num reducers = 10 
replication = 1 

stack trace:
>org.apache.sysml.api.DMLScript.executeScript(DMLScript.java:374)
>org.apache.sysml.api.DMLScript.main(DMLScript.java:198)
>org.apache.sysml.test.integration.AutomatedTestBase.runTest(AutomatedTestBase.java:1238)
>org.apache.sysml.test.integration.applications.descriptivestats.UnivariateStatsBase.testWeightedScaleWithR(UnivariateStatsBase.java:260)
>org.apache.sysml.test.integration.applications.descriptivestats.UnivariateWeightedScaleSparseTest.testWeightedScale36(UnivariateWeightedScaleSparseTest.java:162)
>sun.reflect.NativeMethodAccessorImpl.invoke0(Native Method)
>sun.reflect.NativeMethodAccessorImpl.invoke(NativeMethodAccessorImpl.java:62)
>sun.reflect.DelegatingMethodAccessorImpl.invoke(DelegatingMethodAccessorImpl.java:43)
>java.lang.reflect.Method.invoke(Method.java:497)
>org.junit.runners.model.FrameworkMethod$1.runReflectiveCall(FrameworkMethod.java:47)
>org.junit.internal.runners.model.ReflectiveCallable.run(ReflectiveCallable.java:12)
>org.junit.runners.model.FrameworkMethod.invokeExplosively(FrameworkMethod.java:44)
>org.junit.internal.runners.statements.InvokeMethod.evaluate(InvokeMethod.java:17)
>org.junit.internal.runners.statements.RunBefores.evaluate(RunBefores.java:26)
>org.junit.internal.runners.statements.RunAfters.evaluate(RunAfters.java:27)
>org.junit.runners.ParentRunner.runLeaf(ParentRunner.java:271)
>org.junit.runners.BlockJUnit4ClassRunner.runChild(BlockJUnit4ClassRunner.java:70)
>org.junit.runners.BlockJUnit4ClassRunner.runChild(BlockJUnit4ClassRunner.java:50)
>org.junit.runners.ParentRunner$3.run(ParentRunner.java:238)
>org.apache.maven.surefire.junitcore.pc.Scheduler$1.run(Scheduler.java:318)
>org.apache.maven.surefire.junitcore.pc.InvokerStrategy.schedule(InvokerStrategy.java:41)
>org.apache.maven.surefire.junitcore.pc.Scheduler.schedule(Scheduler.java:274)
>org.junit.runners.ParentRunner.runChildren(ParentRunner.java:236)
>org.junit.runners.ParentRunner.access$000(ParentRunner.java:53)
>org.junit.runners.ParentRunner$2.evaluate(ParentRunner.java:229)
>org.junit.runners.ParentRunner.run(ParentRunner.java:309)
>org.junit.runners.Suite.runChild(Suite.java:127)
>org.junit.runners.Suite.runChild(Suite.java:26)
>org.junit.runners.ParentRunner$3.run(ParentRunner.java:238)
>org.apache.maven.surefire.junitcore.pc.Scheduler$1.run(Scheduler.java:318)
>org.apache.maven.surefire.junitcore.pc.InvokerStrategy.schedule(InvokerStrategy.java:41)
>org.apache.maven.surefire.junitcore.pc.Scheduler.schedule(Scheduler.java:274)
>org.junit.runners.ParentRunner.runChildren(ParentRunner.java:236)
>org.junit.runners.ParentRunner.access$000(ParentRunner.java:53)
>org.junit.runners.ParentRunner$2.evaluate(ParentRunner.java:229)
>org.junit.runners.ParentRunner.run(ParentRunner.java:309)
>org.junit.runners.Suite.runChild(Suite.java:127)
>org.junit.runners.Suite.runChild(Suite.java:26)
>org.junit.runners.ParentRunner$3.run(ParentRunner.java:238)
>org.apache.maven.surefire.junitcore.pc.Scheduler$1.run(Scheduler.java:318)
>java.util.concurrent.Executors$RunnableAdapter.call(Executors.java:511)
>java.util.concurrent.FutureTask.run(FutureTask.java:266)
>java.util.concurrent.ThreadPoolExecutor.runWorker(ThreadPoolExecutor.java:1142)
>java.util.concurrent.ThreadPoolExecutor$Worker.run(ThreadPoolExecutor.java:617)
>java.lang.Thread.run(Thread.java:745)

Tests run: 5117, Failures: 166, Errors: 0, Skipped: 0

[INFO] 
[INFO] --- maven-failsafe-plugin:2.17:verify (default) @ systemml ---
[INFO] Failsafe report directory: <https://sparktc.ibmcloud.com/jenkins/job/SystemML-DailyTest/ws/target/failsafe-reports>
[INFO] ------------------------------------------------------------------------
[INFO] BUILD FAILURE
[INFO] ------------------------------------------------------------------------
[INFO] Total time: 02:17 h
[INFO] Finished at: 2016-06-25T16:53:29-05:00
[INFO] Final Memory: 55M/2371M
[INFO] ------------------------------------------------------------------------
[ERROR] Failed to execute goal org.apache.maven.plugins:maven-failsafe-plugin:2.17:verify
(default) on project systemml: There are test failures.
[ERROR] 
[ERROR] Please refer to <https://sparktc.ibmcloud.com/jenkins/job/SystemML-DailyTest/ws/target/failsafe-reports>
for the individual test results.
[ERROR] -> [Help 1]
[ERROR] 
[ERROR] To see the full stack trace of the errors, re-run Maven with the -e switch.
[ERROR] Re-run Maven using the -X switch to enable full debug logging.
[ERROR] 
[ERROR] For more information about the errors and possible solutions, please read the following
articles:
[ERROR] [Help 1] http://cwiki.apache.org/confluence/display/MAVEN/MojoFailureException
Build step 'Execute shell' marked build as failure
Run condition [Always] enabling perform for step [[]]

Mime
View raw message