systemml-dev mailing list archives

Site index · List index
Message view « Date » · « Thread »
Top « Date » · « Thread »
From Gav <ipv6g...@gmail.com>
Subject Re: Build failed in Jenkins: SystemML-DailyTest #150
Date Thu, 24 Mar 2016 21:13:58 GMT
I'm sorry, what is it you want the Infrastructure Team to do here?

Gav...

On Fri, Mar 25, 2016 at 4:11 AM, Acs S <acs_s@yahoo.com> wrote:
> Changes are push to apache master, last night but those changes are not
> reflected in Git Repo yet.
>
> I can see these changes in my local repository and in Git Master Repository
> through my Eclipse environment.
> I cannot see these changes when I browse it through browser though.
>
> Seems like Matthias can see this change when he does pull. This was similar
> issue occurred in Dec 2015, when changes were more than 2400 lines. But this
> time change is very small.
>
> Please look into it.
>
> Details for the fix is as below:
> ------------------------------------------
> commit e63875b339185d6a13b75107632e1f19983d2ea6
> Author: Arvind Surve <acs_s@yahoo.com> 2016-03-23 20:53:11
> Committer: Arvind Surve <acs_s@yahoo.com> 2016-03-23 20:53:11
> Parent: bd9d2b19d288945ddba658686c8de71a74650c99 ([SYSTEMML-591] Cleanup
> debugger compilation chain (prep consolidation))
> Branches: Frame4, master, apache/master
>
> [HOTFIX][SYSTEMML-573] Frame fix
>
>
> -Arvind
> ________________________________
> From: "jenkins@spark.tc" <jenkins@spark.tc>
> To: mwdusenb@us.ibm.com; lresende@apache.org;
> dev@systemml.incubator.apache.org; asurve@us.ibm.com; mboehm@us.ibm.com
> Sent: Thursday, March 24, 2016 2:48 AM
> Subject: Build failed in Jenkins: SystemML-DailyTest #150
>
> See <https://sparktc.ibmcloud.com/jenkins/job/SystemML-DailyTest/150/>
>
> ------------------------------------------
> [...truncated 1343 lines...]
>     at
> org.apache.sysml.test.integration.functions.frame.FrameCopyTest.runFrameCopyTest(FrameCopyTest.java:123)
>     at
> org.apache.sysml.test.integration.functions.frame.FrameCopyTest.testFrameStringsMixedCBind(FrameCopyTest.java:62)
>
> testFrameStringsStringsCBind(org.apache.sysml.test.integration.functions.frame.FrameCopyTest)
> Time elapsed: 0.115 sec  <<< ERROR!
> java.lang.RuntimeException: java.lang.NullPointerException
>     at
> org.apache.sysml.runtime.util.UtilFunctions.compareTo(UtilFunctions.java:359)
>     at
> org.apache.sysml.test.integration.functions.frame.FrameCopyTest.runFrameCopyTest(FrameCopyTest.java:123)
>     at
> org.apache.sysml.test.integration.functions.frame.FrameCopyTest.testFrameStringsStringsCBind(FrameCopyTest.java:47)
>
> testFrameStringsStringsRBind(org.apache.sysml.test.integration.functions.frame.FrameCopyTest)
> Time elapsed: 0.076 sec  <<< ERROR!
> java.lang.RuntimeException: java.lang.NullPointerException
>     at
> org.apache.sysml.runtime.util.UtilFunctions.compareTo(UtilFunctions.java:359)
>     at
> org.apache.sysml.test.integration.functions.frame.FrameCopyTest.runFrameCopyTest(FrameCopyTest.java:123)
>     at
> org.apache.sysml.test.integration.functions.frame.FrameCopyTest.testFrameStringsStringsRBind(FrameCopyTest.java:52)
>
> Running
> org.apache.sysml.test.integration.functions.caching.CachingPWriteExportTest
> Tests run: 2, Failures: 0, Errors: 0, Skipped: 0, Time elapsed: 43.601 sec -
> in
> org.apache.sysml.test.integration.functions.caching.CachingPWriteExportTest
> Running org.apache.sysml.test.integration.functions.reorg.FullTransposeTest
> Tests run: 18, Failures: 0, Errors: 0, Skipped: 0, Time elapsed: 399.614 sec
> - in org.apache.sysml.test.integration.functions.reorg.FullTransposeTest
> Running org.apache.sysml.test.integration.functions.transform.RunTest
> Tests run: 24, Failures: 0, Errors: 0, Skipped: 0, Time elapsed: 109.465 sec
> - in org.apache.sysml.test.integration.functions.transform.RunTest
> Running
> org.apache.sysml.test.integration.functions.jmlc.ReuseModelVariablesTest
> Tests run: 8, Failures: 0, Errors: 0, Skipped: 0, Time elapsed: 8.261 sec -
> in org.apache.sysml.test.integration.functions.jmlc.ReuseModelVariablesTest
> Running
> org.apache.sysml.test.integration.functions.binary.matrix_full_cellwise.FullMatrixMatrixCellwiseOperationTest
> Tests run: 108, Failures: 0, Errors: 0, Skipped: 0, Time elapsed: 1,975.304
> sec - in
> org.apache.sysml.test.integration.functions.binary.matrix_full_cellwise.FullMatrixMatrixCellwiseOperationTest
> 16/03/24 03:32:53 INFO util.Utils: Shutdown hook called
> 16/03/24 03:32:53 INFO util.Utils: Deleting directory
> /tmp/spark-3bc76a53-9cd4-4de2-9af7-4ec4e85547e3
> Running org.apache.sysml.test.integration.functions.jmlc.FrameDecodeTest
> Tests run: 4, Failures: 0, Errors: 0, Skipped: 0, Time elapsed: 4.777 sec -
> in org.apache.sysml.test.integration.functions.jmlc.FrameDecodeTest
> Running org.apache.sysml.test.integration.functions.jmlc.FrameTransformTest
> Tests run: 4, Failures: 0, Errors: 0, Skipped: 0, Time elapsed: 5.028 sec -
> in org.apache.sysml.test.integration.functions.jmlc.FrameTransformTest
> Running org.apache.sysml.test.integration.functions.jmlc.FrameReadMetaTest
> Tests run: 2, Failures: 0, Errors: 0, Skipped: 0, Time elapsed: 4.813 sec -
> in org.apache.sysml.test.integration.functions.jmlc.FrameReadMetaTest
> Running
> org.apache.sysml.test.integration.functions.quaternary.WeightedCrossEntropyTest
> Tests run: 16, Failures: 0, Errors: 0, Skipped: 0, Time elapsed: 237.809 sec
> - in
> org.apache.sysml.test.integration.functions.quaternary.WeightedCrossEntropyTest
> 16/03/24 03:33:16 INFO util.Utils: Shutdown hook called
> 16/03/24 03:33:16 INFO util.Utils: Deleting directory
> /tmp/spark-fee6ef49-eefe-48d2-951c-0b4b7f97c4c7
> Running org.apache.sysml.test.integration.functions.reorg.FullReverseTest
> Tests run: 14, Failures: 0, Errors: 0, Skipped: 0, Time elapsed: 489.946 sec
> - in org.apache.sysml.test.integration.functions.reorg.FullReverseTest
> Running org.apache.sysml.test.integration.functions.blocks.WhileTest
> Tests run: 2, Failures: 0, Errors: 0, Skipped: 0, Time elapsed: 3.38 sec -
> in org.apache.sysml.test.integration.functions.blocks.WhileTest
> Running
> org.apache.sysml.test.integration.functions.vect.LeftIndexingChainUpdateTest
> Tests run: 4, Failures: 0, Errors: 0, Skipped: 0, Time elapsed: 20.921 sec -
> in
> org.apache.sysml.test.integration.functions.vect.LeftIndexingChainUpdateTest
> Running org.apache.sysml.test.integration.functions.blocks.VariableTest
> Tests run: 3, Failures: 0, Errors: 0, Skipped: 0, Time elapsed: 6.147 sec -
> in org.apache.sysml.test.integration.functions.blocks.VariableTest
> Running org.apache.sysml.test.integration.functions.transform.ScalingTest
> Tests run: 8, Failures: 0, Errors: 0, Skipped: 0, Time elapsed: 81.953 sec -
> in org.apache.sysml.test.integration.functions.transform.ScalingTest
> Running org.apache.sysml.test.integration.functions.dmlscript.DMLScriptTest2
> Tests run: 2, Failures: 0, Errors: 0, Skipped: 0, Time elapsed: 3.596 sec -
> in org.apache.sysml.test.integration.functions.dmlscript.DMLScriptTest2
> 16/03/24 03:33:44 WARN util.NativeCodeLoader: Unable to load native-hadoop
> library for your platform... using builtin-java classes where applicable
> Running org.apache.sysml.test.integration.functions.dmlscript.DMLScriptTest1
> Tests run: 2, Failures: 0, Errors: 0, Skipped: 0, Time elapsed: 3.908 sec -
> in org.apache.sysml.test.integration.functions.dmlscript.DMLScriptTest1
> 16/03/24 03:33:47 WARN util.NativeCodeLoader: Unable to load native-hadoop
> library for your platform... using builtin-java classes where applicable
> Running
> org.apache.sysml.test.integration.functions.jmlc.SystemTMulticlassSVMScoreTest
> Tests run: 2, Failures: 0, Errors: 0, Skipped: 0, Time elapsed: 85.461 sec -
> in
> org.apache.sysml.test.integration.functions.jmlc.SystemTMulticlassSVMScoreTest
> Running
> org.apache.sysml.test.integration.functions.vect.AutoVectorizationTest
> Tests run: 24, Failures: 0, Errors: 0, Skipped: 0, Time elapsed: 105.679 sec
> - in org.apache.sysml.test.integration.functions.vect.AutoVectorizationTest
> Running org.apache.sysml.test.integration.functions.reorg.MatrixReshapeTest
> Tests run: 36, Failures: 0, Errors: 0, Skipped: 0, Time elapsed: 610.223 sec
> - in org.apache.sysml.test.integration.functions.reorg.MatrixReshapeTest
> Running
> org.apache.sysml.test.integration.functions.indexing.RightIndexingVectorTest
> Tests run: 3, Failures: 0, Errors: 0, Skipped: 0, Time elapsed: 69.012 sec -
> in
> org.apache.sysml.test.integration.functions.indexing.RightIndexingVectorTest
> 16/03/24 03:35:37 WARN util.NativeCodeLoader: Unable to load native-hadoop
> library for your platform... using builtin-java classes where applicable
> Running
> org.apache.sysml.test.integration.functions.indexing.LeftIndexingSparseSparseTest
> Tests run: 15, Failures: 0, Errors: 0, Skipped: 0, Time elapsed: 118.468 sec
> - in
> org.apache.sysml.test.integration.functions.indexing.LeftIndexingSparseSparseTest
> 16/03/24 03:35:46 INFO util.Utils: Shutdown hook called
> 16/03/24 03:35:46 INFO util.Utils: Deleting directory
> /tmp/spark-f534f6fe-0b93-45ba-9f64-22542fd8326f
> Running org.apache.sysml.test.integration.functions.transform.TransformTest
> Tests run: 80, Failures: 0, Errors: 0, Skipped: 0, Time elapsed: 364.544 sec
> - in org.apache.sysml.test.integration.functions.transform.TransformTest
> Running
> org.apache.sysml.test.integration.functions.quaternary.WeightedUnaryMatrixMultTest
> Tests run: 26, Failures: 0, Errors: 0, Skipped: 0, Time elapsed: 562.371 sec
> - in
> org.apache.sysml.test.integration.functions.quaternary.WeightedUnaryMatrixMultTest
> 16/03/24 03:37:49 INFO util.Utils: Shutdown hook called
> 16/03/24 03:37:49 INFO util.Utils: Deleting directory
> /tmp/spark-69a638d4-dd2d-4006-868b-5a80ea26b4ef
> Running
> org.apache.sysml.test.integration.functions.indexing.RightIndexingMatrixTest
> Tests run: 6, Failures: 0, Errors: 0, Skipped: 0, Time elapsed: 248.939 sec
> - in
> org.apache.sysml.test.integration.functions.indexing.RightIndexingMatrixTest
> Running
> org.apache.sysml.test.integration.functions.indexing.LeftIndexingScalarTest
> Tests run: 3, Failures: 0, Errors: 0, Skipped: 0, Time elapsed: 243.466 sec
> - in
> org.apache.sysml.test.integration.functions.indexing.LeftIndexingScalarTest
> Running
> org.apache.sysml.test.integration.functions.quaternary.WeightedSquaredLossTest
> Tests run: 55, Failures: 0, Errors: 0, Skipped: 0, Time elapsed: 828.39 sec
> - in
> org.apache.sysml.test.integration.functions.quaternary.WeightedSquaredLossTest
> 16/03/24 03:39:44 INFO util.Utils: Shutdown hook called
> 16/03/24 03:39:44 INFO util.Utils: Deleting directory
> /tmp/spark-d62209eb-bf40-471b-ad35-6937cee45ba7
> Running
> org.apache.sysml.test.integration.functions.updateinplace.UpdateInPlaceTest
> Tests run: 15, Failures: 0, Errors: 0, Skipped: 0, Time elapsed: 5.489 sec -
> in
> org.apache.sysml.test.integration.functions.updateinplace.UpdateInPlaceTest
> Running org.apache.sysml.test.integration.functions.append.StringAppendTest
> Tests run: 9, Failures: 0, Errors: 0, Skipped: 0, Time elapsed: 38.836 sec -
> in org.apache.sysml.test.integration.functions.append.StringAppendTest
> Running
> org.apache.sysml.test.integration.functions.append.RBindCBindMatrixTest
> Tests run: 12, Failures: 0, Errors: 0, Skipped: 0, Time elapsed: 149.542 sec
> - in org.apache.sysml.test.integration.functions.append.RBindCBindMatrixTest
> Running
> org.apache.sysml.test.integration.functions.indexing.LeftIndexingSparseDenseTest
> Tests run: 15, Failures: 0, Errors: 0, Skipped: 0, Time elapsed: 290.231 sec
> - in
> org.apache.sysml.test.integration.functions.indexing.LeftIndexingSparseDenseTest
> 16/03/24 03:40:28 INFO util.Utils: Shutdown hook called
> 16/03/24 03:40:28 INFO util.Utils: Deleting directory
> /tmp/spark-974aa57e-d14c-4296-9800-1a031cfee043
> Running org.apache.sysml.test.integration.scalability.LinearRegressionTest
> Tests run: 1, Failures: 0, Errors: 0, Skipped: 0, Time elapsed: 1.771 sec -
> in org.apache.sysml.test.integration.scalability.LinearRegressionTest
> Running org.apache.sysml.test.integration.scalability.PageRankTest
> Tests run: 1, Failures: 0, Errors: 0, Skipped: 0, Time elapsed: 1.179 sec -
> in org.apache.sysml.test.integration.scalability.PageRankTest
> Running
> org.apache.sysml.test.integration.applications.descriptivestats.BivariateCategoricalCategoricallTest
> Tests run: 3, Failures: 0, Errors: 0, Skipped: 0, Time elapsed: 18.551 sec -
> in
> org.apache.sysml.test.integration.applications.descriptivestats.BivariateCategoricalCategoricallTest
> Running
> org.apache.sysml.test.integration.applications.parfor.ParForBivariateStatsTest
> Tests run: 5, Failures: 0, Errors: 0, Skipped: 0, Time elapsed: 61.436 sec -
> in
> org.apache.sysml.test.integration.applications.parfor.ParForBivariateStatsTest
> Running
> org.apache.sysml.test.integration.applications.descriptivestats.BivariateOrdinalOrdinalTest
> Tests run: 2, Failures: 0, Errors: 0, Skipped: 0, Time elapsed: 9.455 sec -
> in
> org.apache.sysml.test.integration.applications.descriptivestats.BivariateOrdinalOrdinalTest
> Running
> org.apache.sysml.test.integration.applications.descriptivestats.BivariateScaleCategoricalTest
> Tests run: 2, Failures: 0, Errors: 0, Skipped: 0, Time elapsed: 8.838 sec -
> in
> org.apache.sysml.test.integration.applications.descriptivestats.BivariateScaleCategoricalTest
> Running
> org.apache.sysml.test.integration.applications.descriptivestats.BivariateScaleScaleTest
> Tests run: 2, Failures: 0, Errors: 0, Skipped: 0, Time elapsed: 9.916 sec -
> in
> org.apache.sysml.test.integration.applications.descriptivestats.BivariateScaleScaleTest
> Running
> org.apache.sysml.test.integration.applications.descriptivestats.OrderStatisticsTest
> Tests run: 1, Failures: 0, Errors: 0, Skipped: 0, Time elapsed: 0.487 sec -
> in
> org.apache.sysml.test.integration.applications.descriptivestats.OrderStatisticsTest
> Running
> org.apache.sysml.test.integration.applications.descriptivestats.UnivariateCategoricalTest
> Tests run: 2, Failures: 0, Errors: 0, Skipped: 0, Time elapsed: 6.635 sec -
> in
> org.apache.sysml.test.integration.applications.descriptivestats.UnivariateCategoricalTest
> Running
> org.apache.sysml.test.integration.applications.parfor.ParForCVMulticlassSVMTest
> Tests run: 6, Failures: 0, Errors: 0, Skipped: 0, Time elapsed: 34.719 sec -
> in
> org.apache.sysml.test.integration.applications.parfor.ParForCVMulticlassSVMTest
> Running
> org.apache.sysml.test.integration.applications.parfor.ParForUnivariateStatsTest
> Tests run: 3, Failures: 0, Errors: 0, Skipped: 0, Time elapsed: 13.396 sec -
> in
> org.apache.sysml.test.integration.applications.parfor.ParForUnivariateStatsTest
> Running org.apache.sysml.test.integration.applications.dml.ArimaDMLTest
> Tests run: 1, Failures: 0, Errors: 0, Skipped: 0, Time elapsed: 74.693 sec -
> in org.apache.sysml.test.integration.applications.dml.ArimaDMLTest
> Running
> org.apache.sysml.test.integration.functions.indexing.Jdk7IssueRightIndexingTest
> Tests run: 8, Failures: 0, Errors: 0, Skipped: 0, Time elapsed: 490.287 sec
> - in
> org.apache.sysml.test.integration.functions.indexing.Jdk7IssueRightIndexingTest
> Running org.apache.sysml.test.integration.functions.append.AppendVectorTest
> Tests run: 6, Failures: 0, Errors: 0, Skipped: 0, Time elapsed: 408.301 sec
> - in org.apache.sysml.test.integration.functions.append.AppendVectorTest
> Running
> org.apache.sysml.test.integration.functions.quaternary.WeightedDivMatrixMultTest
> Tests run: 88, Failures: 0, Errors: 0, Skipped: 0, Time elapsed: 1,118.641
> sec - in
> org.apache.sysml.test.integration.functions.quaternary.WeightedDivMatrixMultTest
> 16/03/24 03:44:37 INFO util.Utils: Shutdown hook called
> 16/03/24 03:44:37 INFO util.Utils: Deleting directory
> /tmp/spark-e364041e-d053-4f21-80aa-e14d43528d2f
> Running
> org.apache.sysml.test.integration.functions.quaternary.WeightedSigmoidTest
> Tests run: 56, Failures: 0, Errors: 0, Skipped: 0, Time elapsed: 1,009.323
> sec - in
> org.apache.sysml.test.integration.functions.quaternary.WeightedSigmoidTest
> 16/03/24 03:45:38 INFO util.Utils: Shutdown hook called
> 16/03/24 03:45:38 INFO util.Utils: Deleting directory
> /tmp/spark-4d8fd67d-fb90-4124-90c1-eecda24bcce0
> Running
> org.apache.sysml.test.integration.functions.indexing.LeftIndexingTest
> Tests run: 3, Failures: 0, Errors: 0, Skipped: 0, Time elapsed: 655.917 sec
> - in org.apache.sysml.test.integration.functions.indexing.LeftIndexingTest
> Running
> org.apache.sysml.test.integration.applications.parfor.ParForCorrelationTest
> Tests run: 12, Failures: 0, Errors: 0, Skipped: 0, Time elapsed: 278.76 sec
> - in
> org.apache.sysml.test.integration.applications.parfor.ParForCorrelationTest
> Running
> org.apache.sysml.test.integration.applications.descriptivestats.UnivariateUnweightedScaleDenseTest
> Tests run: 24, Failures: 0, Errors: 0, Skipped: 0, Time elapsed: 326.855 sec
> - in
> org.apache.sysml.test.integration.applications.descriptivestats.UnivariateUnweightedScaleDenseTest
> Running
> org.apache.sysml.test.integration.applications.parfor.ParForCorrelationTestLarge
> Tests run: 2, Failures: 0, Errors: 0, Skipped: 0, Time elapsed: 44.037 sec -
> in
> org.apache.sysml.test.integration.applications.parfor.ParForCorrelationTestLarge
> Running org.apache.sysml.test.integration.functions.reorg.FullOrderTest
> Tests run: 132, Failures: 0, Errors: 0, Skipped: 0, Time elapsed: 1,358.866
> sec - in org.apache.sysml.test.integration.functions.reorg.FullOrderTest
> Running
> org.apache.sysml.test.integration.applications.descriptivestats.UnivariateWeightedScaleDenseTest
> Tests run: 24, Failures: 0, Errors: 0, Skipped: 0, Time elapsed: 351.663 sec
> - in
> org.apache.sysml.test.integration.applications.descriptivestats.UnivariateWeightedScaleDenseTest
> Running org.apache.sysml.test.integration.functions.append.AppendChainTest
> Tests run: 12, Failures: 0, Errors: 0, Skipped: 0, Time elapsed: 1,075.051
> sec - in org.apache.sysml.test.integration.functions.append.AppendChainTest
> Running
> org.apache.sysml.test.integration.applications.parfor.ParForNaiveBayesTest
> Tests run: 10, Failures: 0, Errors: 0, Skipped: 0, Time elapsed: 496.5 sec -
> in
> org.apache.sysml.test.integration.applications.parfor.ParForNaiveBayesTest
> Running
> org.apache.sysml.test.integration.applications.descriptivestats.UnivariateUnweightedScaleSparseTest
> Tests run: 24, Failures: 0, Errors: 0, Skipped: 0, Time elapsed: 290.466 sec
> - in
> org.apache.sysml.test.integration.applications.descriptivestats.UnivariateUnweightedScaleSparseTest
> Running org.apache.sysml.test.integration.applications.dml.HITSDMLTest
> Tests run: 1, Failures: 0, Errors: 0, Skipped: 0, Time elapsed: 88.503 sec -
> in org.apache.sysml.test.integration.applications.dml.HITSDMLTest
> Running org.apache.sysml.test.integration.functions.append.AppendMatrixTest
> Tests run: 22, Failures: 0, Errors: 0, Skipped: 0, Time elapsed: 1,416.437
> sec - in org.apache.sysml.test.integration.functions.append.AppendMatrixTest
> Running
> org.apache.sysml.test.integration.applications.descriptivestats.UnivariateWeightedScaleSparseTest
> Tests run: 24, Failures: 0, Errors: 0, Skipped: 0, Time elapsed: 335.944 sec
> - in
> org.apache.sysml.test.integration.applications.descriptivestats.UnivariateWeightedScaleSparseTest
> Running org.apache.sysml.test.integration.applications.pydml.ArimaPyDMLTest
> Tests run: 1, Failures: 0, Errors: 0, Skipped: 0, Time elapsed: 49.509 sec -
> in org.apache.sysml.test.integration.applications.pydml.ArimaPyDMLTest
> Running org.apache.sysml.test.integration.applications.pydml.HITSPyDMLTest
> Tests run: 1, Failures: 0, Errors: 0, Skipped: 0, Time elapsed: 78.091 sec -
> in org.apache.sysml.test.integration.applications.pydml.HITSPyDMLTest
> Running
> org.apache.sysml.test.integration.applications.dml.LinearRegressionDMLTest
> Tests run: 7, Failures: 0, Errors: 0, Skipped: 0, Time elapsed: 52.183 sec -
> in
> org.apache.sysml.test.integration.applications.dml.LinearRegressionDMLTest
> Running
> org.apache.sysml.test.integration.applications.pydml.CsplineDSPyDMLTest
> Tests run: 3, Failures: 0, Errors: 0, Skipped: 0, Time elapsed: 6.964 sec -
> in org.apache.sysml.test.integration.applications.pydml.CsplineDSPyDMLTest
> Running
> org.apache.sysml.test.integration.applications.pydml.LinearLogRegPyDMLTest
> Tests run: 7, Failures: 0, Errors: 0, Skipped: 0, Time elapsed: 93.162 sec -
> in
> org.apache.sysml.test.integration.applications.pydml.LinearLogRegPyDMLTest
> Running
> org.apache.sysml.test.integration.applications.pydml.NaiveBayesPyDMLTest
> Tests run: 6, Failures: 0, Errors: 0, Skipped: 0, Time elapsed: 81.037 sec -
> in org.apache.sysml.test.integration.applications.pydml.NaiveBayesPyDMLTest
> Running org.apache.sysml.test.integration.applications.dml.CsplineCGDMLTest
> Tests run: 3, Failures: 0, Errors: 0, Skipped: 0, Time elapsed: 15.352 sec -
> in org.apache.sysml.test.integration.applications.dml.CsplineCGDMLTest
> Running org.apache.sysml.test.integration.applications.dml.L2SVMDMLTest
> Tests run: 9, Failures: 0, Errors: 0, Skipped: 0, Time elapsed: 65.316 sec -
> in org.apache.sysml.test.integration.applications.dml.L2SVMDMLTest
> Running
> org.apache.sysml.test.integration.applications.pydml.MDABivariateStatsPyDMLTest
> Tests run: 4, Failures: 0, Errors: 0, Skipped: 0, Time elapsed: 295.29 sec -
> in
> org.apache.sysml.test.integration.applications.pydml.MDABivariateStatsPyDMLTest
> Running
> org.apache.sysml.test.integration.applications.pydml.PageRankPyDMLTest
> Tests run: 3, Failures: 0, Errors: 0, Skipped: 0, Time elapsed: 6.612 sec -
> in org.apache.sysml.test.integration.applications.pydml.PageRankPyDMLTest
> Running
> org.apache.sysml.test.integration.applications.pydml.NaiveBayesParforPyDMLTest
> Tests run: 6, Failures: 0, Errors: 0, Skipped: 0, Time elapsed: 81.024 sec -
> in
> org.apache.sysml.test.integration.applications.pydml.NaiveBayesParforPyDMLTest
> Running org.apache.sysml.test.integration.applications.dml.NaiveBayesDMLTest
> Tests run: 6, Failures: 0, Errors: 0, Skipped: 0, Time elapsed: 81.664 sec -
> in org.apache.sysml.test.integration.applications.dml.NaiveBayesDMLTest
> Running
> org.apache.sysml.test.integration.applications.dml.MDABivariateStatsDMLTest
> Tests run: 4, Failures: 0, Errors: 0, Skipped: 0, Time elapsed: 296.067 sec
> - in
> org.apache.sysml.test.integration.applications.dml.MDABivariateStatsDMLTest
> Running org.apache.sysml.test.integration.applications.dml.PageRankDMLTest
> Tests run: 3, Failures: 0, Errors: 0, Skipped: 0, Time elapsed: 6.683 sec -
> in org.apache.sysml.test.integration.applications.dml.PageRankDMLTest
> Running org.apache.sysml.test.integration.applications.pydml.GLMPyDMLTest
> Tests run: 30, Failures: 0, Errors: 0, Skipped: 0, Time elapsed: 584.73 sec
> - in org.apache.sysml.test.integration.applications.pydml.GLMPyDMLTest
> Running
> org.apache.sysml.test.integration.applications.pydml.MultiClassSVMPyDMLTest
> Tests run: 9, Failures: 0, Errors: 0, Skipped: 0, Time elapsed: 88.504 sec -
> in
> org.apache.sysml.test.integration.applications.pydml.MultiClassSVMPyDMLTest
> Running org.apache.sysml.test.integration.applications.dml.ID3DMLTest
> Tests run: 2, Failures: 0, Errors: 0, Skipped: 0, Time elapsed: 369.703 sec
> - in org.apache.sysml.test.integration.applications.dml.ID3DMLTest
> Running org.apache.sysml.test.integration.applications.dml.GLMDMLTest
> Tests run: 30, Failures: 0, Errors: 0, Skipped: 0, Time elapsed: 828.114 sec
> - in org.apache.sysml.test.integration.applications.dml.GLMDMLTest
> Running
> org.apache.sysml.test.integration.applications.pydml.CsplineCGPyDMLTest
> Tests run: 3, Failures: 0, Errors: 0, Skipped: 0, Time elapsed: 6.246 sec -
> in org.apache.sysml.test.integration.applications.pydml.CsplineCGPyDMLTest
> Running org.apache.sysml.test.integration.applications.pydml.WelchTPyDMLTest
> Tests run: 3, Failures: 0, Errors: 0, Skipped: 0, Time elapsed: 6.647 sec -
> in org.apache.sysml.test.integration.applications.pydml.WelchTPyDMLTest
> Running
> org.apache.sysml.test.integration.applications.dml.MultiClassSVMDMLTest
> Tests run: 9, Failures: 0, Errors: 0, Skipped: 0, Time elapsed: 88.158 sec -
> in org.apache.sysml.test.integration.applications.dml.MultiClassSVMDMLTest
> Running org.apache.sysml.test.integration.applications.dml.CsplineDSDMLTest
> Tests run: 3, Failures: 0, Errors: 0, Skipped: 0, Time elapsed: 13.621 sec -
> in org.apache.sysml.test.integration.applications.dml.CsplineDSDMLTest
> Running
> org.apache.sysml.test.integration.applications.pydml.ApplyTransformPyDMLTest
> Tests run: 7, Failures: 0, Errors: 0, Skipped: 0, Time elapsed: 1.19 sec -
> in
> org.apache.sysml.test.integration.applications.pydml.ApplyTransformPyDMLTest
> Running
> org.apache.sysml.test.integration.applications.dml.NaiveBayesParforDMLTest
> Tests run: 6, Failures: 0, Errors: 0, Skipped: 0, Time elapsed: 81.235 sec -
> in
> org.apache.sysml.test.integration.applications.dml.NaiveBayesParforDMLTest
> Running org.apache.sysml.test.integration.applications.pydml.L2SVMPyDMLTest
> Tests run: 9, Failures: 0, Errors: 0, Skipped: 0, Time elapsed: 65.255 sec -
> in org.apache.sysml.test.integration.applications.pydml.L2SVMPyDMLTest
> Running
> org.apache.sysml.test.integration.applications.pydml.LinearRegressionPyDMLTest
> Tests run: 7, Failures: 0, Errors: 0, Skipped: 0, Time elapsed: 52.307 sec -
> in
> org.apache.sysml.test.integration.applications.pydml.LinearRegressionPyDMLTest
> Running
> org.apache.sysml.test.integration.applications.dml.LinearLogRegDMLTest
> Tests run: 7, Failures: 0, Errors: 0, Skipped: 0, Time elapsed: 62.182 sec -
> in org.apache.sysml.test.integration.applications.dml.LinearLogRegDMLTest
> Running org.apache.sysml.test.integration.applications.dml.GNMFDMLTest
> Tests run: 3, Failures: 0, Errors: 0, Skipped: 0, Time elapsed: 66.801 sec -
> in org.apache.sysml.test.integration.applications.dml.GNMFDMLTest
> Running org.apache.sysml.test.integration.applications.dml.WelchTDMLTest
> Tests run: 3, Failures: 0, Errors: 0, Skipped: 0, Time elapsed: 6.625 sec -
> in org.apache.sysml.test.integration.applications.dml.WelchTDMLTest
> Running
> org.apache.sysml.test.integration.applications.dml.ApplyTransformDMLTest
> Tests run: 7, Failures: 0, Errors: 0, Skipped: 0, Time elapsed: 10.954 sec -
> in org.apache.sysml.test.integration.applications.dml.ApplyTransformDMLTest
> Running org.apache.sysml.test.integration.applications.pydml.ID3PyDMLTest
> Tests run: 2, Failures: 0, Errors: 0, Skipped: 0, Time elapsed: 327.413 sec
> - in org.apache.sysml.test.integration.applications.pydml.ID3PyDMLTest
> Running org.apache.sysml.test.integration.applications.pydml.GNMFPyDMLTest
> Tests run: 3, Failures: 0, Errors: 0, Skipped: 0, Time elapsed: 57.652 sec -
> in org.apache.sysml.test.integration.applications.pydml.GNMFPyDMLTest
>
> Results :
>
> Tests in error:
>   FrameCopyTest.testFrameMixedStringsCBind:57->runFrameCopyTest:178 Runtime
> java...
>   FrameCopyTest.testFrameMixedMixedCBind:67->runFrameCopyTest:178 Runtime
> java.l...
>   FrameCopyTest.testFrameMixedMixedRBind:72->runFrameCopyTest:178 Runtime
> java.l...
>   FrameCopyTest.testFrameStringsMixedCBind:62->runFrameCopyTest:178 Runtime
> java...
>   FrameCopyTest.testFrameStringsStringsCBind:47->runFrameCopyTest:178
> Runtime ja...
>   FrameCopyTest.testFrameStringsStringsRBind:52->runFrameCopyTest:178
> Runtime ja...
>
> Tests run: 4856, Failures: 0, Errors: 6, Skipped: 0
>
> [INFO]
> [INFO] --- maven-failsafe-plugin:2.17:verify (default) @ systemml ---
> [INFO] Failsafe report directory:
> <https://sparktc.ibmcloud.com/jenkins/job/SystemML-DailyTest/ws/target/failsafe-reports>
> [INFO]
> ------------------------------------------------------------------------
> [INFO] BUILD FAILURE
> [INFO]
> ------------------------------------------------------------------------
> [INFO] Total time: 02:16 h
> [INFO] Finished at: 2016-03-24T04:48:31-05:00
> [INFO] Final Memory: 59M/2480M
>
> [INFO]
> ------------------------------------------------------------------------
> [ERROR] Failed to execute goal
> org.apache.maven.plugins:maven-failsafe-plugin:2.17:verify (default) on
> project systemml: There are test failures.
> [ERROR]
> [ERROR] Please refer to
> <https://sparktc.ibmcloud.com/jenkins/job/SystemML-DailyTest/ws/target/failsafe-reports>
> for the individual test results.
> [ERROR] -> [Help 1]
> [ERROR]
> [ERROR] To see the full stack trace of the errors, re-run Maven with the -e
> switch.
> [ERROR] Re-run Maven using the -X switch to enable full debug logging.
> [ERROR]
> [ERROR] For more information about the errors and possible solutions, please
> read the following articles:
> [ERROR] [Help 1]
> http://cwiki.apache.org/confluence/display/MAVEN/MojoFailureException
> Build step 'Execute shell' marked build as failure
> Run condition [Always] enabling perform for step [[]]
>
>



-- 
Gav...

Mime
View raw message