systemml-dev mailing list archives

Site index · List index
Message view « Date » · « Thread »
Top « Date » · « Thread »
From jenk...@spark.tc
Subject Build failed in Jenkins: SystemML-DailyTest #141
Date Sun, 20 Mar 2016 09:47:52 GMT
See <https://sparktc.ibmcloud.com/jenkins/job/SystemML-DailyTest/141/changes>

Changes:

[Matthias Boehm] [SYSTEMML-585] Fix JMLC connection to disable any multi-threaded ops

[Matthias Boehm] [SYSTEMML-584] New thread-local configuration handling (dml/compiler)

------------------------------------------
[...truncated 1519 lines...]
Tests run: 18, Failures: 0, Errors: 0, Skipped: 0, Time elapsed: 408.447 sec - in org.apache.sysml.test.integration.functions.reorg.FullTransposeTest
Running org.apache.sysml.test.integration.functions.jmlc.ReuseModelVariablesTest
Tests run: 8, Failures: 0, Errors: 0, Skipped: 0, Time elapsed: 7.19 sec - in org.apache.sysml.test.integration.functions.jmlc.ReuseModelVariablesTest
Running org.apache.sysml.test.integration.functions.transform.RunTest
Tests run: 24, Failures: 0, Errors: 0, Skipped: 0, Time elapsed: 113.058 sec - in org.apache.sysml.test.integration.functions.transform.RunTest
Running org.apache.sysml.test.integration.functions.jmlc.FrameDecodeTest
Tests run: 4, Failures: 0, Errors: 0, Skipped: 0, Time elapsed: 4.163 sec - in org.apache.sysml.test.integration.functions.jmlc.FrameDecodeTest
Running org.apache.sysml.test.integration.functions.jmlc.FrameTransformTest
Tests run: 4, Failures: 0, Errors: 0, Skipped: 0, Time elapsed: 3.73 sec - in org.apache.sysml.test.integration.functions.jmlc.FrameTransformTest
Running org.apache.sysml.test.integration.functions.transform.ScalingTest
Tests run: 8, Failures: 0, Errors: 0, Skipped: 0, Time elapsed: 74.334 sec - in org.apache.sysml.test.integration.functions.transform.ScalingTest
Running org.apache.sysml.test.integration.functions.reorg.FullReverseTest
Tests run: 14, Failures: 0, Errors: 0, Skipped: 0, Time elapsed: 485.848 sec - in org.apache.sysml.test.integration.functions.reorg.FullReverseTest
Running org.apache.sysml.test.integration.functions.vect.LeftIndexingChainUpdateTest
Tests run: 4, Failures: 0, Errors: 0, Skipped: 0, Time elapsed: 18.514 sec - in org.apache.sysml.test.integration.functions.vect.LeftIndexingChainUpdateTest
Running org.apache.sysml.test.integration.functions.blocks.WhileTest
Tests run: 2, Failures: 0, Errors: 0, Skipped: 0, Time elapsed: 5.617 sec - in org.apache.sysml.test.integration.functions.blocks.WhileTest
Running org.apache.sysml.test.integration.functions.blocks.VariableTest
Tests run: 3, Failures: 0, Errors: 0, Skipped: 0, Time elapsed: 5.938 sec - in org.apache.sysml.test.integration.functions.blocks.VariableTest
Running org.apache.sysml.test.integration.functions.dmlscript.DMLScriptTest1
Tests run: 2, Failures: 0, Errors: 0, Skipped: 0, Time elapsed: 4.159 sec - in org.apache.sysml.test.integration.functions.dmlscript.DMLScriptTest1
Running org.apache.sysml.test.integration.functions.binary.matrix_full_cellwise.FullMatrixMatrixCellwiseOperationTest
Tests run: 108, Failures: 0, Errors: 0, Skipped: 0, Time elapsed: 1,970.223 sec - in org.apache.sysml.test.integration.functions.binary.matrix_full_cellwise.FullMatrixMatrixCellwiseOperationTest
16/03/20 03:32:47 INFO util.Utils: Shutdown hook called
16/03/20 03:32:47 INFO util.Utils: Deleting directory /tmp/spark-c2a6c398-0024-4fa7-8200-89ad5f4a0a8d
Running org.apache.sysml.test.integration.functions.dmlscript.DMLScriptTest2
Tests run: 2, Failures: 0, Errors: 0, Skipped: 0, Time elapsed: 4.34 sec - in org.apache.sysml.test.integration.functions.dmlscript.DMLScriptTest2
16/03/20 03:32:49 WARN util.NativeCodeLoader: Unable to load native-hadoop library for your
platform... using builtin-java classes where applicable
16/03/20 03:32:52 WARN util.NativeCodeLoader: Unable to load native-hadoop library for your
platform... using builtin-java classes where applicable
Running org.apache.sysml.test.integration.functions.jmlc.SystemTMulticlassSVMScoreTest
Tests run: 2, Failures: 0, Errors: 0, Skipped: 0, Time elapsed: 85.579 sec - in org.apache.sysml.test.integration.functions.jmlc.SystemTMulticlassSVMScoreTest
Running org.apache.sysml.test.integration.functions.vect.AutoVectorizationTest
Tests run: 24, Failures: 0, Errors: 0, Skipped: 0, Time elapsed: 114.064 sec - in org.apache.sysml.test.integration.functions.vect.AutoVectorizationTest
Running org.apache.sysml.test.integration.functions.indexing.RightIndexingVectorTest
Tests run: 3, Failures: 0, Errors: 0, Skipped: 0, Time elapsed: 91.63 sec - in org.apache.sysml.test.integration.functions.indexing.RightIndexingVectorTest
Running org.apache.sysml.test.integration.functions.indexing.LeftIndexingSparseSparseTest
Tests run: 15, Failures: 0, Errors: 0, Skipped: 0, Time elapsed: 120.546 sec - in org.apache.sysml.test.integration.functions.indexing.LeftIndexingSparseSparseTest
16/03/20 03:34:53 INFO util.Utils: Shutdown hook called
16/03/20 03:34:53 INFO util.Utils: Deleting directory /tmp/spark-b8b7ee50-5b2f-487b-ab29-b632ea0e0a6b
16/03/20 03:34:56 WARN util.NativeCodeLoader: Unable to load native-hadoop library for your
platform... using builtin-java classes where applicable
Running org.apache.sysml.test.integration.functions.reorg.MatrixReshapeTest
Tests run: 36, Failures: 0, Errors: 0, Skipped: 0, Time elapsed: 615.233 sec - in org.apache.sysml.test.integration.functions.reorg.MatrixReshapeTest
Running org.apache.sysml.test.integration.functions.transform.TransformTest
Tests run: 80, Failures: 0, Errors: 0, Skipped: 0, Time elapsed: 370.505 sec - in org.apache.sysml.test.integration.functions.transform.TransformTest
Running org.apache.sysml.test.integration.functions.indexing.RightIndexingMatrixTest
Tests run: 6, Failures: 0, Errors: 0, Skipped: 0, Time elapsed: 248.814 sec - in org.apache.sysml.test.integration.functions.indexing.RightIndexingMatrixTest
Running org.apache.sysml.test.integration.functions.quaternary.WeightedUnaryMatrixMultTest
Tests run: 26, Failures: 0, Errors: 0, Skipped: 0, Time elapsed: 560.99 sec - in org.apache.sysml.test.integration.functions.quaternary.WeightedUnaryMatrixMultTest
16/03/20 03:37:03 INFO util.Utils: Shutdown hook called
16/03/20 03:37:03 INFO util.Utils: Deleting directory /tmp/spark-5bdc7a2b-0b4f-4ceb-97a2-75648e7d6026
Running org.apache.sysml.test.integration.functions.indexing.LeftIndexingScalarTest
Tests run: 3, Failures: 0, Errors: 0, Skipped: 0, Time elapsed: 241.043 sec - in org.apache.sysml.test.integration.functions.indexing.LeftIndexingScalarTest
Running org.apache.sysml.test.integration.functions.quaternary.WeightedSquaredLossTest
Tests run: 55, Failures: 0, Errors: 0, Skipped: 0, Time elapsed: 848.59 sec - in org.apache.sysml.test.integration.functions.quaternary.WeightedSquaredLossTest
16/03/20 03:39:06 INFO util.Utils: Shutdown hook called
16/03/20 03:39:06 INFO util.Utils: Deleting directory /tmp/spark-7a131ea4-3876-4587-ac74-834e5babfc0e
Running org.apache.sysml.test.integration.functions.updateinplace.UpdateInPlaceTest
Tests run: 15, Failures: 0, Errors: 0, Skipped: 0, Time elapsed: 6.869 sec - in org.apache.sysml.test.integration.functions.updateinplace.UpdateInPlaceTest
Running org.apache.sysml.test.integration.functions.append.RBindCBindMatrixTest
Tests run: 12, Failures: 0, Errors: 0, Skipped: 0, Time elapsed: 144.622 sec - in org.apache.sysml.test.integration.functions.append.RBindCBindMatrixTest
Running org.apache.sysml.test.integration.functions.append.StringAppendTest
Tests run: 9, Failures: 0, Errors: 0, Skipped: 0, Time elapsed: 38.778 sec - in org.apache.sysml.test.integration.functions.append.StringAppendTest
Running org.apache.sysml.test.integration.functions.indexing.LeftIndexingSparseDenseTest
Tests run: 15, Failures: 0, Errors: 0, Skipped: 0, Time elapsed: 292.468 sec - in org.apache.sysml.test.integration.functions.indexing.LeftIndexingSparseDenseTest
16/03/20 03:39:50 INFO util.Utils: Shutdown hook called
16/03/20 03:39:50 INFO util.Utils: Deleting directory /tmp/spark-3dbe35c1-31b4-411c-ab52-bda2b883abe1
Running org.apache.sysml.test.integration.scalability.LinearRegressionTest
Tests run: 1, Failures: 0, Errors: 0, Skipped: 0, Time elapsed: 1.114 sec - in org.apache.sysml.test.integration.scalability.LinearRegressionTest
Running org.apache.sysml.test.integration.scalability.PageRankTest
Tests run: 1, Failures: 0, Errors: 0, Skipped: 0, Time elapsed: 1.646 sec - in org.apache.sysml.test.integration.scalability.PageRankTest
Running org.apache.sysml.test.integration.applications.descriptivestats.BivariateCategoricalCategoricallTest
Tests run: 3, Failures: 0, Errors: 0, Skipped: 0, Time elapsed: 21.426 sec - in org.apache.sysml.test.integration.applications.descriptivestats.BivariateCategoricalCategoricallTest
Running org.apache.sysml.test.integration.applications.descriptivestats.BivariateOrdinalOrdinalTest
Tests run: 2, Failures: 0, Errors: 0, Skipped: 0, Time elapsed: 6.937 sec - in org.apache.sysml.test.integration.applications.descriptivestats.BivariateOrdinalOrdinalTest
Running org.apache.sysml.test.integration.applications.descriptivestats.BivariateScaleCategoricalTest
Tests run: 2, Failures: 0, Errors: 0, Skipped: 0, Time elapsed: 7.77 sec - in org.apache.sysml.test.integration.applications.descriptivestats.BivariateScaleCategoricalTest
Running org.apache.sysml.test.integration.applications.parfor.ParForBivariateStatsTest
Tests run: 5, Failures: 0, Errors: 0, Skipped: 0, Time elapsed: 57.569 sec - in org.apache.sysml.test.integration.applications.parfor.ParForBivariateStatsTest
Running org.apache.sysml.test.integration.applications.descriptivestats.BivariateScaleScaleTest
Tests run: 2, Failures: 0, Errors: 0, Skipped: 0, Time elapsed: 8.174 sec - in org.apache.sysml.test.integration.applications.descriptivestats.BivariateScaleScaleTest
Running org.apache.sysml.test.integration.applications.descriptivestats.OrderStatisticsTest
Tests run: 1, Failures: 0, Errors: 0, Skipped: 0, Time elapsed: 0.2 sec - in org.apache.sysml.test.integration.applications.descriptivestats.OrderStatisticsTest
Running org.apache.sysml.test.integration.applications.descriptivestats.UnivariateCategoricalTest
Tests run: 2, Failures: 0, Errors: 0, Skipped: 0, Time elapsed: 7.603 sec - in org.apache.sysml.test.integration.applications.descriptivestats.UnivariateCategoricalTest
Running org.apache.sysml.test.integration.applications.parfor.ParForCVMulticlassSVMTest
Tests run: 6, Failures: 0, Errors: 0, Skipped: 0, Time elapsed: 36.21 sec - in org.apache.sysml.test.integration.applications.parfor.ParForCVMulticlassSVMTest
Running org.apache.sysml.test.integration.applications.dml.ArimaDMLTest
Tests run: 1, Failures: 0, Errors: 0, Skipped: 0, Time elapsed: 72.407 sec - in org.apache.sysml.test.integration.applications.dml.ArimaDMLTest
Running org.apache.sysml.test.integration.functions.indexing.Jdk7IssueRightIndexingTest
Tests run: 8, Failures: 0, Errors: 0, Skipped: 0, Time elapsed: 491.392 sec - in org.apache.sysml.test.integration.functions.indexing.Jdk7IssueRightIndexingTest
Running org.apache.sysml.test.integration.applications.parfor.ParForUnivariateStatsTest
Tests run: 3, Failures: 0, Errors: 0, Skipped: 0, Time elapsed: 14.196 sec - in org.apache.sysml.test.integration.applications.parfor.ParForUnivariateStatsTest
Running org.apache.sysml.test.integration.functions.append.AppendVectorTest
Tests run: 6, Failures: 0, Errors: 0, Skipped: 0, Time elapsed: 424.034 sec - in org.apache.sysml.test.integration.functions.append.AppendVectorTest
Running org.apache.sysml.test.integration.functions.quaternary.WeightedDivMatrixMultTest
Tests run: 88, Failures: 0, Errors: 0, Skipped: 0, Time elapsed: 1,147.332 sec - in org.apache.sysml.test.integration.functions.quaternary.WeightedDivMatrixMultTest
16/03/20 03:44:07 INFO util.Utils: Shutdown hook called
16/03/20 03:44:07 INFO util.Utils: Deleting directory /tmp/spark-c91ae812-751a-41ca-9dad-ae6f94f2e6db
Running org.apache.sysml.test.integration.functions.indexing.LeftIndexingTest
Tests run: 3, Failures: 0, Errors: 0, Skipped: 0, Time elapsed: 671.679 sec - in org.apache.sysml.test.integration.functions.indexing.LeftIndexingTest
Running org.apache.sysml.test.integration.functions.quaternary.WeightedSigmoidTest
Tests run: 56, Failures: 0, Errors: 0, Skipped: 0, Time elapsed: 993.812 sec - in org.apache.sysml.test.integration.functions.quaternary.WeightedSigmoidTest
16/03/20 03:45:12 INFO util.Utils: Shutdown hook called
16/03/20 03:45:12 INFO util.Utils: Deleting directory /tmp/spark-d66982d6-0e3d-44ba-b15d-33f204231002
Running org.apache.sysml.test.integration.applications.parfor.ParForCorrelationTest
Tests run: 12, Failures: 0, Errors: 0, Skipped: 0, Time elapsed: 268.954 sec - in org.apache.sysml.test.integration.applications.parfor.ParForCorrelationTest
Running org.apache.sysml.test.integration.applications.descriptivestats.UnivariateUnweightedScaleDenseTest
Tests run: 24, Failures: 0, Errors: 0, Skipped: 0, Time elapsed: 324.274 sec - in org.apache.sysml.test.integration.applications.descriptivestats.UnivariateUnweightedScaleDenseTest
Running org.apache.sysml.test.integration.applications.parfor.ParForCorrelationTestLarge
Tests run: 2, Failures: 0, Errors: 0, Skipped: 0, Time elapsed: 43.088 sec - in org.apache.sysml.test.integration.applications.parfor.ParForCorrelationTestLarge
Running org.apache.sysml.test.integration.functions.reorg.FullOrderTest
Tests run: 132, Failures: 0, Errors: 0, Skipped: 0, Time elapsed: 1,364.731 sec - in org.apache.sysml.test.integration.functions.reorg.FullOrderTest
Running org.apache.sysml.test.integration.applications.descriptivestats.UnivariateWeightedScaleDenseTest
Tests run: 24, Failures: 0, Errors: 0, Skipped: 0, Time elapsed: 354.784 sec - in org.apache.sysml.test.integration.applications.descriptivestats.UnivariateWeightedScaleDenseTest
Running org.apache.sysml.test.integration.functions.append.AppendChainTest
Tests run: 12, Failures: 0, Errors: 0, Skipped: 0, Time elapsed: 1,080.097 sec - in org.apache.sysml.test.integration.functions.append.AppendChainTest
Running org.apache.sysml.test.integration.applications.parfor.ParForNaiveBayesTest
Tests run: 10, Failures: 0, Errors: 0, Skipped: 0, Time elapsed: 514.41 sec - in org.apache.sysml.test.integration.applications.parfor.ParForNaiveBayesTest
Running org.apache.sysml.test.integration.applications.descriptivestats.UnivariateUnweightedScaleSparseTest
Tests run: 24, Failures: 0, Errors: 0, Skipped: 0, Time elapsed: 295.672 sec - in org.apache.sysml.test.integration.applications.descriptivestats.UnivariateUnweightedScaleSparseTest
Running org.apache.sysml.test.integration.applications.dml.HITSDMLTest
Tests run: 1, Failures: 0, Errors: 0, Skipped: 0, Time elapsed: 85.208 sec - in org.apache.sysml.test.integration.applications.dml.HITSDMLTest
Running org.apache.sysml.test.integration.functions.append.AppendMatrixTest
Tests run: 22, Failures: 0, Errors: 0, Skipped: 0, Time elapsed: 1,438.05 sec - in org.apache.sysml.test.integration.functions.append.AppendMatrixTest
Running org.apache.sysml.test.integration.applications.descriptivestats.UnivariateWeightedScaleSparseTest
Tests run: 24, Failures: 0, Errors: 0, Skipped: 0, Time elapsed: 348.408 sec - in org.apache.sysml.test.integration.applications.descriptivestats.UnivariateWeightedScaleSparseTest
Running org.apache.sysml.test.integration.applications.pydml.ArimaPyDMLTest
Tests run: 1, Failures: 0, Errors: 0, Skipped: 0, Time elapsed: 49.802 sec - in org.apache.sysml.test.integration.applications.pydml.ArimaPyDMLTest
Running org.apache.sysml.test.integration.applications.pydml.HITSPyDMLTest
Tests run: 1, Failures: 0, Errors: 0, Skipped: 0, Time elapsed: 77.744 sec - in org.apache.sysml.test.integration.applications.pydml.HITSPyDMLTest
Running org.apache.sysml.test.integration.applications.dml.LinearRegressionDMLTest
Tests run: 7, Failures: 0, Errors: 0, Skipped: 0, Time elapsed: 51.659 sec - in org.apache.sysml.test.integration.applications.dml.LinearRegressionDMLTest
Running org.apache.sysml.test.integration.applications.pydml.CsplineDSPyDMLTest
Tests run: 3, Failures: 0, Errors: 0, Skipped: 0, Time elapsed: 6.893 sec - in org.apache.sysml.test.integration.applications.pydml.CsplineDSPyDMLTest
Running org.apache.sysml.test.integration.applications.pydml.LinearLogRegPyDMLTest
Tests run: 7, Failures: 0, Errors: 0, Skipped: 0, Time elapsed: 93.356 sec - in org.apache.sysml.test.integration.applications.pydml.LinearLogRegPyDMLTest
Running org.apache.sysml.test.integration.applications.pydml.NaiveBayesPyDMLTest
Tests run: 6, Failures: 0, Errors: 0, Skipped: 0, Time elapsed: 81.224 sec - in org.apache.sysml.test.integration.applications.pydml.NaiveBayesPyDMLTest
Running org.apache.sysml.test.integration.applications.dml.CsplineCGDMLTest
Tests run: 3, Failures: 0, Errors: 0, Skipped: 0, Time elapsed: 15.067 sec - in org.apache.sysml.test.integration.applications.dml.CsplineCGDMLTest
Running org.apache.sysml.test.integration.applications.dml.L2SVMDMLTest
Tests run: 9, Failures: 0, Errors: 0, Skipped: 0, Time elapsed: 66.426 sec - in org.apache.sysml.test.integration.applications.dml.L2SVMDMLTest
Running org.apache.sysml.test.integration.applications.pydml.MDABivariateStatsPyDMLTest
Tests run: 4, Failures: 0, Errors: 0, Skipped: 0, Time elapsed: 293.932 sec - in org.apache.sysml.test.integration.applications.pydml.MDABivariateStatsPyDMLTest
Running org.apache.sysml.test.integration.applications.pydml.PageRankPyDMLTest
Tests run: 3, Failures: 0, Errors: 0, Skipped: 0, Time elapsed: 6.351 sec - in org.apache.sysml.test.integration.applications.pydml.PageRankPyDMLTest
Running org.apache.sysml.test.integration.applications.pydml.NaiveBayesParforPyDMLTest
Tests run: 6, Failures: 0, Errors: 0, Skipped: 0, Time elapsed: 81.783 sec - in org.apache.sysml.test.integration.applications.pydml.NaiveBayesParforPyDMLTest
Running org.apache.sysml.test.integration.applications.dml.NaiveBayesDMLTest
Tests run: 6, Failures: 0, Errors: 0, Skipped: 0, Time elapsed: 81.476 sec - in org.apache.sysml.test.integration.applications.dml.NaiveBayesDMLTest
Running org.apache.sysml.test.integration.applications.dml.MDABivariateStatsDMLTest
Tests run: 4, Failures: 0, Errors: 0, Skipped: 0, Time elapsed: 295.559 sec - in org.apache.sysml.test.integration.applications.dml.MDABivariateStatsDMLTest
Running org.apache.sysml.test.integration.applications.dml.PageRankDMLTest
Tests run: 3, Failures: 0, Errors: 0, Skipped: 0, Time elapsed: 6.301 sec - in org.apache.sysml.test.integration.applications.dml.PageRankDMLTest
Running org.apache.sysml.test.integration.applications.pydml.GLMPyDMLTest
Tests run: 30, Failures: 0, Errors: 0, Skipped: 0, Time elapsed: 586.396 sec - in org.apache.sysml.test.integration.applications.pydml.GLMPyDMLTest
Running org.apache.sysml.test.integration.applications.pydml.MultiClassSVMPyDMLTest
Tests run: 9, Failures: 0, Errors: 0, Skipped: 0, Time elapsed: 89.014 sec - in org.apache.sysml.test.integration.applications.pydml.MultiClassSVMPyDMLTest
Running org.apache.sysml.test.integration.applications.dml.ID3DMLTest
Tests run: 2, Failures: 0, Errors: 0, Skipped: 0, Time elapsed: 367.702 sec - in org.apache.sysml.test.integration.applications.dml.ID3DMLTest
Running org.apache.sysml.test.integration.applications.dml.GLMDMLTest
Tests run: 30, Failures: 0, Errors: 0, Skipped: 0, Time elapsed: 839.462 sec - in org.apache.sysml.test.integration.applications.dml.GLMDMLTest
Running org.apache.sysml.test.integration.applications.pydml.CsplineCGPyDMLTest
Tests run: 3, Failures: 0, Errors: 0, Skipped: 0, Time elapsed: 6.247 sec - in org.apache.sysml.test.integration.applications.pydml.CsplineCGPyDMLTest
Running org.apache.sysml.test.integration.applications.pydml.WelchTPyDMLTest
Tests run: 3, Failures: 0, Errors: 0, Skipped: 0, Time elapsed: 6.581 sec - in org.apache.sysml.test.integration.applications.pydml.WelchTPyDMLTest
Running org.apache.sysml.test.integration.applications.dml.MultiClassSVMDMLTest
Tests run: 9, Failures: 0, Errors: 0, Skipped: 0, Time elapsed: 89.092 sec - in org.apache.sysml.test.integration.applications.dml.MultiClassSVMDMLTest
Running org.apache.sysml.test.integration.applications.dml.CsplineDSDMLTest
Tests run: 3, Failures: 0, Errors: 0, Skipped: 0, Time elapsed: 16.948 sec - in org.apache.sysml.test.integration.applications.dml.CsplineDSDMLTest
Running org.apache.sysml.test.integration.applications.pydml.ApplyTransformPyDMLTest
Tests run: 7, Failures: 0, Errors: 0, Skipped: 0, Time elapsed: 1.194 sec - in org.apache.sysml.test.integration.applications.pydml.ApplyTransformPyDMLTest
Running org.apache.sysml.test.integration.applications.dml.NaiveBayesParforDMLTest
Tests run: 6, Failures: 0, Errors: 0, Skipped: 0, Time elapsed: 82.045 sec - in org.apache.sysml.test.integration.applications.dml.NaiveBayesParforDMLTest
Running org.apache.sysml.test.integration.applications.pydml.L2SVMPyDMLTest
Tests run: 9, Failures: 0, Errors: 0, Skipped: 0, Time elapsed: 64.768 sec - in org.apache.sysml.test.integration.applications.pydml.L2SVMPyDMLTest
Running org.apache.sysml.test.integration.applications.pydml.LinearRegressionPyDMLTest
Tests run: 7, Failures: 0, Errors: 0, Skipped: 0, Time elapsed: 51.569 sec - in org.apache.sysml.test.integration.applications.pydml.LinearRegressionPyDMLTest
Running org.apache.sysml.test.integration.applications.dml.LinearLogRegDMLTest
Tests run: 7, Failures: 0, Errors: 0, Skipped: 0, Time elapsed: 61.548 sec - in org.apache.sysml.test.integration.applications.dml.LinearLogRegDMLTest
Running org.apache.sysml.test.integration.applications.dml.GNMFDMLTest
Tests run: 3, Failures: 0, Errors: 0, Skipped: 0, Time elapsed: 65.087 sec - in org.apache.sysml.test.integration.applications.dml.GNMFDMLTest
Running org.apache.sysml.test.integration.applications.dml.WelchTDMLTest
Tests run: 3, Failures: 0, Errors: 0, Skipped: 0, Time elapsed: 6.603 sec - in org.apache.sysml.test.integration.applications.dml.WelchTDMLTest
Running org.apache.sysml.test.integration.applications.dml.ApplyTransformDMLTest
Tests run: 7, Failures: 0, Errors: 0, Skipped: 0, Time elapsed: 14.929 sec - in org.apache.sysml.test.integration.applications.dml.ApplyTransformDMLTest
Running org.apache.sysml.test.integration.applications.pydml.ID3PyDMLTest
Tests run: 2, Failures: 0, Errors: 0, Skipped: 0, Time elapsed: 329.318 sec - in org.apache.sysml.test.integration.applications.pydml.ID3PyDMLTest
Running org.apache.sysml.test.integration.applications.pydml.GNMFPyDMLTest
Tests run: 3, Failures: 0, Errors: 0, Skipped: 0, Time elapsed: 56.436 sec - in org.apache.sysml.test.integration.applications.pydml.GNMFPyDMLTest

Results :

Failed tests: 
  SparsityFunctionRecompileTest.testIfNoRecompileNoIPA:138->runRecompileTest:219 Failed
to run test: null
  SparsityFunctionRecompileTest.testIfRecompileNoIPA:132->runRecompileTest:219 Failed to
run test: null
  SparsityFunctionRecompileTest.testParForNoRecompileIPA:114->runRecompileTest:219 Failed
to run test: null
  SparsityFunctionRecompileTest.testForNoRecompileIPA:102->runRecompileTest:219 Failed
to run test: null
  SparsityFunctionRecompileTest.testParForRecompileNoIPA:156->runRecompileTest:219 Failed
to run test: null
  SparsityFunctionRecompileTest.testForNoRecompileNoIPA:150->runRecompileTest:219 Failed
to run test: null
  SparsityFunctionRecompileTest.testForRecompileNoIPA:144->runRecompileTest:219 Failed
to run test: null
  SparsityFunctionRecompileTest.testWhileRecompileIPA:72->runRecompileTest:219 Failed to
run test: null
  SparsityFunctionRecompileTest.testForRecompileIPA:96->runRecompileTest:219 Failed to
run test: null
  SparsityFunctionRecompileTest.testWhileNoRecompileIPA:78->runRecompileTest:219 Failed
to run test: null
  SparsityFunctionRecompileTest.testWhileRecompileNoIPA:120->runRecompileTest:219 Failed
to run test: null
  SparsityFunctionRecompileTest.testWhileNoRecompileNoIPA:126->runRecompileTest:219 Failed
to run test: null
  SparsityFunctionRecompileTest.testParForNoRecompileNoIPA:162->runRecompileTest:219 Failed
to run test: null
  SparsityFunctionRecompileTest.testIfNoRecompileIPA:90->runRecompileTest:219 Failed to
run test: null
  SparsityFunctionRecompileTest.testParForRecompileIPA:108->runRecompileTest:219 Failed
to run test: null
  SparsityFunctionRecompileTest.testIfRecompileIPA:84->runRecompileTest:219 Failed to run
test: null

Tests in error: 
  SparsityRecompileTest.testForNoRecompile:118->runRecompileTest:179 Runtime jav...
  SparsityRecompileTest.testWhileRecompile:88->runRecompileTest:179 Runtime java...
  SparsityRecompileTest.testParForNoRecompile:130->runRecompileTest:179 Runtime ...
  SparsityRecompileTest.testIfRecompile:100->runRecompileTest:179 Runtime java.l...
  SparsityRecompileTest.testParForRecompile:124->runRecompileTest:179 Runtime ja...
  SparsityRecompileTest.testIfNoRecompile:106->runRecompileTest:179 Runtime java...
  SparsityRecompileTest.testForRecompile:112->runRecompileTest:179 Runtime java....
  SparsityRecompileTest.testWhileNoRecompile:94->runRecompileTest:179 Runtime ja...
  IPAComplexAppendTest.testComplexAppendIPANoRewrites:68->runIPAAppendTest:113 » NullPointer
  IPAComplexAppendTest.testComplexAppendIPARewrites:82->runIPAAppendTest:113 » NullPointer
  IPAComplexAppendTest.testComplexAppendNoIPANoRewrites:61->runIPAAppendTest:113 » NullPointer
  IPAComplexAppendTest.testComplexAppendNoIPARewrites:75->runIPAAppendTest:113 » NullPointer

Tests run: 4837, Failures: 16, Errors: 12, Skipped: 0

[INFO] 
[INFO] --- maven-failsafe-plugin:2.17:verify (default) @ systemml ---
[INFO] Failsafe report directory: <https://sparktc.ibmcloud.com/jenkins/job/SystemML-DailyTest/ws/target/failsafe-reports>
[INFO] ------------------------------------------------------------------------
[INFO] BUILD FAILURE
[INFO] ------------------------------------------------------------------------
[INFO] Total time: 02:16 h
[INFO] Finished at: 2016-03-20T04:47:51-05:00
[INFO] Final Memory: 64M/2430M
[INFO] ------------------------------------------------------------------------
[ERROR] Failed to execute goal org.apache.maven.plugins:maven-failsafe-plugin:2.17:verify
(default) on project systemml: There are test failures.
[ERROR] 
[ERROR] Please refer to <https://sparktc.ibmcloud.com/jenkins/job/SystemML-DailyTest/ws/target/failsafe-reports>
for the individual test results.
[ERROR] -> [Help 1]
[ERROR] 
[ERROR] To see the full stack trace of the errors, re-run Maven with the -e switch.
[ERROR] Re-run Maven using the -X switch to enable full debug logging.
[ERROR] 
[ERROR] For more information about the errors and possible solutions, please read the following
articles:
[ERROR] [Help 1] http://cwiki.apache.org/confluence/display/MAVEN/MojoFailureException
Build step 'Execute shell' marked build as failure
Run condition [Always] enabling perform for step [[]]

Mime
View raw message