systemml-dev mailing list archives

Site index · List index
Message view « Date » · « Thread »
Top « Date » · « Thread »
From jenk...@spark.tc
Subject Build failed in Jenkins: SystemML-DailyTest #163
Date Wed, 30 Mar 2016 09:48:25 GMT
See <https://sparktc.ibmcloud.com/jenkins/job/SystemML-DailyTest/163/changes>

Changes:

[Matthias Boehm] Fix unnecessary scala dependency jmlc api connection

[mwdusenb] Fixing typo in debug message.

------------------------------------------
[...truncated 1681 lines...]
Running org.apache.sysml.test.integration.applications.dml.MDABivariateStatsDMLTest
Tests run: 4, Failures: 0, Errors: 0, Skipped: 0, Time elapsed: 294.364 sec - in org.apache.sysml.test.integration.applications.dml.MDABivariateStatsDMLTest
Running org.apache.sysml.test.integration.applications.dml.PageRankDMLTest
Tests run: 3, Failures: 0, Errors: 0, Skipped: 0, Time elapsed: 6.411 sec - in org.apache.sysml.test.integration.applications.dml.PageRankDMLTest
Running org.apache.sysml.test.integration.applications.pydml.GLMPyDMLTest
Tests run: 30, Failures: 0, Errors: 0, Skipped: 0, Time elapsed: 586.206 sec - in org.apache.sysml.test.integration.applications.pydml.GLMPyDMLTest
Running org.apache.sysml.test.integration.applications.pydml.MultiClassSVMPyDMLTest
Tests run: 9, Failures: 0, Errors: 0, Skipped: 0, Time elapsed: 88.517 sec - in org.apache.sysml.test.integration.applications.pydml.MultiClassSVMPyDMLTest
Running org.apache.sysml.test.integration.applications.dml.ID3DMLTest
Tests run: 2, Failures: 0, Errors: 0, Skipped: 0, Time elapsed: 358.252 sec - in org.apache.sysml.test.integration.applications.dml.ID3DMLTest
Running org.apache.sysml.test.integration.applications.dml.GLMDMLTest
Tests run: 30, Failures: 0, Errors: 0, Skipped: 0, Time elapsed: 845.422 sec - in org.apache.sysml.test.integration.applications.dml.GLMDMLTest
Running org.apache.sysml.test.integration.applications.pydml.CsplineCGPyDMLTest
Tests run: 3, Failures: 0, Errors: 0, Skipped: 0, Time elapsed: 6.21 sec - in org.apache.sysml.test.integration.applications.pydml.CsplineCGPyDMLTest
Running org.apache.sysml.test.integration.applications.pydml.WelchTPyDMLTest
Tests run: 3, Failures: 0, Errors: 0, Skipped: 0, Time elapsed: 6.627 sec - in org.apache.sysml.test.integration.applications.pydml.WelchTPyDMLTest
Running org.apache.sysml.test.integration.applications.dml.MultiClassSVMDMLTest
Tests run: 9, Failures: 0, Errors: 0, Skipped: 0, Time elapsed: 87.574 sec - in org.apache.sysml.test.integration.applications.dml.MultiClassSVMDMLTest
Running org.apache.sysml.test.integration.applications.dml.CsplineDSDMLTest
Tests run: 3, Failures: 0, Errors: 0, Skipped: 0, Time elapsed: 13.558 sec - in org.apache.sysml.test.integration.applications.dml.CsplineDSDMLTest
Running org.apache.sysml.test.integration.applications.pydml.ApplyTransformPyDMLTest
Tests run: 7, Failures: 0, Errors: 0, Skipped: 0, Time elapsed: 1.234 sec - in org.apache.sysml.test.integration.applications.pydml.ApplyTransformPyDMLTest
Running org.apache.sysml.test.integration.applications.dml.NaiveBayesParforDMLTest
Tests run: 6, Failures: 0, Errors: 0, Skipped: 0, Time elapsed: 81.814 sec - in org.apache.sysml.test.integration.applications.dml.NaiveBayesParforDMLTest
Running org.apache.sysml.test.integration.applications.pydml.L2SVMPyDMLTest
Tests run: 9, Failures: 0, Errors: 0, Skipped: 0, Time elapsed: 64.582 sec - in org.apache.sysml.test.integration.applications.pydml.L2SVMPyDMLTest
Running org.apache.sysml.test.integration.applications.pydml.LinearRegressionPyDMLTest
Tests run: 7, Failures: 0, Errors: 0, Skipped: 0, Time elapsed: 51.483 sec - in org.apache.sysml.test.integration.applications.pydml.LinearRegressionPyDMLTest
Running org.apache.sysml.test.integration.applications.dml.LinearLogRegDMLTest
Tests run: 7, Failures: 0, Errors: 0, Skipped: 0, Time elapsed: 61.274 sec - in org.apache.sysml.test.integration.applications.dml.LinearLogRegDMLTest
Running org.apache.sysml.test.integration.applications.dml.GNMFDMLTest
Tests run: 3, Failures: 0, Errors: 0, Skipped: 0, Time elapsed: 63.558 sec - in org.apache.sysml.test.integration.applications.dml.GNMFDMLTest
Running org.apache.sysml.test.integration.applications.dml.WelchTDMLTest
Tests run: 3, Failures: 0, Errors: 0, Skipped: 0, Time elapsed: 6.622 sec - in org.apache.sysml.test.integration.applications.dml.WelchTDMLTest
Running org.apache.sysml.test.integration.applications.dml.ApplyTransformDMLTest
Tests run: 7, Failures: 0, Errors: 0, Skipped: 0, Time elapsed: 14.846 sec - in org.apache.sysml.test.integration.applications.dml.ApplyTransformDMLTest
Running org.apache.sysml.test.integration.applications.pydml.ID3PyDMLTest
Tests run: 2, Failures: 0, Errors: 0, Skipped: 0, Time elapsed: 328.174 sec - in org.apache.sysml.test.integration.applications.pydml.ID3PyDMLTest
Running org.apache.sysml.test.integration.applications.pydml.GNMFPyDMLTest
Tests run: 3, Failures: 0, Errors: 0, Skipped: 0, Time elapsed: 56.794 sec - in org.apache.sysml.test.integration.applications.pydml.GNMFPyDMLTest

Results :

Failed tests: 
  SparsityFunctionRecompileTest.testParForRecompileNoIPA:156->runRecompileTest:193->AutomatedTestBase.runTest:1191
failed to run script ./src/test/scripts/functions/recompile/parfor_recompile_func_sparse.dml
exception: org.apache.sysml.api.DMLException: org.apache.sysml.runtime.DMLRuntimeException:
org.apache.sysml.runtime.DMLRuntimeException: ERROR: Runtime error in program block generated
from statement block between lines 49 and 49 -- Error evaluating instruction: CP°extfunct°.defaultNS°foo1°1°1°V·MATRIX·DOUBLE°V
message: org.apache.sysml.runtime.DMLRuntimeException: org.apache.sysml.runtime.DMLRuntimeException:
ERROR: Runtime error in program block generated from statement block between lines 49 and
49 -- Error evaluating instruction: CP°extfunct°.defaultNS°foo1°1°1°V·MATRIX·DOUBLE°V
stack trace:
>org.apache.sysml.api.DMLScript.executeScript(DMLScript.java:350)
>org.apache.sysml.api.DMLScript.main(DMLScript.java:197)
>org.apache.sysml.test.integration.AutomatedTestBase.runTest(AutomatedTestBase.java:1171)
>org.apache.sysml.test.integration.functions.recompile.SparsityFunctionRecompileTest.runRecompileTest(SparsityFunctionRecompileTest.java:193)
>org.apache.sysml.test.integration.functions.recompile.SparsityFunctionRecompileTest.testParForRecompileNoIPA(SparsityFunctionRecompileTest.java:156)
>sun.reflect.NativeMethodAccessorImpl.invoke0(Native Method)
>sun.reflect.NativeMethodAccessorImpl.invoke(NativeMethodAccessorImpl.java:62)
>sun.reflect.DelegatingMethodAccessorImpl.invoke(DelegatingMethodAccessorImpl.java:43)
>java.lang.reflect.Method.invoke(Method.java:497)
>org.junit.runners.model.FrameworkMethod$1.runReflectiveCall(FrameworkMethod.java:47)
>org.junit.internal.runners.model.ReflectiveCallable.run(ReflectiveCallable.java:12)
>org.junit.runners.model.FrameworkMethod.invokeExplosively(FrameworkMethod.java:44)
>org.junit.internal.runners.statements.InvokeMethod.evaluate(InvokeMethod.java:17)
>org.junit.internal.runners.statements.RunBefores.evaluate(RunBefores.java:26)
>org.junit.internal.runners.statements.RunAfters.evaluate(RunAfters.java:27)
>org.junit.runners.ParentRunner.runLeaf(ParentRunner.java:271)
>org.junit.runners.BlockJUnit4ClassRunner.runChild(BlockJUnit4ClassRunner.java:70)
>org.junit.runners.BlockJUnit4ClassRunner.runChild(BlockJUnit4ClassRunner.java:50)
>org.junit.runners.ParentRunner$3.run(ParentRunner.java:238)
>org.apache.maven.surefire.junitcore.pc.Scheduler$1.run(Scheduler.java:318)
>org.apache.maven.surefire.junitcore.pc.InvokerStrategy.schedule(InvokerStrategy.java:41)
>org.apache.maven.surefire.junitcore.pc.Scheduler.schedule(Scheduler.java:274)
>org.junit.runners.ParentRunner.runChildren(ParentRunner.java:236)
>org.junit.runners.ParentRunner.access$000(ParentRunner.java:53)
>org.junit.runners.ParentRunner$2.evaluate(ParentRunner.java:229)
>org.junit.runners.ParentRunner.run(ParentRunner.java:309)
>org.junit.runners.Suite.runChild(Suite.java:127)
>org.junit.runners.Suite.runChild(Suite.java:26)
>org.junit.runners.ParentRunner$3.run(ParentRunner.java:238)
>org.apache.maven.surefire.junitcore.pc.Scheduler$1.run(Scheduler.java:318)
>org.apache.maven.surefire.junitcore.pc.InvokerStrategy.schedule(InvokerStrategy.java:41)
>org.apache.maven.surefire.junitcore.pc.Scheduler.schedule(Scheduler.java:274)
>org.junit.runners.ParentRunner.runChildren(ParentRunner.java:236)
>org.junit.runners.ParentRunner.access$000(ParentRunner.java:53)
>org.junit.runners.ParentRunner$2.evaluate(ParentRunner.java:229)
>org.junit.runners.ParentRunner.run(ParentRunner.java:309)
>org.junit.runners.Suite.runChild(Suite.java:127)
>org.junit.runners.Suite.runChild(Suite.java:26)
>org.junit.runners.ParentRunner$3.run(ParentRunner.java:238)
>org.apache.maven.surefire.junitcore.pc.Scheduler$1.run(Scheduler.java:318)
>org.apache.maven.surefire.junitcore.pc.InvokerStrategy.schedule(InvokerStrategy.java:41)
>org.apache.maven.surefire.junitcore.pc.Scheduler.schedule(Scheduler.java:274)
>org.junit.runners.ParentRunner.runChildren(ParentRunner.java:236)
>org.junit.runners.ParentRunner.access$000(ParentRunner.java:53)
>org.junit.runners.ParentRunner$2.evaluate(ParentRunner.java:229)
>org.junit.runners.ParentRunner.run(ParentRunner.java:309)
>org.apache.maven.surefire.junitcore.pc.ParallelComputerBuilder$PC$2.run(ParallelComputerBuilder.java:491)
>org.junit.runner.JUnitCore.run(JUnitCore.java:160)
>org.junit.runner.JUnitCore.run(JUnitCore.java:138)
>org.apache.maven.surefire.junitcore.JUnitCoreWrapper.createRequestAndRun(JUnitCoreWrapper.java:113)
>org.apache.maven.surefire.junitcore.JUnitCoreWrapper.executeEager(JUnitCoreWrapper.java:85)
>org.apache.maven.surefire.junitcore.JUnitCoreWrapper.execute(JUnitCoreWrapper.java:54)
>org.apache.maven.surefire.junitcore.JUnitCoreProvider.invoke(JUnitCoreProvider.java:134)
>org.apache.maven.surefire.booter.ForkedBooter.invokeProviderInSameClassLoader(ForkedBooter.java:200)
>org.apache.maven.surefire.booter.ForkedBooter.runSuitesInProcess(ForkedBooter.java:153)
>org.apache.maven.surefire.booter.ForkedBooter.main(ForkedBooter.java:103)
  SparsityFunctionRecompileTest.testParForRecompileIPA:108->runRecompileTest:193->AutomatedTestBase.runTest:1191
failed to run script ./src/test/scripts/functions/recompile/parfor_recompile_func_sparse.dml
exception: org.apache.sysml.api.DMLException: org.apache.sysml.runtime.DMLRuntimeException:
org.apache.sysml.runtime.DMLRuntimeException: ERROR: Runtime error in program block generated
from statement block between lines 49 and 49 -- Error evaluating instruction: CP°extfunct°.defaultNS°foo1°1°1°V·MATRIX·DOUBLE°V
message: org.apache.sysml.runtime.DMLRuntimeException: org.apache.sysml.runtime.DMLRuntimeException:
ERROR: Runtime error in program block generated from statement block between lines 49 and
49 -- Error evaluating instruction: CP°extfunct°.defaultNS°foo1°1°1°V·MATRIX·DOUBLE°V
stack trace:
>org.apache.sysml.api.DMLScript.executeScript(DMLScript.java:350)
>org.apache.sysml.api.DMLScript.main(DMLScript.java:197)
>org.apache.sysml.test.integration.AutomatedTestBase.runTest(AutomatedTestBase.java:1171)
>org.apache.sysml.test.integration.functions.recompile.SparsityFunctionRecompileTest.runRecompileTest(SparsityFunctionRecompileTest.java:193)
>org.apache.sysml.test.integration.functions.recompile.SparsityFunctionRecompileTest.testParForRecompileIPA(SparsityFunctionRecompileTest.java:108)
>sun.reflect.NativeMethodAccessorImpl.invoke0(Native Method)
>sun.reflect.NativeMethodAccessorImpl.invoke(NativeMethodAccessorImpl.java:62)
>sun.reflect.DelegatingMethodAccessorImpl.invoke(DelegatingMethodAccessorImpl.java:43)
>java.lang.reflect.Method.invoke(Method.java:497)
>org.junit.runners.model.FrameworkMethod$1.runReflectiveCall(FrameworkMethod.java:47)
>org.junit.internal.runners.model.ReflectiveCallable.run(ReflectiveCallable.java:12)
>org.junit.runners.model.FrameworkMethod.invokeExplosively(FrameworkMethod.java:44)
>org.junit.internal.runners.statements.InvokeMethod.evaluate(InvokeMethod.java:17)
>org.junit.internal.runners.statements.RunBefores.evaluate(RunBefores.java:26)
>org.junit.internal.runners.statements.RunAfters.evaluate(RunAfters.java:27)
>org.junit.runners.ParentRunner.runLeaf(ParentRunner.java:271)
>org.junit.runners.BlockJUnit4ClassRunner.runChild(BlockJUnit4ClassRunner.java:70)
>org.junit.runners.BlockJUnit4ClassRunner.runChild(BlockJUnit4ClassRunner.java:50)
>org.junit.runners.ParentRunner$3.run(ParentRunner.java:238)
>org.apache.maven.surefire.junitcore.pc.Scheduler$1.run(Scheduler.java:318)
>org.apache.maven.surefire.junitcore.pc.InvokerStrategy.schedule(InvokerStrategy.java:41)
>org.apache.maven.surefire.junitcore.pc.Scheduler.schedule(Scheduler.java:274)
>org.junit.runners.ParentRunner.runChildren(ParentRunner.java:236)
>org.junit.runners.ParentRunner.access$000(ParentRunner.java:53)
>org.junit.runners.ParentRunner$2.evaluate(ParentRunner.java:229)
>org.junit.runners.ParentRunner.run(ParentRunner.java:309)
>org.junit.runners.Suite.runChild(Suite.java:127)
>org.junit.runners.Suite.runChild(Suite.java:26)
>org.junit.runners.ParentRunner$3.run(ParentRunner.java:238)
>org.apache.maven.surefire.junitcore.pc.Scheduler$1.run(Scheduler.java:318)
>org.apache.maven.surefire.junitcore.pc.InvokerStrategy.schedule(InvokerStrategy.java:41)
>org.apache.maven.surefire.junitcore.pc.Scheduler.schedule(Scheduler.java:274)
>org.junit.runners.ParentRunner.runChildren(ParentRunner.java:236)
>org.junit.runners.ParentRunner.access$000(ParentRunner.java:53)
>org.junit.runners.ParentRunner$2.evaluate(ParentRunner.java:229)
>org.junit.runners.ParentRunner.run(ParentRunner.java:309)
>org.junit.runners.Suite.runChild(Suite.java:127)
>org.junit.runners.Suite.runChild(Suite.java:26)
>org.junit.runners.ParentRunner$3.run(ParentRunner.java:238)
>org.apache.maven.surefire.junitcore.pc.Scheduler$1.run(Scheduler.java:318)
>org.apache.maven.surefire.junitcore.pc.InvokerStrategy.schedule(InvokerStrategy.java:41)
>org.apache.maven.surefire.junitcore.pc.Scheduler.schedule(Scheduler.java:274)
>org.junit.runners.ParentRunner.runChildren(ParentRunner.java:236)
>org.junit.runners.ParentRunner.access$000(ParentRunner.java:53)
>org.junit.runners.ParentRunner$2.evaluate(ParentRunner.java:229)
>org.junit.runners.ParentRunner.run(ParentRunner.java:309)
>org.apache.maven.surefire.junitcore.pc.ParallelComputerBuilder$PC$2.run(ParallelComputerBuilder.java:491)
>org.junit.runner.JUnitCore.run(JUnitCore.java:160)
>org.junit.runner.JUnitCore.run(JUnitCore.java:138)
>org.apache.maven.surefire.junitcore.JUnitCoreWrapper.createRequestAndRun(JUnitCoreWrapper.java:113)
>org.apache.maven.surefire.junitcore.JUnitCoreWrapper.executeEager(JUnitCoreWrapper.java:85)
>org.apache.maven.surefire.junitcore.JUnitCoreWrapper.execute(JUnitCoreWrapper.java:54)
>org.apache.maven.surefire.junitcore.JUnitCoreProvider.invoke(JUnitCoreProvider.java:134)
>org.apache.maven.surefire.booter.ForkedBooter.invokeProviderInSameClassLoader(ForkedBooter.java:200)
>org.apache.maven.surefire.booter.ForkedBooter.runSuitesInProcess(ForkedBooter.java:153)
>org.apache.maven.surefire.booter.ForkedBooter.main(ForkedBooter.java:103)
  SparsityRecompileTest.testParForRecompile:124->runRecompileTest:156->AutomatedTestBase.runTest:1191
failed to run script ./src/test/scripts/functions/recompile/parfor_recompile_sparse.dml
exception: org.apache.sysml.api.DMLException: org.apache.sysml.runtime.DMLRuntimeException:
org.apache.sysml.runtime.DMLRuntimeException: PARFOR: Failed to execute loop in parallel.
message: org.apache.sysml.runtime.DMLRuntimeException: org.apache.sysml.runtime.DMLRuntimeException:
PARFOR: Failed to execute loop in parallel.
stack trace:
>org.apache.sysml.api.DMLScript.executeScript(DMLScript.java:350)
>org.apache.sysml.api.DMLScript.main(DMLScript.java:197)
>org.apache.sysml.test.integration.AutomatedTestBase.runTest(AutomatedTestBase.java:1171)
>org.apache.sysml.test.integration.functions.recompile.SparsityRecompileTest.runRecompileTest(SparsityRecompileTest.java:156)
>org.apache.sysml.test.integration.functions.recompile.SparsityRecompileTest.testParForRecompile(SparsityRecompileTest.java:124)
>sun.reflect.NativeMethodAccessorImpl.invoke0(Native Method)
>sun.reflect.NativeMethodAccessorImpl.invoke(NativeMethodAccessorImpl.java:62)
>sun.reflect.DelegatingMethodAccessorImpl.invoke(DelegatingMethodAccessorImpl.java:43)
>java.lang.reflect.Method.invoke(Method.java:497)
>org.junit.runners.model.FrameworkMethod$1.runReflectiveCall(FrameworkMethod.java:47)
>org.junit.internal.runners.model.ReflectiveCallable.run(ReflectiveCallable.java:12)
>org.junit.runners.model.FrameworkMethod.invokeExplosively(FrameworkMethod.java:44)
>org.junit.internal.runners.statements.InvokeMethod.evaluate(InvokeMethod.java:17)
>org.junit.internal.runners.statements.RunBefores.evaluate(RunBefores.java:26)
>org.junit.internal.runners.statements.RunAfters.evaluate(RunAfters.java:27)
>org.junit.runners.ParentRunner.runLeaf(ParentRunner.java:271)
>org.junit.runners.BlockJUnit4ClassRunner.runChild(BlockJUnit4ClassRunner.java:70)
>org.junit.runners.BlockJUnit4ClassRunner.runChild(BlockJUnit4ClassRunner.java:50)
>org.junit.runners.ParentRunner$3.run(ParentRunner.java:238)
>org.apache.maven.surefire.junitcore.pc.Scheduler$1.run(Scheduler.java:318)
>org.apache.maven.surefire.junitcore.pc.InvokerStrategy.schedule(InvokerStrategy.java:41)
>org.apache.maven.surefire.junitcore.pc.Scheduler.schedule(Scheduler.java:274)
>org.junit.runners.ParentRunner.runChildren(ParentRunner.java:236)
>org.junit.runners.ParentRunner.access$000(ParentRunner.java:53)
>org.junit.runners.ParentRunner$2.evaluate(ParentRunner.java:229)
>org.junit.runners.ParentRunner.run(ParentRunner.java:309)
>org.junit.runners.Suite.runChild(Suite.java:127)
>org.junit.runners.Suite.runChild(Suite.java:26)
>org.junit.runners.ParentRunner$3.run(ParentRunner.java:238)
>org.apache.maven.surefire.junitcore.pc.Scheduler$1.run(Scheduler.java:318)
>org.apache.maven.surefire.junitcore.pc.InvokerStrategy.schedule(InvokerStrategy.java:41)
>org.apache.maven.surefire.junitcore.pc.Scheduler.schedule(Scheduler.java:274)
>org.junit.runners.ParentRunner.runChildren(ParentRunner.java:236)
>org.junit.runners.ParentRunner.access$000(ParentRunner.java:53)
>org.junit.runners.ParentRunner$2.evaluate(ParentRunner.java:229)
>org.junit.runners.ParentRunner.run(ParentRunner.java:309)
>org.junit.runners.Suite.runChild(Suite.java:127)
>org.junit.runners.Suite.runChild(Suite.java:26)
>org.junit.runners.ParentRunner$3.run(ParentRunner.java:238)
>org.apache.maven.surefire.junitcore.pc.Scheduler$1.run(Scheduler.java:318)
>org.apache.maven.surefire.junitcore.pc.InvokerStrategy.schedule(InvokerStrategy.java:41)
>org.apache.maven.surefire.junitcore.pc.Scheduler.schedule(Scheduler.java:274)
>org.junit.runners.ParentRunner.runChildren(ParentRunner.java:236)
>org.junit.runners.ParentRunner.access$000(ParentRunner.java:53)
>org.junit.runners.ParentRunner$2.evaluate(ParentRunner.java:229)
>org.junit.runners.ParentRunner.run(ParentRunner.java:309)
>org.apache.maven.surefire.junitcore.pc.ParallelComputerBuilder$PC$2.run(ParallelComputerBuilder.java:491)
>org.junit.runner.JUnitCore.run(JUnitCore.java:160)
>org.junit.runner.JUnitCore.run(JUnitCore.java:138)
>org.apache.maven.surefire.junitcore.JUnitCoreWrapper.createRequestAndRun(JUnitCoreWrapper.java:113)
>org.apache.maven.surefire.junitcore.JUnitCoreWrapper.executeEager(JUnitCoreWrapper.java:85)
>org.apache.maven.surefire.junitcore.JUnitCoreWrapper.execute(JUnitCoreWrapper.java:54)
>org.apache.maven.surefire.junitcore.JUnitCoreProvider.invoke(JUnitCoreProvider.java:134)
>org.apache.maven.surefire.booter.ForkedBooter.invokeProviderInSameClassLoader(ForkedBooter.java:200)
>org.apache.maven.surefire.booter.ForkedBooter.runSuitesInProcess(ForkedBooter.java:153)
>org.apache.maven.surefire.booter.ForkedBooter.main(ForkedBooter.java:103)

Tests run: 4861, Failures: 3, Errors: 0, Skipped: 0

[INFO] 
[INFO] --- maven-failsafe-plugin:2.17:verify (default) @ systemml ---
[INFO] Failsafe report directory: <https://sparktc.ibmcloud.com/jenkins/job/SystemML-DailyTest/ws/target/failsafe-reports>
[INFO] ------------------------------------------------------------------------
[INFO] BUILD FAILURE
[INFO] ------------------------------------------------------------------------
[INFO] Total time: 02:16 h
[INFO] Finished at: 2016-03-30T04:48:25-05:00
[INFO] Final Memory: 59M/2488M
[INFO] ------------------------------------------------------------------------
[ERROR] Failed to execute goal org.apache.maven.plugins:maven-failsafe-plugin:2.17:verify
(default) on project systemml: There are test failures.
[ERROR] 
[ERROR] Please refer to <https://sparktc.ibmcloud.com/jenkins/job/SystemML-DailyTest/ws/target/failsafe-reports>
for the individual test results.
[ERROR] -> [Help 1]
[ERROR] 
[ERROR] To see the full stack trace of the errors, re-run Maven with the -e switch.
[ERROR] Re-run Maven using the -X switch to enable full debug logging.
[ERROR] 
[ERROR] For more information about the errors and possible solutions, please read the following
articles:
[ERROR] [Help 1] http://cwiki.apache.org/confluence/display/MAVEN/MojoFailureException
Build step 'Execute shell' marked build as failure
Run condition [Always] enabling perform for step [[]]

Mime
View raw message