systemml-dev mailing list archives

Site index · List index
Message view « Date » · « Thread »
Top « Date » · « Thread »
From jenk...@spark.tc
Subject Build failed in Jenkins: SystemML-DailyTest #151
Date Thu, 24 Mar 2016 21:51:45 GMT
See <https://sparktc.ibmcloud.com/jenkins/job/SystemML-DailyTest/151/>

------------------------------------------
[...truncated 1340 lines...]
Tests run: 6, Failures: 0, Errors: 6, Skipped: 0, Time elapsed: 2.664 sec <<< FAILURE!
- in org.apache.sysml.test.integration.functions.frame.FrameCopyTest
testFrameMixedStringsCBind(org.apache.sysml.test.integration.functions.frame.FrameCopyTest)
 Time elapsed: 2.208 sec  <<< ERROR!
java.lang.RuntimeException: java.lang.NullPointerException
	at org.apache.sysml.runtime.util.UtilFunctions.compareTo(UtilFunctions.java:359)
	at org.apache.sysml.test.integration.functions.frame.FrameCopyTest.runFrameCopyTest(FrameCopyTest.java:123)
	at org.apache.sysml.test.integration.functions.frame.FrameCopyTest.testFrameMixedStringsCBind(FrameCopyTest.java:57)

testFrameMixedMixedCBind(org.apache.sysml.test.integration.functions.frame.FrameCopyTest)
 Time elapsed: 0.181 sec  <<< ERROR!
java.lang.RuntimeException: java.lang.NullPointerException
	at org.apache.sysml.runtime.util.UtilFunctions.compareTo(UtilFunctions.java:359)
	at org.apache.sysml.test.integration.functions.frame.FrameCopyTest.runFrameCopyTest(FrameCopyTest.java:123)
	at org.apache.sysml.test.integration.functions.frame.FrameCopyTest.testFrameMixedMixedCBind(FrameCopyTest.java:67)

testFrameMixedMixedRBind(org.apache.sysml.test.integration.functions.frame.FrameCopyTest)
 Time elapsed: 0.084 sec  <<< ERROR!
java.lang.RuntimeException: java.lang.NullPointerException
	at org.apache.sysml.runtime.util.UtilFunctions.compareTo(UtilFunctions.java:359)
	at org.apache.sysml.test.integration.functions.frame.FrameCopyTest.runFrameCopyTest(FrameCopyTest.java:123)
	at org.apache.sysml.test.integration.functions.frame.FrameCopyTest.testFrameMixedMixedRBind(FrameCopyTest.java:72)

testFrameStringsMixedCBind(org.apache.sysml.test.integration.functions.frame.FrameCopyTest)
 Time elapsed: 0.069 sec  <<< ERROR!
java.lang.RuntimeException: java.lang.NullPointerException
	at org.apache.sysml.runtime.util.UtilFunctions.compareTo(UtilFunctions.java:359)
	at org.apache.sysml.test.integration.functions.frame.FrameCopyTest.runFrameCopyTest(FrameCopyTest.java:123)
	at org.apache.sysml.test.integration.functions.frame.FrameCopyTest.testFrameStringsMixedCBind(FrameCopyTest.java:62)

testFrameStringsStringsCBind(org.apache.sysml.test.integration.functions.frame.FrameCopyTest)
 Time elapsed: 0.073 sec  <<< ERROR!
java.lang.RuntimeException: java.lang.NullPointerException
	at org.apache.sysml.runtime.util.UtilFunctions.compareTo(UtilFunctions.java:359)
	at org.apache.sysml.test.integration.functions.frame.FrameCopyTest.runFrameCopyTest(FrameCopyTest.java:123)
	at org.apache.sysml.test.integration.functions.frame.FrameCopyTest.testFrameStringsStringsCBind(FrameCopyTest.java:47)

testFrameStringsStringsRBind(org.apache.sysml.test.integration.functions.frame.FrameCopyTest)
 Time elapsed: 0.049 sec  <<< ERROR!
java.lang.RuntimeException: java.lang.NullPointerException
	at org.apache.sysml.runtime.util.UtilFunctions.compareTo(UtilFunctions.java:359)
	at org.apache.sysml.test.integration.functions.frame.FrameCopyTest.runFrameCopyTest(FrameCopyTest.java:123)
	at org.apache.sysml.test.integration.functions.frame.FrameCopyTest.testFrameStringsStringsRBind(FrameCopyTest.java:52)

Running org.apache.sysml.test.integration.functions.frame.FrameGetSetTest
Tests run: 6, Failures: 0, Errors: 0, Skipped: 0, Time elapsed: 2.855 sec - in org.apache.sysml.test.integration.functions.frame.FrameGetSetTest
Running org.apache.sysml.test.integration.functions.piggybacking.PiggybackingTest1
Tests run: 2, Failures: 0, Errors: 0, Skipped: 0, Time elapsed: 28.609 sec - in org.apache.sysml.test.integration.functions.piggybacking.PiggybackingTest1
Running org.apache.sysml.test.integration.functions.ternary.CTableMatrixIgnoreZerosTest
Tests run: 9, Failures: 0, Errors: 0, Skipped: 0, Time elapsed: 155.481 sec - in org.apache.sysml.test.integration.functions.ternary.CTableMatrixIgnoreZerosTest
Running org.apache.sysml.test.integration.functions.piggybacking.PiggybackingTest2
Tests run: 1, Failures: 0, Errors: 0, Skipped: 0, Time elapsed: 12.348 sec - in org.apache.sysml.test.integration.functions.piggybacking.PiggybackingTest2
16/03/24 13:40:47 WARN util.NativeCodeLoader: Unable to load native-hadoop library for your
platform... using builtin-java classes where applicable
Running org.apache.sysml.test.integration.functions.transform.TransformTest
Tests run: 80, Failures: 0, Errors: 0, Skipped: 0, Time elapsed: 334.467 sec - in org.apache.sysml.test.integration.functions.transform.TransformTest
Running org.apache.sysml.test.integration.functions.ternary.CentralMomentWeightsTest
Tests run: 18, Failures: 0, Errors: 0, Skipped: 0, Time elapsed: 185.149 sec - in org.apache.sysml.test.integration.functions.ternary.CentralMomentWeightsTest
16/03/24 13:41:07 WARN util.NativeCodeLoader: Unable to load native-hadoop library for your
platform... using builtin-java classes where applicable
Running org.apache.sysml.test.integration.functions.gdfo.GDFOLinregDSsimpl
Tests run: 6, Failures: 0, Errors: 0, Skipped: 0, Time elapsed: 144.542 sec - in org.apache.sysml.test.integration.functions.gdfo.GDFOLinregDSsimpl
Running org.apache.sysml.test.integration.functions.gdfo.GDFOMMChainLoop
Tests run: 2, Failures: 0, Errors: 0, Skipped: 0, Time elapsed: 23.538 sec - in org.apache.sysml.test.integration.functions.gdfo.GDFOMMChainLoop
Running org.apache.sysml.test.integration.functions.gdfo.HashInterestingPropertiesTest
Tests run: 3, Failures: 0, Errors: 0, Skipped: 0, Time elapsed: 0.615 sec - in org.apache.sysml.test.integration.functions.gdfo.HashInterestingPropertiesTest
Running org.apache.sysml.test.integration.functions.parfor.ParForRepeatedOptimizationTest
Tests run: 6, Failures: 0, Errors: 0, Skipped: 0, Time elapsed: 709.113 sec - in org.apache.sysml.test.integration.functions.parfor.ParForRepeatedOptimizationTest
16/03/24 13:41:48 WARN util.NativeCodeLoader: Unable to load native-hadoop library for your
platform... using builtin-java classes where applicable
Running org.apache.sysml.test.integration.functions.indexing.LeftIndexingSparseSparseTest
Tests run: 15, Failures: 0, Errors: 0, Skipped: 0, Time elapsed: 118.601 sec - in org.apache.sysml.test.integration.functions.indexing.LeftIndexingSparseSparseTest
16/03/24 13:42:46 INFO util.Utils: Shutdown hook called
16/03/24 13:42:46 INFO util.Utils: Deleting directory /tmp/spark-711a697f-01e1-4164-bf46-0af3a8041f64
Running org.apache.sysml.test.integration.functions.data.FullReblockTest
Tests run: 54, Failures: 0, Errors: 0, Skipped: 0, Time elapsed: 355.149 sec - in org.apache.sysml.test.integration.functions.data.FullReblockTest
Running org.apache.sysml.test.integration.functions.ternary.CTableSequenceTest
Tests run: 24, Failures: 0, Errors: 0, Skipped: 0, Time elapsed: 253.639 sec - in org.apache.sysml.test.integration.functions.ternary.CTableSequenceTest
Running org.apache.sysml.test.integration.functions.blocks.VariableTest
Tests run: 3, Failures: 0, Errors: 0, Skipped: 0, Time elapsed: 5.378 sec - in org.apache.sysml.test.integration.functions.blocks.VariableTest
Running org.apache.sysml.test.integration.functions.blocks.WhileTest
Tests run: 2, Failures: 0, Errors: 0, Skipped: 0, Time elapsed: 3.143 sec - in org.apache.sysml.test.integration.functions.blocks.WhileTest
Running org.apache.sysml.test.integration.functions.ternary.QuantileWeightsTest
Tests run: 30, Failures: 0, Errors: 0, Skipped: 0, Time elapsed: 301.019 sec - in org.apache.sysml.test.integration.functions.ternary.QuantileWeightsTest
Running org.apache.sysml.test.integration.functions.indexing.RightIndexingVectorTest
Tests run: 3, Failures: 0, Errors: 0, Skipped: 0, Time elapsed: 73.7 sec - in org.apache.sysml.test.integration.functions.indexing.RightIndexingVectorTest
Running org.apache.sysml.test.integration.functions.jmlc.FrameTransformTest
Tests run: 4, Failures: 0, Errors: 0, Skipped: 0, Time elapsed: 2.981 sec - in org.apache.sysml.test.integration.functions.jmlc.FrameTransformTest
Running org.apache.sysml.test.integration.functions.jmlc.FrameDecodeTest
Tests run: 4, Failures: 0, Errors: 0, Skipped: 0, Time elapsed: 4.283 sec - in org.apache.sysml.test.integration.functions.jmlc.FrameDecodeTest
Running org.apache.sysml.test.integration.functions.jmlc.ReuseModelVariablesTest
Tests run: 8, Failures: 0, Errors: 0, Skipped: 0, Time elapsed: 6.81 sec - in org.apache.sysml.test.integration.functions.jmlc.ReuseModelVariablesTest
Running org.apache.sysml.test.integration.functions.caching.CachingPWriteExportTest
Tests run: 2, Failures: 0, Errors: 0, Skipped: 0, Time elapsed: 33.86 sec - in org.apache.sysml.test.integration.functions.caching.CachingPWriteExportTest
Running org.apache.sysml.test.integration.functions.jmlc.FrameReadMetaTest
Tests run: 2, Failures: 0, Errors: 0, Skipped: 0, Time elapsed: 2.037 sec - in org.apache.sysml.test.integration.functions.jmlc.FrameReadMetaTest
Running org.apache.sysml.test.integration.functions.updateinplace.UpdateInPlaceTest
Tests run: 15, Failures: 0, Errors: 0, Skipped: 0, Time elapsed: 4.703 sec - in org.apache.sysml.test.integration.functions.updateinplace.UpdateInPlaceTest
Running org.apache.sysml.test.integration.applications.descriptivestats.BivariateCategoricalCategoricallTest
Tests run: 3, Failures: 0, Errors: 0, Skipped: 0, Time elapsed: 16.247 sec - in org.apache.sysml.test.integration.applications.descriptivestats.BivariateCategoricalCategoricallTest
Running org.apache.sysml.test.integration.functions.mlcontext.GNMFTest
Tests run: 6, Failures: 0, Errors: 0, Skipped: 0, Time elapsed: 258.101 sec - in org.apache.sysml.test.integration.functions.mlcontext.GNMFTest
Running org.apache.sysml.test.integration.applications.descriptivestats.BivariateOrdinalOrdinalTest
Tests run: 2, Failures: 0, Errors: 0, Skipped: 0, Time elapsed: 9.005 sec - in org.apache.sysml.test.integration.applications.descriptivestats.BivariateOrdinalOrdinalTest
Running org.apache.sysml.test.integration.applications.descriptivestats.BivariateScaleCategoricalTest
Tests run: 2, Failures: 0, Errors: 0, Skipped: 0, Time elapsed: 7.891 sec - in org.apache.sysml.test.integration.applications.descriptivestats.BivariateScaleCategoricalTest
Running org.apache.sysml.test.integration.applications.descriptivestats.BivariateScaleScaleTest
Tests run: 2, Failures: 0, Errors: 0, Skipped: 0, Time elapsed: 9.461 sec - in org.apache.sysml.test.integration.applications.descriptivestats.BivariateScaleScaleTest
Running org.apache.sysml.test.integration.applications.descriptivestats.OrderStatisticsTest
Tests run: 1, Failures: 0, Errors: 0, Skipped: 0, Time elapsed: 0.296 sec - in org.apache.sysml.test.integration.applications.descriptivestats.OrderStatisticsTest
Running org.apache.sysml.test.integration.functions.indexing.LeftIndexingScalarTest
Tests run: 3, Failures: 0, Errors: 0, Skipped: 0, Time elapsed: 216.485 sec - in org.apache.sysml.test.integration.functions.indexing.LeftIndexingScalarTest
Running org.apache.sysml.test.integration.scalability.PageRankTest
Tests run: 1, Failures: 0, Errors: 0, Skipped: 0, Time elapsed: 1.898 sec - in org.apache.sysml.test.integration.scalability.PageRankTest
Running org.apache.sysml.test.integration.functions.jmlc.SystemTMulticlassSVMScoreTest
Tests run: 2, Failures: 0, Errors: 0, Skipped: 0, Time elapsed: 73.122 sec - in org.apache.sysml.test.integration.functions.jmlc.SystemTMulticlassSVMScoreTest
Running org.apache.sysml.test.integration.scalability.LinearRegressionTest
Tests run: 1, Failures: 0, Errors: 0, Skipped: 0, Time elapsed: 1.508 sec - in org.apache.sysml.test.integration.scalability.LinearRegressionTest
Running org.apache.sysml.test.integration.applications.descriptivestats.UnivariateCategoricalTest
Tests run: 2, Failures: 0, Errors: 0, Skipped: 0, Time elapsed: 8.022 sec - in org.apache.sysml.test.integration.applications.descriptivestats.UnivariateCategoricalTest
Running org.apache.sysml.test.integration.functions.indexing.RightIndexingMatrixTest
Tests run: 6, Failures: 0, Errors: 0, Skipped: 0, Time elapsed: 265.205 sec - in org.apache.sysml.test.integration.functions.indexing.RightIndexingMatrixTest
Running org.apache.sysml.test.integration.applications.parfor.ParForBivariateStatsTest
Tests run: 5, Failures: 0, Errors: 0, Skipped: 0, Time elapsed: 50.242 sec - in org.apache.sysml.test.integration.applications.parfor.ParForBivariateStatsTest
Running org.apache.sysml.test.integration.applications.dml.ArimaDMLTest
Tests run: 1, Failures: 0, Errors: 0, Skipped: 0, Time elapsed: 72.006 sec - in org.apache.sysml.test.integration.applications.dml.ArimaDMLTest
Running org.apache.sysml.test.integration.functions.indexing.LeftIndexingSparseDenseTest
Tests run: 15, Failures: 0, Errors: 0, Skipped: 0, Time elapsed: 248.898 sec - in org.apache.sysml.test.integration.functions.indexing.LeftIndexingSparseDenseTest
16/03/24 13:45:58 INFO util.Utils: Shutdown hook called
16/03/24 13:45:58 INFO util.Utils: Deleting directory /tmp/spark-4a5b7dba-174d-457e-8ad4-d0e6c81dbb0d
Running org.apache.sysml.test.integration.applications.parfor.ParForCVMulticlassSVMTest
Tests run: 6, Failures: 0, Errors: 0, Skipped: 0, Time elapsed: 37.257 sec - in org.apache.sysml.test.integration.applications.parfor.ParForCVMulticlassSVMTest
Running org.apache.sysml.test.integration.applications.parfor.ParForUnivariateStatsTest
Tests run: 3, Failures: 0, Errors: 0, Skipped: 0, Time elapsed: 10.406 sec - in org.apache.sysml.test.integration.applications.parfor.ParForUnivariateStatsTest
Running org.apache.sysml.test.integration.functions.indexing.Jdk7IssueRightIndexingTest
Tests run: 8, Failures: 0, Errors: 0, Skipped: 0, Time elapsed: 428.026 sec - in org.apache.sysml.test.integration.functions.indexing.Jdk7IssueRightIndexingTest
Running org.apache.sysml.test.integration.applications.descriptivestats.UnivariateUnweightedScaleDenseTest
Tests run: 24, Failures: 0, Errors: 0, Skipped: 0, Time elapsed: 309.455 sec - in org.apache.sysml.test.integration.applications.descriptivestats.UnivariateUnweightedScaleDenseTest
Running org.apache.sysml.test.integration.functions.reorg.FullOrderTest
Tests run: 132, Failures: 0, Errors: 0, Skipped: 0, Time elapsed: 1,310.941 sec - in org.apache.sysml.test.integration.functions.reorg.FullOrderTest
Running org.apache.sysml.test.integration.applications.parfor.ParForCorrelationTest
Tests run: 12, Failures: 0, Errors: 0, Skipped: 0, Time elapsed: 252.448 sec - in org.apache.sysml.test.integration.applications.parfor.ParForCorrelationTest
Running org.apache.sysml.test.integration.applications.parfor.ParForCorrelationTestLarge
Tests run: 2, Failures: 0, Errors: 0, Skipped: 0, Time elapsed: 39.527 sec - in org.apache.sysml.test.integration.applications.parfor.ParForCorrelationTestLarge
Running org.apache.sysml.test.integration.functions.indexing.LeftIndexingTest
Tests run: 3, Failures: 0, Errors: 0, Skipped: 0, Time elapsed: 532.767 sec - in org.apache.sysml.test.integration.functions.indexing.LeftIndexingTest
Running org.apache.sysml.test.integration.functions.unary.matrix.RemoveEmptyTest
Tests run: 56, Failures: 0, Errors: 0, Skipped: 0, Time elapsed: 1,703.528 sec - in org.apache.sysml.test.integration.functions.unary.matrix.RemoveEmptyTest
Running org.apache.sysml.test.integration.applications.descriptivestats.UnivariateWeightedScaleDenseTest
Tests run: 24, Failures: 0, Errors: 0, Skipped: 0, Time elapsed: 349.318 sec - in org.apache.sysml.test.integration.applications.descriptivestats.UnivariateWeightedScaleDenseTest
Running org.apache.sysml.test.integration.applications.parfor.ParForNaiveBayesTest
Tests run: 10, Failures: 0, Errors: 0, Skipped: 0, Time elapsed: 498.577 sec - in org.apache.sysml.test.integration.applications.parfor.ParForNaiveBayesTest
Running org.apache.sysml.test.integration.applications.descriptivestats.UnivariateUnweightedScaleSparseTest
Tests run: 24, Failures: 0, Errors: 0, Skipped: 0, Time elapsed: 279.194 sec - in org.apache.sysml.test.integration.applications.descriptivestats.UnivariateUnweightedScaleSparseTest
Running org.apache.sysml.test.integration.applications.dml.HITSDMLTest
Tests run: 1, Failures: 0, Errors: 0, Skipped: 0, Time elapsed: 79.826 sec - in org.apache.sysml.test.integration.applications.dml.HITSDMLTest
Running org.apache.sysml.test.integration.functions.data.RandRuntimePlatformTest
Tests run: 71, Failures: 0, Errors: 0, Skipped: 0, Time elapsed: 1,808.655 sec - in org.apache.sysml.test.integration.functions.data.RandRuntimePlatformTest
Running org.apache.sysml.test.integration.applications.descriptivestats.UnivariateWeightedScaleSparseTest
Tests run: 24, Failures: 0, Errors: 0, Skipped: 0, Time elapsed: 341.656 sec - in org.apache.sysml.test.integration.applications.descriptivestats.UnivariateWeightedScaleSparseTest
Running org.apache.sysml.test.integration.applications.pydml.ArimaPyDMLTest
Tests run: 1, Failures: 0, Errors: 0, Skipped: 0, Time elapsed: 50.308 sec - in org.apache.sysml.test.integration.applications.pydml.ArimaPyDMLTest
Running org.apache.sysml.test.integration.applications.pydml.HITSPyDMLTest
Tests run: 1, Failures: 0, Errors: 0, Skipped: 0, Time elapsed: 76.966 sec - in org.apache.sysml.test.integration.applications.pydml.HITSPyDMLTest
Running org.apache.sysml.test.integration.applications.dml.LinearRegressionDMLTest
Tests run: 7, Failures: 0, Errors: 0, Skipped: 0, Time elapsed: 52.192 sec - in org.apache.sysml.test.integration.applications.dml.LinearRegressionDMLTest
Running org.apache.sysml.test.integration.applications.pydml.CsplineDSPyDMLTest
Tests run: 3, Failures: 0, Errors: 0, Skipped: 0, Time elapsed: 6.919 sec - in org.apache.sysml.test.integration.applications.pydml.CsplineDSPyDMLTest
Running org.apache.sysml.test.integration.applications.pydml.LinearLogRegPyDMLTest
Tests run: 7, Failures: 0, Errors: 0, Skipped: 0, Time elapsed: 90.283 sec - in org.apache.sysml.test.integration.applications.pydml.LinearLogRegPyDMLTest
Running org.apache.sysml.test.integration.applications.pydml.NaiveBayesPyDMLTest
Tests run: 6, Failures: 0, Errors: 0, Skipped: 0, Time elapsed: 81.192 sec - in org.apache.sysml.test.integration.applications.pydml.NaiveBayesPyDMLTest
Running org.apache.sysml.test.integration.applications.dml.CsplineCGDMLTest
Tests run: 3, Failures: 0, Errors: 0, Skipped: 0, Time elapsed: 11.387 sec - in org.apache.sysml.test.integration.applications.dml.CsplineCGDMLTest
Running org.apache.sysml.test.integration.applications.dml.L2SVMDMLTest
Tests run: 9, Failures: 0, Errors: 0, Skipped: 0, Time elapsed: 65.656 sec - in org.apache.sysml.test.integration.applications.dml.L2SVMDMLTest
Running org.apache.sysml.test.integration.applications.pydml.MDABivariateStatsPyDMLTest
Tests run: 4, Failures: 0, Errors: 0, Skipped: 0, Time elapsed: 294.362 sec - in org.apache.sysml.test.integration.applications.pydml.MDABivariateStatsPyDMLTest
Running org.apache.sysml.test.integration.applications.pydml.PageRankPyDMLTest
Tests run: 3, Failures: 0, Errors: 0, Skipped: 0, Time elapsed: 6.586 sec - in org.apache.sysml.test.integration.applications.pydml.PageRankPyDMLTest
Running org.apache.sysml.test.integration.applications.pydml.NaiveBayesParforPyDMLTest
Tests run: 6, Failures: 0, Errors: 0, Skipped: 0, Time elapsed: 81.261 sec - in org.apache.sysml.test.integration.applications.pydml.NaiveBayesParforPyDMLTest
Running org.apache.sysml.test.integration.applications.dml.NaiveBayesDMLTest
Tests run: 6, Failures: 0, Errors: 0, Skipped: 0, Time elapsed: 81.205 sec - in org.apache.sysml.test.integration.applications.dml.NaiveBayesDMLTest
Running org.apache.sysml.test.integration.applications.dml.MDABivariateStatsDMLTest
Tests run: 4, Failures: 0, Errors: 0, Skipped: 0, Time elapsed: 296.823 sec - in org.apache.sysml.test.integration.applications.dml.MDABivariateStatsDMLTest
Running org.apache.sysml.test.integration.applications.dml.PageRankDMLTest
Tests run: 3, Failures: 0, Errors: 0, Skipped: 0, Time elapsed: 6.669 sec - in org.apache.sysml.test.integration.applications.dml.PageRankDMLTest
Running org.apache.sysml.test.integration.applications.pydml.GLMPyDMLTest
Tests run: 30, Failures: 0, Errors: 0, Skipped: 0, Time elapsed: 587.02 sec - in org.apache.sysml.test.integration.applications.pydml.GLMPyDMLTest
Running org.apache.sysml.test.integration.applications.pydml.MultiClassSVMPyDMLTest
Tests run: 9, Failures: 0, Errors: 0, Skipped: 0, Time elapsed: 90.251 sec - in org.apache.sysml.test.integration.applications.pydml.MultiClassSVMPyDMLTest
Running org.apache.sysml.test.integration.applications.dml.ID3DMLTest
Tests run: 2, Failures: 0, Errors: 0, Skipped: 0, Time elapsed: 375.477 sec - in org.apache.sysml.test.integration.applications.dml.ID3DMLTest
Running org.apache.sysml.test.integration.applications.dml.GLMDMLTest
Tests run: 30, Failures: 0, Errors: 0, Skipped: 0, Time elapsed: 778.527 sec - in org.apache.sysml.test.integration.applications.dml.GLMDMLTest
Running org.apache.sysml.test.integration.applications.pydml.CsplineCGPyDMLTest
Tests run: 3, Failures: 0, Errors: 0, Skipped: 0, Time elapsed: 6.214 sec - in org.apache.sysml.test.integration.applications.pydml.CsplineCGPyDMLTest
Running org.apache.sysml.test.integration.applications.pydml.WelchTPyDMLTest
Tests run: 3, Failures: 0, Errors: 0, Skipped: 0, Time elapsed: 6.639 sec - in org.apache.sysml.test.integration.applications.pydml.WelchTPyDMLTest
Running org.apache.sysml.test.integration.applications.dml.MultiClassSVMDMLTest
Tests run: 9, Failures: 0, Errors: 0, Skipped: 0, Time elapsed: 88.538 sec - in org.apache.sysml.test.integration.applications.dml.MultiClassSVMDMLTest
Running org.apache.sysml.test.integration.applications.dml.CsplineDSDMLTest
Tests run: 3, Failures: 0, Errors: 0, Skipped: 0, Time elapsed: 14.767 sec - in org.apache.sysml.test.integration.applications.dml.CsplineDSDMLTest
Running org.apache.sysml.test.integration.applications.pydml.ApplyTransformPyDMLTest
Tests run: 7, Failures: 0, Errors: 0, Skipped: 0, Time elapsed: 1.184 sec - in org.apache.sysml.test.integration.applications.pydml.ApplyTransformPyDMLTest
Running org.apache.sysml.test.integration.applications.dml.NaiveBayesParforDMLTest
Tests run: 6, Failures: 0, Errors: 0, Skipped: 0, Time elapsed: 81.797 sec - in org.apache.sysml.test.integration.applications.dml.NaiveBayesParforDMLTest
Running org.apache.sysml.test.integration.applications.pydml.L2SVMPyDMLTest
Tests run: 9, Failures: 0, Errors: 0, Skipped: 0, Time elapsed: 65.055 sec - in org.apache.sysml.test.integration.applications.pydml.L2SVMPyDMLTest
Running org.apache.sysml.test.integration.applications.pydml.LinearRegressionPyDMLTest
Tests run: 7, Failures: 0, Errors: 0, Skipped: 0, Time elapsed: 51.895 sec - in org.apache.sysml.test.integration.applications.pydml.LinearRegressionPyDMLTest
Running org.apache.sysml.test.integration.applications.dml.LinearLogRegDMLTest
Tests run: 7, Failures: 0, Errors: 0, Skipped: 0, Time elapsed: 62.197 sec - in org.apache.sysml.test.integration.applications.dml.LinearLogRegDMLTest
Running org.apache.sysml.test.integration.applications.dml.GNMFDMLTest
Tests run: 3, Failures: 0, Errors: 0, Skipped: 0, Time elapsed: 65.744 sec - in org.apache.sysml.test.integration.applications.dml.GNMFDMLTest
Running org.apache.sysml.test.integration.applications.dml.WelchTDMLTest
Tests run: 3, Failures: 0, Errors: 0, Skipped: 0, Time elapsed: 6.645 sec - in org.apache.sysml.test.integration.applications.dml.WelchTDMLTest
Running org.apache.sysml.test.integration.applications.dml.ApplyTransformDMLTest
Tests run: 7, Failures: 0, Errors: 0, Skipped: 0, Time elapsed: 9.071 sec - in org.apache.sysml.test.integration.applications.dml.ApplyTransformDMLTest
Running org.apache.sysml.test.integration.applications.pydml.ID3PyDMLTest
Tests run: 2, Failures: 0, Errors: 0, Skipped: 0, Time elapsed: 326.083 sec - in org.apache.sysml.test.integration.applications.pydml.ID3PyDMLTest
Running org.apache.sysml.test.integration.applications.pydml.GNMFPyDMLTest
Tests run: 3, Failures: 0, Errors: 0, Skipped: 0, Time elapsed: 57.107 sec - in org.apache.sysml.test.integration.applications.pydml.GNMFPyDMLTest

Results :

Tests in error: 
  FrameCopyTest.testFrameMixedStringsCBind:57->runFrameCopyTest:178 Runtime java...
  FrameCopyTest.testFrameMixedMixedCBind:67->runFrameCopyTest:178 Runtime java.l...
  FrameCopyTest.testFrameMixedMixedRBind:72->runFrameCopyTest:178 Runtime java.l...
  FrameCopyTest.testFrameStringsMixedCBind:62->runFrameCopyTest:178 Runtime java...
  FrameCopyTest.testFrameStringsStringsCBind:47->runFrameCopyTest:178 Runtime ja...
  FrameCopyTest.testFrameStringsStringsRBind:52->runFrameCopyTest:178 Runtime ja...

Tests run: 4856, Failures: 0, Errors: 6, Skipped: 0

[INFO] 
[INFO] --- maven-failsafe-plugin:2.17:verify (default) @ systemml ---
[INFO] Failsafe report directory: <https://sparktc.ibmcloud.com/jenkins/job/SystemML-DailyTest/ws/target/failsafe-reports>
[INFO] ------------------------------------------------------------------------
[INFO] BUILD FAILURE
[INFO] ------------------------------------------------------------------------
[INFO] Total time: 02:16 h
[INFO] Finished at: 2016-03-24T14:51:44-07:00
[INFO] Final Memory: 64M/2389M
[INFO] ------------------------------------------------------------------------
[ERROR] Failed to execute goal org.apache.maven.plugins:maven-failsafe-plugin:2.17:verify
(default) on project systemml: There are test failures.
[ERROR] 
[ERROR] Please refer to <https://sparktc.ibmcloud.com/jenkins/job/SystemML-DailyTest/ws/target/failsafe-reports>
for the individual test results.
[ERROR] -> [Help 1]
[ERROR] 
[ERROR] To see the full stack trace of the errors, re-run Maven with the -e switch.
[ERROR] Re-run Maven using the -X switch to enable full debug logging.
[ERROR] 
[ERROR] For more information about the errors and possible solutions, please read the following
articles:
[ERROR] [Help 1] http://cwiki.apache.org/confluence/display/MAVEN/MojoFailureException
Build step 'Execute shell' marked build as failure
Run condition [Always] enabling perform for step [[]]

Mime
View raw message