systemml-dev mailing list archives

Site index · List index
Message view « Date » · « Thread »
Top « Date » · « Thread »
From jenk...@spark.tc
Subject Build failed in Jenkins: SystemML-DailyTest #148
Date Wed, 23 Mar 2016 21:52:52 GMT
See <https://sparktc.ibmcloud.com/jenkins/job/SystemML-DailyTest/148/changes>

Changes:

[Arvind Surve] [SYSTEMML-573] Frame IO Read

[Matthias Boehm] [SYSTEMML-591] Cleanup debugger compilation chain (prep consolidation)

------------------------------------------
[...truncated 1343 lines...]
java.lang.RuntimeException: java.lang.NullPointerException
	at org.apache.sysml.runtime.util.UtilFunctions.compareTo(UtilFunctions.java:359)
	at org.apache.sysml.test.integration.functions.frame.FrameCopyTest.runFrameCopyTest(FrameCopyTest.java:123)
	at org.apache.sysml.test.integration.functions.frame.FrameCopyTest.testFrameStringsMixedCBind(FrameCopyTest.java:62)

testFrameStringsStringsCBind(org.apache.sysml.test.integration.functions.frame.FrameCopyTest)
 Time elapsed: 0.077 sec  <<< ERROR!
java.lang.RuntimeException: java.lang.NullPointerException
	at org.apache.sysml.runtime.util.UtilFunctions.compareTo(UtilFunctions.java:359)
	at org.apache.sysml.test.integration.functions.frame.FrameCopyTest.runFrameCopyTest(FrameCopyTest.java:123)
	at org.apache.sysml.test.integration.functions.frame.FrameCopyTest.testFrameStringsStringsCBind(FrameCopyTest.java:47)

testFrameStringsStringsRBind(org.apache.sysml.test.integration.functions.frame.FrameCopyTest)
 Time elapsed: 0.116 sec  <<< ERROR!
java.lang.RuntimeException: java.lang.NullPointerException
	at org.apache.sysml.runtime.util.UtilFunctions.compareTo(UtilFunctions.java:359)
	at org.apache.sysml.test.integration.functions.frame.FrameCopyTest.runFrameCopyTest(FrameCopyTest.java:123)
	at org.apache.sysml.test.integration.functions.frame.FrameCopyTest.testFrameStringsStringsRBind(FrameCopyTest.java:52)

Running org.apache.sysml.test.integration.functions.reorg.FullTransposeTest
Tests run: 18, Failures: 0, Errors: 0, Skipped: 0, Time elapsed: 402.046 sec - in org.apache.sysml.test.integration.functions.reorg.FullTransposeTest
Running org.apache.sysml.test.integration.functions.transform.RunTest
Tests run: 24, Failures: 0, Errors: 0, Skipped: 0, Time elapsed: 106.835 sec - in org.apache.sysml.test.integration.functions.transform.RunTest
Running org.apache.sysml.test.integration.functions.jmlc.ReuseModelVariablesTest
Tests run: 8, Failures: 0, Errors: 0, Skipped: 0, Time elapsed: 9.171 sec - in org.apache.sysml.test.integration.functions.jmlc.ReuseModelVariablesTest
Running org.apache.sysml.test.integration.functions.jmlc.FrameDecodeTest
Tests run: 4, Failures: 0, Errors: 0, Skipped: 0, Time elapsed: 4.718 sec - in org.apache.sysml.test.integration.functions.jmlc.FrameDecodeTest
Running org.apache.sysml.test.integration.functions.jmlc.FrameTransformTest
Tests run: 4, Failures: 0, Errors: 0, Skipped: 0, Time elapsed: 6.187 sec - in org.apache.sysml.test.integration.functions.jmlc.FrameTransformTest
Running org.apache.sysml.test.integration.functions.binary.matrix_full_cellwise.FullMatrixMatrixCellwiseOperationTest
Tests run: 108, Failures: 0, Errors: 0, Skipped: 0, Time elapsed: 1,978.916 sec - in org.apache.sysml.test.integration.functions.binary.matrix_full_cellwise.FullMatrixMatrixCellwiseOperationTest
16/03/23 15:37:04 INFO util.Utils: Shutdown hook called
16/03/23 15:37:04 INFO util.Utils: Deleting directory /tmp/spark-8f45053b-3284-40f3-a5e5-abb5eb3df488
Running org.apache.sysml.test.integration.functions.jmlc.FrameReadMetaTest
Tests run: 2, Failures: 0, Errors: 0, Skipped: 0, Time elapsed: 4.34 sec - in org.apache.sysml.test.integration.functions.jmlc.FrameReadMetaTest
Running org.apache.sysml.test.integration.functions.reorg.FullReverseTest
Tests run: 14, Failures: 0, Errors: 0, Skipped: 0, Time elapsed: 489.332 sec - in org.apache.sysml.test.integration.functions.reorg.FullReverseTest
Running org.apache.sysml.test.integration.functions.quaternary.WeightedCrossEntropyTest
Tests run: 16, Failures: 0, Errors: 0, Skipped: 0, Time elapsed: 241.436 sec - in org.apache.sysml.test.integration.functions.quaternary.WeightedCrossEntropyTest
16/03/23 15:37:31 INFO util.Utils: Shutdown hook called
16/03/23 15:37:31 INFO util.Utils: Deleting directory /tmp/spark-a0fb3fc1-0fa9-4fa3-b394-e12b1c100f78
Running org.apache.sysml.test.integration.functions.blocks.WhileTest
Tests run: 2, Failures: 0, Errors: 0, Skipped: 0, Time elapsed: 5.865 sec - in org.apache.sysml.test.integration.functions.blocks.WhileTest
Running org.apache.sysml.test.integration.functions.blocks.VariableTest
Tests run: 3, Failures: 0, Errors: 0, Skipped: 0, Time elapsed: 5.999 sec - in org.apache.sysml.test.integration.functions.blocks.VariableTest
Running org.apache.sysml.test.integration.functions.dmlscript.DMLScriptTest1
Tests run: 2, Failures: 0, Errors: 0, Skipped: 0, Time elapsed: 2.783 sec - in org.apache.sysml.test.integration.functions.dmlscript.DMLScriptTest1
Running org.apache.sysml.test.integration.functions.vect.LeftIndexingChainUpdateTest
Tests run: 4, Failures: 0, Errors: 0, Skipped: 0, Time elapsed: 21.054 sec - in org.apache.sysml.test.integration.functions.vect.LeftIndexingChainUpdateTest
Running org.apache.sysml.test.integration.functions.transform.ScalingTest
Tests run: 8, Failures: 0, Errors: 0, Skipped: 0, Time elapsed: 84.058 sec - in org.apache.sysml.test.integration.functions.transform.ScalingTest
16/03/23 15:37:54 WARN util.NativeCodeLoader: Unable to load native-hadoop library for your
platform... using builtin-java classes where applicable
16/03/23 15:37:54 WARN util.NativeCodeLoader: Unable to load native-hadoop library for your
platform... using builtin-java classes where applicable
Running org.apache.sysml.test.integration.functions.dmlscript.DMLScriptTest2
Tests run: 2, Failures: 0, Errors: 0, Skipped: 0, Time elapsed: 4.202 sec - in org.apache.sysml.test.integration.functions.dmlscript.DMLScriptTest2
Running org.apache.sysml.test.integration.functions.jmlc.SystemTMulticlassSVMScoreTest
Tests run: 2, Failures: 0, Errors: 0, Skipped: 0, Time elapsed: 89.753 sec - in org.apache.sysml.test.integration.functions.jmlc.SystemTMulticlassSVMScoreTest
Running org.apache.sysml.test.integration.functions.vect.AutoVectorizationTest
Tests run: 24, Failures: 0, Errors: 0, Skipped: 0, Time elapsed: 108.935 sec - in org.apache.sysml.test.integration.functions.vect.AutoVectorizationTest
Running org.apache.sysml.test.integration.functions.reorg.MatrixReshapeTest
Tests run: 36, Failures: 0, Errors: 0, Skipped: 0, Time elapsed: 618.339 sec - in org.apache.sysml.test.integration.functions.reorg.MatrixReshapeTest
Running org.apache.sysml.test.integration.functions.indexing.RightIndexingVectorTest
Tests run: 3, Failures: 0, Errors: 0, Skipped: 0, Time elapsed: 89.291 sec - in org.apache.sysml.test.integration.functions.indexing.RightIndexingVectorTest
16/03/23 15:39:59 WARN util.NativeCodeLoader: Unable to load native-hadoop library for your
platform... using builtin-java classes where applicable
Running org.apache.sysml.test.integration.functions.indexing.LeftIndexingSparseSparseTest
Tests run: 15, Failures: 0, Errors: 0, Skipped: 0, Time elapsed: 127.769 sec - in org.apache.sysml.test.integration.functions.indexing.LeftIndexingSparseSparseTest
16/03/23 15:40:03 INFO util.Utils: Shutdown hook called
16/03/23 15:40:03 INFO util.Utils: Deleting directory /tmp/spark-38aa9d2d-6e73-4322-a9e0-6bc42377e4a6
Running org.apache.sysml.test.integration.functions.transform.TransformTest
Tests run: 80, Failures: 0, Errors: 0, Skipped: 0, Time elapsed: 379.002 sec - in org.apache.sysml.test.integration.functions.transform.TransformTest
Running org.apache.sysml.test.integration.functions.quaternary.WeightedUnaryMatrixMultTest
Tests run: 26, Failures: 0, Errors: 0, Skipped: 0, Time elapsed: 564.504 sec - in org.apache.sysml.test.integration.functions.quaternary.WeightedUnaryMatrixMultTest
16/03/23 15:41:58 INFO util.Utils: Shutdown hook called
16/03/23 15:41:58 INFO util.Utils: Deleting directory /tmp/spark-3b21c38e-ca52-4f84-a32f-fc179d5be64a
Running org.apache.sysml.test.integration.functions.indexing.RightIndexingMatrixTest
Tests run: 6, Failures: 0, Errors: 0, Skipped: 0, Time elapsed: 260.24 sec - in org.apache.sysml.test.integration.functions.indexing.RightIndexingMatrixTest
Running org.apache.sysml.test.integration.functions.indexing.LeftIndexingScalarTest
Tests run: 3, Failures: 0, Errors: 0, Skipped: 0, Time elapsed: 238.601 sec - in org.apache.sysml.test.integration.functions.indexing.LeftIndexingScalarTest
Running org.apache.sysml.test.integration.functions.quaternary.WeightedSquaredLossTest
Tests run: 55, Failures: 0, Errors: 0, Skipped: 0, Time elapsed: 845.229 sec - in org.apache.sysml.test.integration.functions.quaternary.WeightedSquaredLossTest
16/03/23 15:43:59 INFO util.Utils: Shutdown hook called
16/03/23 15:43:59 INFO util.Utils: Deleting directory /tmp/spark-6a70b9d1-1656-4ac3-83c4-618375b22ca5
Running org.apache.sysml.test.integration.functions.updateinplace.UpdateInPlaceTest
Tests run: 15, Failures: 0, Errors: 0, Skipped: 0, Time elapsed: 8.012 sec - in org.apache.sysml.test.integration.functions.updateinplace.UpdateInPlaceTest
Running org.apache.sysml.test.integration.functions.append.StringAppendTest
Tests run: 9, Failures: 0, Errors: 0, Skipped: 0, Time elapsed: 43.635 sec - in org.apache.sysml.test.integration.functions.append.StringAppendTest
Running org.apache.sysml.test.integration.functions.append.RBindCBindMatrixTest
Tests run: 12, Failures: 0, Errors: 0, Skipped: 0, Time elapsed: 148.102 sec - in org.apache.sysml.test.integration.functions.append.RBindCBindMatrixTest
Running org.apache.sysml.test.integration.functions.indexing.LeftIndexingSparseDenseTest
Tests run: 15, Failures: 0, Errors: 0, Skipped: 0, Time elapsed: 290.069 sec - in org.apache.sysml.test.integration.functions.indexing.LeftIndexingSparseDenseTest
16/03/23 15:44:50 INFO util.Utils: Shutdown hook called
16/03/23 15:44:50 INFO util.Utils: Deleting directory /tmp/spark-ea231fe4-92fd-4b08-8d00-682a6c106bf6
Running org.apache.sysml.test.integration.scalability.LinearRegressionTest
Tests run: 1, Failures: 0, Errors: 0, Skipped: 0, Time elapsed: 1.843 sec - in org.apache.sysml.test.integration.scalability.LinearRegressionTest
Running org.apache.sysml.test.integration.scalability.PageRankTest
Tests run: 1, Failures: 0, Errors: 0, Skipped: 0, Time elapsed: 1.57 sec - in org.apache.sysml.test.integration.scalability.PageRankTest
Running org.apache.sysml.test.integration.applications.descriptivestats.BivariateCategoricalCategoricallTest
Tests run: 3, Failures: 0, Errors: 0, Skipped: 0, Time elapsed: 14.321 sec - in org.apache.sysml.test.integration.applications.descriptivestats.BivariateCategoricalCategoricallTest
Running org.apache.sysml.test.integration.applications.parfor.ParForBivariateStatsTest
Tests run: 5, Failures: 0, Errors: 0, Skipped: 0, Time elapsed: 59.84 sec - in org.apache.sysml.test.integration.applications.parfor.ParForBivariateStatsTest
Running org.apache.sysml.test.integration.applications.descriptivestats.BivariateOrdinalOrdinalTest
Tests run: 2, Failures: 0, Errors: 0, Skipped: 0, Time elapsed: 8.547 sec - in org.apache.sysml.test.integration.applications.descriptivestats.BivariateOrdinalOrdinalTest
Running org.apache.sysml.test.integration.applications.descriptivestats.BivariateScaleCategoricalTest
Tests run: 2, Failures: 0, Errors: 0, Skipped: 0, Time elapsed: 10.636 sec - in org.apache.sysml.test.integration.applications.descriptivestats.BivariateScaleCategoricalTest
Running org.apache.sysml.test.integration.applications.descriptivestats.BivariateScaleScaleTest
Tests run: 2, Failures: 0, Errors: 0, Skipped: 0, Time elapsed: 7.214 sec - in org.apache.sysml.test.integration.applications.descriptivestats.BivariateScaleScaleTest
Running org.apache.sysml.test.integration.applications.descriptivestats.OrderStatisticsTest
Tests run: 1, Failures: 0, Errors: 0, Skipped: 0, Time elapsed: 0.167 sec - in org.apache.sysml.test.integration.applications.descriptivestats.OrderStatisticsTest
Running org.apache.sysml.test.integration.applications.descriptivestats.UnivariateCategoricalTest
Tests run: 2, Failures: 0, Errors: 0, Skipped: 0, Time elapsed: 6.098 sec - in org.apache.sysml.test.integration.applications.descriptivestats.UnivariateCategoricalTest
Running org.apache.sysml.test.integration.applications.parfor.ParForCVMulticlassSVMTest
Tests run: 6, Failures: 0, Errors: 0, Skipped: 0, Time elapsed: 35.433 sec - in org.apache.sysml.test.integration.applications.parfor.ParForCVMulticlassSVMTest
Running org.apache.sysml.test.integration.applications.dml.ArimaDMLTest
Tests run: 1, Failures: 0, Errors: 0, Skipped: 0, Time elapsed: 71.354 sec - in org.apache.sysml.test.integration.applications.dml.ArimaDMLTest
Running org.apache.sysml.test.integration.applications.parfor.ParForUnivariateStatsTest
Tests run: 3, Failures: 0, Errors: 0, Skipped: 0, Time elapsed: 14.804 sec - in org.apache.sysml.test.integration.applications.parfor.ParForUnivariateStatsTest
Running org.apache.sysml.test.integration.functions.indexing.Jdk7IssueRightIndexingTest
Tests run: 8, Failures: 0, Errors: 0, Skipped: 0, Time elapsed: 489.336 sec - in org.apache.sysml.test.integration.functions.indexing.Jdk7IssueRightIndexingTest
Running org.apache.sysml.test.integration.functions.append.AppendVectorTest
Tests run: 6, Failures: 0, Errors: 0, Skipped: 0, Time elapsed: 387.404 sec - in org.apache.sysml.test.integration.functions.append.AppendVectorTest
Running org.apache.sysml.test.integration.functions.quaternary.WeightedDivMatrixMultTest
Tests run: 88, Failures: 0, Errors: 0, Skipped: 0, Time elapsed: 1,131.838 sec - in org.apache.sysml.test.integration.functions.quaternary.WeightedDivMatrixMultTest
16/03/23 15:48:49 INFO util.Utils: Shutdown hook called
16/03/23 15:48:49 INFO util.Utils: Deleting directory /tmp/spark-dff6ffb6-7f03-49d6-b409-8c74d7ce2364
Running org.apache.sysml.test.integration.functions.quaternary.WeightedSigmoidTest
Tests run: 56, Failures: 0, Errors: 0, Skipped: 0, Time elapsed: 1,016.353 sec - in org.apache.sysml.test.integration.functions.quaternary.WeightedSigmoidTest
16/03/23 15:50:11 INFO util.Utils: Shutdown hook called
16/03/23 15:50:11 INFO util.Utils: Deleting directory /tmp/spark-e4e31b4e-e491-4443-afd8-cb55b4d559d3
Running org.apache.sysml.test.integration.functions.indexing.LeftIndexingTest
Tests run: 3, Failures: 0, Errors: 0, Skipped: 0, Time elapsed: 668.975 sec - in org.apache.sysml.test.integration.functions.indexing.LeftIndexingTest
Running org.apache.sysml.test.integration.applications.parfor.ParForCorrelationTest
Tests run: 12, Failures: 0, Errors: 0, Skipped: 0, Time elapsed: 266.093 sec - in org.apache.sysml.test.integration.applications.parfor.ParForCorrelationTest
Running org.apache.sysml.test.integration.applications.parfor.ParForCorrelationTestLarge
Tests run: 2, Failures: 0, Errors: 0, Skipped: 0, Time elapsed: 43.213 sec - in org.apache.sysml.test.integration.applications.parfor.ParForCorrelationTestLarge
Running org.apache.sysml.test.integration.applications.descriptivestats.UnivariateUnweightedScaleDenseTest
Tests run: 24, Failures: 0, Errors: 0, Skipped: 0, Time elapsed: 334.714 sec - in org.apache.sysml.test.integration.applications.descriptivestats.UnivariateUnweightedScaleDenseTest
Running org.apache.sysml.test.integration.functions.reorg.FullOrderTest
Tests run: 132, Failures: 0, Errors: 0, Skipped: 0, Time elapsed: 1,373.322 sec - in org.apache.sysml.test.integration.functions.reorg.FullOrderTest
Running org.apache.sysml.test.integration.applications.descriptivestats.UnivariateWeightedScaleDenseTest
Tests run: 24, Failures: 0, Errors: 0, Skipped: 0, Time elapsed: 348.336 sec - in org.apache.sysml.test.integration.applications.descriptivestats.UnivariateWeightedScaleDenseTest
Running org.apache.sysml.test.integration.functions.append.AppendChainTest
Tests run: 12, Failures: 0, Errors: 0, Skipped: 0, Time elapsed: 1,073.323 sec - in org.apache.sysml.test.integration.functions.append.AppendChainTest
Running org.apache.sysml.test.integration.applications.parfor.ParForNaiveBayesTest
Tests run: 10, Failures: 0, Errors: 0, Skipped: 0, Time elapsed: 493.128 sec - in org.apache.sysml.test.integration.applications.parfor.ParForNaiveBayesTest
Running org.apache.sysml.test.integration.applications.descriptivestats.UnivariateUnweightedScaleSparseTest
Tests run: 24, Failures: 0, Errors: 0, Skipped: 0, Time elapsed: 288.658 sec - in org.apache.sysml.test.integration.applications.descriptivestats.UnivariateUnweightedScaleSparseTest
Running org.apache.sysml.test.integration.applications.dml.HITSDMLTest
Tests run: 1, Failures: 0, Errors: 0, Skipped: 0, Time elapsed: 86.896 sec - in org.apache.sysml.test.integration.applications.dml.HITSDMLTest
Running org.apache.sysml.test.integration.applications.descriptivestats.UnivariateWeightedScaleSparseTest
Tests run: 24, Failures: 0, Errors: 0, Skipped: 0, Time elapsed: 351.418 sec - in org.apache.sysml.test.integration.applications.descriptivestats.UnivariateWeightedScaleSparseTest
Running org.apache.sysml.test.integration.functions.append.AppendMatrixTest
Tests run: 22, Failures: 0, Errors: 0, Skipped: 0, Time elapsed: 1,580.648 sec - in org.apache.sysml.test.integration.functions.append.AppendMatrixTest
Running org.apache.sysml.test.integration.applications.pydml.ArimaPyDMLTest
Tests run: 1, Failures: 0, Errors: 0, Skipped: 0, Time elapsed: 50.295 sec - in org.apache.sysml.test.integration.applications.pydml.ArimaPyDMLTest
Running org.apache.sysml.test.integration.applications.pydml.HITSPyDMLTest
Tests run: 1, Failures: 0, Errors: 0, Skipped: 0, Time elapsed: 78.305 sec - in org.apache.sysml.test.integration.applications.pydml.HITSPyDMLTest
Running org.apache.sysml.test.integration.applications.dml.LinearRegressionDMLTest
Tests run: 7, Failures: 0, Errors: 0, Skipped: 0, Time elapsed: 52.603 sec - in org.apache.sysml.test.integration.applications.dml.LinearRegressionDMLTest
Running org.apache.sysml.test.integration.applications.pydml.CsplineDSPyDMLTest
Tests run: 3, Failures: 0, Errors: 0, Skipped: 0, Time elapsed: 6.861 sec - in org.apache.sysml.test.integration.applications.pydml.CsplineDSPyDMLTest
Running org.apache.sysml.test.integration.applications.pydml.LinearLogRegPyDMLTest
Tests run: 7, Failures: 0, Errors: 0, Skipped: 0, Time elapsed: 96.004 sec - in org.apache.sysml.test.integration.applications.pydml.LinearLogRegPyDMLTest
Running org.apache.sysml.test.integration.applications.pydml.NaiveBayesPyDMLTest
Tests run: 6, Failures: 0, Errors: 0, Skipped: 0, Time elapsed: 81.128 sec - in org.apache.sysml.test.integration.applications.pydml.NaiveBayesPyDMLTest
Running org.apache.sysml.test.integration.applications.dml.CsplineCGDMLTest
Tests run: 3, Failures: 0, Errors: 0, Skipped: 0, Time elapsed: 13.245 sec - in org.apache.sysml.test.integration.applications.dml.CsplineCGDMLTest
Running org.apache.sysml.test.integration.applications.dml.L2SVMDMLTest
Tests run: 9, Failures: 0, Errors: 0, Skipped: 0, Time elapsed: 65.255 sec - in org.apache.sysml.test.integration.applications.dml.L2SVMDMLTest
Running org.apache.sysml.test.integration.applications.pydml.MDABivariateStatsPyDMLTest
Tests run: 4, Failures: 0, Errors: 0, Skipped: 0, Time elapsed: 293.383 sec - in org.apache.sysml.test.integration.applications.pydml.MDABivariateStatsPyDMLTest
Running org.apache.sysml.test.integration.applications.pydml.PageRankPyDMLTest
Tests run: 3, Failures: 0, Errors: 0, Skipped: 0, Time elapsed: 6.784 sec - in org.apache.sysml.test.integration.applications.pydml.PageRankPyDMLTest
Running org.apache.sysml.test.integration.applications.pydml.NaiveBayesParforPyDMLTest
Tests run: 6, Failures: 0, Errors: 0, Skipped: 0, Time elapsed: 81.954 sec - in org.apache.sysml.test.integration.applications.pydml.NaiveBayesParforPyDMLTest
Running org.apache.sysml.test.integration.applications.dml.NaiveBayesDMLTest
Tests run: 6, Failures: 0, Errors: 0, Skipped: 0, Time elapsed: 81.499 sec - in org.apache.sysml.test.integration.applications.dml.NaiveBayesDMLTest
Running org.apache.sysml.test.integration.applications.dml.MDABivariateStatsDMLTest
Tests run: 4, Failures: 0, Errors: 0, Skipped: 0, Time elapsed: 295.075 sec - in org.apache.sysml.test.integration.applications.dml.MDABivariateStatsDMLTest
Running org.apache.sysml.test.integration.applications.dml.PageRankDMLTest
Tests run: 3, Failures: 0, Errors: 0, Skipped: 0, Time elapsed: 6.499 sec - in org.apache.sysml.test.integration.applications.dml.PageRankDMLTest
Running org.apache.sysml.test.integration.applications.pydml.GLMPyDMLTest
Tests run: 30, Failures: 0, Errors: 0, Skipped: 0, Time elapsed: 586.944 sec - in org.apache.sysml.test.integration.applications.pydml.GLMPyDMLTest
Running org.apache.sysml.test.integration.applications.pydml.MultiClassSVMPyDMLTest
Tests run: 9, Failures: 0, Errors: 0, Skipped: 0, Time elapsed: 89.243 sec - in org.apache.sysml.test.integration.applications.pydml.MultiClassSVMPyDMLTest
Running org.apache.sysml.test.integration.applications.dml.ID3DMLTest
Tests run: 2, Failures: 0, Errors: 0, Skipped: 0, Time elapsed: 379.805 sec - in org.apache.sysml.test.integration.applications.dml.ID3DMLTest
Running org.apache.sysml.test.integration.applications.dml.GLMDMLTest
Tests run: 30, Failures: 0, Errors: 0, Skipped: 0, Time elapsed: 825.815 sec - in org.apache.sysml.test.integration.applications.dml.GLMDMLTest
Running org.apache.sysml.test.integration.applications.pydml.CsplineCGPyDMLTest
Tests run: 3, Failures: 0, Errors: 0, Skipped: 0, Time elapsed: 6.208 sec - in org.apache.sysml.test.integration.applications.pydml.CsplineCGPyDMLTest
Running org.apache.sysml.test.integration.applications.pydml.WelchTPyDMLTest
Tests run: 3, Failures: 0, Errors: 0, Skipped: 0, Time elapsed: 6.716 sec - in org.apache.sysml.test.integration.applications.pydml.WelchTPyDMLTest
Running org.apache.sysml.test.integration.applications.dml.MultiClassSVMDMLTest
Tests run: 9, Failures: 0, Errors: 0, Skipped: 0, Time elapsed: 88.52 sec - in org.apache.sysml.test.integration.applications.dml.MultiClassSVMDMLTest
Running org.apache.sysml.test.integration.applications.dml.CsplineDSDMLTest
Tests run: 3, Failures: 0, Errors: 0, Skipped: 0, Time elapsed: 14.305 sec - in org.apache.sysml.test.integration.applications.dml.CsplineDSDMLTest
Running org.apache.sysml.test.integration.applications.pydml.ApplyTransformPyDMLTest
Tests run: 7, Failures: 0, Errors: 0, Skipped: 0, Time elapsed: 1.185 sec - in org.apache.sysml.test.integration.applications.pydml.ApplyTransformPyDMLTest
Running org.apache.sysml.test.integration.applications.dml.NaiveBayesParforDMLTest
Tests run: 6, Failures: 0, Errors: 0, Skipped: 0, Time elapsed: 81.721 sec - in org.apache.sysml.test.integration.applications.dml.NaiveBayesParforDMLTest
Running org.apache.sysml.test.integration.applications.pydml.L2SVMPyDMLTest
Tests run: 9, Failures: 0, Errors: 0, Skipped: 0, Time elapsed: 64.984 sec - in org.apache.sysml.test.integration.applications.pydml.L2SVMPyDMLTest
Running org.apache.sysml.test.integration.applications.pydml.LinearRegressionPyDMLTest
Tests run: 7, Failures: 0, Errors: 0, Skipped: 0, Time elapsed: 52.439 sec - in org.apache.sysml.test.integration.applications.pydml.LinearRegressionPyDMLTest
Running org.apache.sysml.test.integration.applications.dml.LinearLogRegDMLTest
Tests run: 7, Failures: 0, Errors: 0, Skipped: 0, Time elapsed: 62.07 sec - in org.apache.sysml.test.integration.applications.dml.LinearLogRegDMLTest
Running org.apache.sysml.test.integration.applications.dml.GNMFDMLTest
Tests run: 3, Failures: 0, Errors: 0, Skipped: 0, Time elapsed: 65.451 sec - in org.apache.sysml.test.integration.applications.dml.GNMFDMLTest
Running org.apache.sysml.test.integration.applications.dml.WelchTDMLTest
Tests run: 3, Failures: 0, Errors: 0, Skipped: 0, Time elapsed: 6.6 sec - in org.apache.sysml.test.integration.applications.dml.WelchTDMLTest
Running org.apache.sysml.test.integration.applications.dml.ApplyTransformDMLTest
Tests run: 7, Failures: 0, Errors: 0, Skipped: 0, Time elapsed: 9.882 sec - in org.apache.sysml.test.integration.applications.dml.ApplyTransformDMLTest
Running org.apache.sysml.test.integration.applications.pydml.ID3PyDMLTest
Tests run: 2, Failures: 0, Errors: 0, Skipped: 0, Time elapsed: 328.599 sec - in org.apache.sysml.test.integration.applications.pydml.ID3PyDMLTest
Running org.apache.sysml.test.integration.applications.pydml.GNMFPyDMLTest
Tests run: 3, Failures: 0, Errors: 0, Skipped: 0, Time elapsed: 59.483 sec - in org.apache.sysml.test.integration.applications.pydml.GNMFPyDMLTest

Results :

Tests in error: 
  FrameCopyTest.testFrameMixedStringsCBind:57->runFrameCopyTest:178 Runtime java...
  FrameCopyTest.testFrameMixedMixedCBind:67->runFrameCopyTest:178 Runtime java.l...
  FrameCopyTest.testFrameMixedMixedRBind:72->runFrameCopyTest:178 Runtime java.l...
  FrameCopyTest.testFrameStringsMixedCBind:62->runFrameCopyTest:178 Runtime java...
  FrameCopyTest.testFrameStringsStringsCBind:47->runFrameCopyTest:178 Runtime ja...
  FrameCopyTest.testFrameStringsStringsRBind:52->runFrameCopyTest:178 Runtime ja...

Tests run: 4856, Failures: 0, Errors: 6, Skipped: 0

[INFO] 
[INFO] --- maven-failsafe-plugin:2.17:verify (default) @ systemml ---
[INFO] Failsafe report directory: <https://sparktc.ibmcloud.com/jenkins/job/SystemML-DailyTest/ws/target/failsafe-reports>
[INFO] ------------------------------------------------------------------------
[INFO] BUILD FAILURE
[INFO] ------------------------------------------------------------------------
[INFO] Total time: 02:17 h
[INFO] Finished at: 2016-03-23T16:52:51-05:00
[INFO] Final Memory: 66M/2084M
[INFO] ------------------------------------------------------------------------
[ERROR] Failed to execute goal org.apache.maven.plugins:maven-failsafe-plugin:2.17:verify
(default) on project systemml: There are test failures.
[ERROR] 
[ERROR] Please refer to <https://sparktc.ibmcloud.com/jenkins/job/SystemML-DailyTest/ws/target/failsafe-reports>
for the individual test results.
[ERROR] -> [Help 1]
[ERROR] 
[ERROR] To see the full stack trace of the errors, re-run Maven with the -e switch.
[ERROR] Re-run Maven using the -X switch to enable full debug logging.
[ERROR] 
[ERROR] For more information about the errors and possible solutions, please read the following
articles:
[ERROR] [Help 1] http://cwiki.apache.org/confluence/display/MAVEN/MojoFailureException
Build step 'Execute shell' marked build as failure
Run condition [Always] enabling perform for step [[]]

Mime
View raw message