synapse-dev mailing list archives

Site index · List index
Message view « Date » · « Thread »
Top « Date » · « Thread »
From Apache Jenkins Server <jenk...@builds.apache.org>
Subject Build failed in Jenkins: Synapse - Trunk #5411
Date Wed, 21 Aug 2019 17:12:18 GMT
See <https://builds.apache.org/job/Synapse%20-%20Trunk/5411/display/redirect>

------------------------------------------
[...truncated 453.86 KB...]
[INFO] Downloading: https://maven.wso2.org/nexus/content/groups/wso2-public/org/wso2/uri/template/wso2-uri-templates/1.0.0/wso2-uri-templates-1.0.0.jar
[INFO] Downloaded: https://maven.wso2.org/nexus/content/groups/wso2-public/org/wso2/caching/wso2caching-core/3.5.0/wso2caching-core-3.5.0.jar
(26 kB at 14 kB/s)
[INFO] Downloading: https://maven.wso2.org/nexus/content/groups/wso2-public/xalan/xalan/2.7.1/xalan-2.7.1.jar
[INFO] Downloaded: https://maven.wso2.org/nexus/content/groups/wso2-public/org/apache/tomcat/tribes/6.0.16/tribes-6.0.16.jar
(228 kB at 104 kB/s)
[INFO] Downloading: https://maven.wso2.org/nexus/content/groups/wso2-public/xalan/serializer/2.7.1/serializer-2.7.1.jar
[INFO] Downloaded: https://maven.wso2.org/nexus/content/groups/wso2-public/logkit/logkit/1.0.1/logkit-1.0.1.jar
(72 kB at 26 kB/s)
[INFO] Downloading: https://maven.wso2.org/nexus/content/groups/wso2-public/net/sf/saxon/saxon/8.9/saxon-8.9.jar
[INFO] Downloaded: https://maven.wso2.org/nexus/content/groups/wso2-public/org/wso2/uri/template/wso2-uri-templates/1.0.0/wso2-uri-templates-1.0.0.jar
(18 kB at 5.7 kB/s)
[INFO] Downloading: https://maven.wso2.org/nexus/content/groups/wso2-public/net/sf/saxon/saxon-dom/8.9/saxon-dom-8.9.jar
[INFO] Downloaded: https://maven.wso2.org/nexus/content/groups/wso2-public/avalon-framework/avalon-framework/4.1.3/avalon-framework-4.1.3.jar
(64 kB at 21 kB/s)
[INFO] Downloading: https://maven.wso2.org/nexus/content/groups/wso2-public/org/apache/axis2/axis2-transport-jms/1.7.7/axis2-transport-jms-1.7.7.jar
[INFO] Downloaded: https://maven.wso2.org/nexus/content/groups/wso2-public/xalan/serializer/2.7.1/serializer-2.7.1.jar
(278 kB at 67 kB/s)
[INFO] Downloading: https://maven.wso2.org/nexus/content/groups/wso2-public/org/apache/geronimo/specs/geronimo-jms_1.1_spec/1.1/geronimo-jms_1.1_spec-1.1.jar
[INFO] Downloaded: https://maven.wso2.org/nexus/content/groups/wso2-public/net/sf/saxon/saxon-dom/8.9/saxon-dom-8.9.jar
(90 kB at 20 kB/s)
[INFO] Downloading: https://maven.wso2.org/nexus/content/groups/wso2-public/org/apache/geronimo/specs/geronimo-jta_1.0.1B_spec/1.0/geronimo-jta_1.0.1B_spec-1.0.jar
[INFO] Downloaded: https://maven.wso2.org/nexus/content/groups/wso2-public/org/apache/axis2/axis2-transport-jms/1.7.7/axis2-transport-jms-1.7.7.jar
(80 kB at 17 kB/s)
[INFO] Downloading: https://maven.wso2.org/nexus/content/groups/wso2-public/org/apache/derby/derby/10.4.2.0/derby-10.4.2.0.jar
[INFO] Downloaded: https://maven.wso2.org/nexus/content/groups/wso2-public/xalan/xalan/2.7.1/xalan-2.7.1.jar
(3.2 MB at 663 kB/s)
[INFO] Downloading: https://maven.wso2.org/nexus/content/groups/wso2-public/org/apache/axis2/axis2-transport-mail/1.7.7/axis2-transport-mail-1.7.7.jar
[INFO] Downloaded: https://maven.wso2.org/nexus/content/groups/wso2-public/org/apache/geronimo/specs/geronimo-jms_1.1_spec/1.1/geronimo-jms_1.1_spec-1.1.jar
(32 kB at 5.9 kB/s)
[INFO] Downloading: https://maven.wso2.org/nexus/content/groups/wso2-public/javax/mail/mail/1.4.1/mail-1.4.1.jar
[INFO] Downloaded: https://maven.wso2.org/nexus/content/groups/wso2-public/org/apache/geronimo/specs/geronimo-jta_1.0.1B_spec/1.0/geronimo-jta_1.0.1B_spec-1.0.jar
(11 kB at 2.0 kB/s)
[INFO] Downloading: https://maven.wso2.org/nexus/content/groups/wso2-public/org/apache/axis2/axis2-transport-local/1.7.7/axis2-transport-local-1.7.7.jar
[INFO] Downloaded: https://maven.wso2.org/nexus/content/groups/wso2-public/net/sf/saxon/saxon/8.9/saxon-8.9.jar
(3.7 MB at 656 kB/s)
[INFO] Downloading: https://maven.wso2.org/nexus/content/groups/wso2-public/org/apache/axis2/axis2-json/1.7.7/axis2-json-1.7.7.jar
[INFO] Downloaded: https://maven.wso2.org/nexus/content/groups/wso2-public/org/apache/axis2/axis2-transport-mail/1.7.7/axis2-transport-mail-1.7.7.jar
(42 kB at 6.8 kB/s)
[INFO] Downloading: https://maven.wso2.org/nexus/content/groups/wso2-public/org/codehaus/jettison/jettison/1.3.8/jettison-1.3.8.jar
[INFO] Downloaded: https://maven.wso2.org/nexus/content/groups/wso2-public/org/apache/axis2/axis2-transport-local/1.7.7/axis2-transport-local-1.7.7.jar
(17 kB at 2.5 kB/s)
[INFO] Downloading: https://maven.wso2.org/nexus/content/groups/wso2-public/com/google/code/gson/gson/2.1/gson-2.1.jar
[INFO] Downloaded: https://maven.wso2.org/nexus/content/groups/wso2-public/org/apache/axis2/axis2-json/1.7.7/axis2-json-1.7.7.jar
(53 kB at 7.4 kB/s)
[INFO] Downloading: https://maven.wso2.org/nexus/content/groups/wso2-public/org/apache/ws/commons/axiom/axiom-dom/1.2.20/axiom-dom-1.2.20.jar
[INFO] Downloaded: https://maven.wso2.org/nexus/content/groups/wso2-public/javax/mail/mail/1.4.1/mail-1.4.1.jar
(448 kB at 59 kB/s)
[INFO] Downloading: https://maven.wso2.org/nexus/content/groups/wso2-public/org/apache/axis2/axis2-adb/1.7.7/axis2-adb-1.7.7.jar
[INFO] Downloaded: https://maven.wso2.org/nexus/content/groups/wso2-public/org/codehaus/jettison/jettison/1.3.8/jettison-1.3.8.jar
(88 kB at 11 kB/s)
[INFO] Downloaded: https://maven.wso2.org/nexus/content/groups/wso2-public/org/apache/derby/derby/10.4.2.0/derby-10.4.2.0.jar
(2.4 MB at 319 kB/s)
[INFO] Downloaded: https://maven.wso2.org/nexus/content/groups/wso2-public/com/google/code/gson/gson/2.1/gson-2.1.jar
(180 kB at 20 kB/s)
[INFO] Downloaded: https://maven.wso2.org/nexus/content/groups/wso2-public/org/apache/ws/commons/axiom/axiom-dom/1.2.20/axiom-dom-1.2.20.jar
(716 kB at 74 kB/s)
[INFO] Downloaded: https://maven.wso2.org/nexus/content/groups/wso2-public/org/apache/axis2/axis2-adb/1.7.7/axis2-adb-1.7.7.jar
(654 kB at 66 kB/s)
[INFO] 
[INFO] --- maven-clean-plugin:2.4.1:clean (default-clean) @ synapse-core ---
[INFO] 
[INFO] --- maven-remote-resources-plugin:1.5:process (process-resource-bundles) @ synapse-core
---
[INFO] 
[INFO] --- maven-resources-plugin:2.5:resources (default-resources) @ synapse-core ---
[debug] execute contextualize
[INFO] Using 'UTF-8' encoding to copy filtered resources.
[INFO] Copying 1 resource
[INFO] Copying 3 resources
[INFO] 
[INFO] --- maven-compiler-plugin:3.5.1:compile (default-compile) @ synapse-core ---
[INFO] Changes detected - recompiling the module!
[INFO] Compiling 517 source files to <https://builds.apache.org/job/Synapse%20-%20Trunk/ws/modules/core/target/classes>
[INFO] <https://builds.apache.org/job/Synapse%20-%20Trunk/ws/modules/core/src/main/java/org/apache/synapse/core/SynapseEnvironment.java>:
Some input files use or override a deprecated API.
[INFO] <https://builds.apache.org/job/Synapse%20-%20Trunk/ws/modules/core/src/main/java/org/apache/synapse/core/SynapseEnvironment.java>:
Recompile with -Xlint:deprecation for details.
[INFO] <https://builds.apache.org/job/Synapse%20-%20Trunk/ws/modules/core/src/main/java/org/apache/synapse/eventing/SynapseEventSource.java>:
Some input files use unchecked or unsafe operations.
[INFO] <https://builds.apache.org/job/Synapse%20-%20Trunk/ws/modules/core/src/main/java/org/apache/synapse/eventing/SynapseEventSource.java>:
Recompile with -Xlint:unchecked for details.
[INFO] 
[INFO] --- maven-dependency-plugin:2.4:copy (copy) @ synapse-core ---
[INFO] Configured Artifact: org.apache.axis2:addressing:1.7.7:mar
[INFO] Copying addressing-1.7.7.mar to <https://builds.apache.org/job/Synapse%20-%20Trunk/ws/modules/core/target/test_repos/synapse/modules/addressing-1.7.7.mar>
[INFO] 
[INFO] --- maven-assembly-plugin:2.6:attached (test-library-assembly) @ synapse-core ---
[INFO] Reading assembly descriptor: src/test/resources/synapse-libraries/assembly/assemble-lib.xml
[INFO] Building zip: <https://builds.apache.org/job/Synapse%20-%20Trunk/ws/modules/core/target/synapse-test-lib.zip>
[INFO] 
[INFO] --- maven-assembly-plugin:2.6:attached (eip-library-assembly) @ synapse-core ---
[INFO] Reading assembly descriptor: src/test/resources/synapse-libraries/assembly/assemble-eiptest-lib.xml
[INFO] Building zip: <https://builds.apache.org/job/Synapse%20-%20Trunk/ws/modules/core/target/synapse-eiptest-lib.zip>
[INFO] 
[INFO] --- maven-assembly-plugin:2.6:attached (eipcore-library-assembly) @ synapse-core ---
[INFO] Reading assembly descriptor: src/test/resources/synapse-libraries/assembly/assemble-eipcore-lib.xml
[INFO] Building zip: <https://builds.apache.org/job/Synapse%20-%20Trunk/ws/modules/core/target/synapse-eipcore-lib.zip>
[INFO] 
[INFO] --- maven-antrun-plugin:1.7:run (create_repo) @ synapse-core ---
[INFO] Downloading: https://repo.maven.apache.org/maven2/org/apache/maven/maven-plugin-api/2.0.11/maven-plugin-api-2.0.11.pom
[INFO] Downloaded: https://repo.maven.apache.org/maven2/org/apache/maven/maven-plugin-api/2.0.11/maven-plugin-api-2.0.11.pom
(1.5 kB at 98 kB/s)
[INFO] Downloading: https://repo.maven.apache.org/maven2/org/apache/maven/maven/2.0.11/maven-2.0.11.pom
[INFO] Downloaded: https://repo.maven.apache.org/maven2/org/apache/maven/maven/2.0.11/maven-2.0.11.pom
(22 kB at 1.7 MB/s)
[INFO] Downloading: https://repo.maven.apache.org/maven2/org/apache/maven/maven-parent/12/maven-parent-12.pom
[INFO] Downloaded: https://repo.maven.apache.org/maven2/org/apache/maven/maven-parent/12/maven-parent-12.pom
(22 kB at 1.2 MB/s)
[INFO] Downloading: https://repo.maven.apache.org/maven2/org/apache/maven/maven-project/2.0.11/maven-project-2.0.11.pom
[INFO] Downloaded: https://repo.maven.apache.org/maven2/org/apache/maven/maven-project/2.0.11/maven-project-2.0.11.pom
(2.8 kB at 252 kB/s)
[INFO] Downloading: https://repo.maven.apache.org/maven2/org/apache/maven/maven-settings/2.0.11/maven-settings-2.0.11.pom
[INFO] Downloaded: https://repo.maven.apache.org/maven2/org/apache/maven/maven-settings/2.0.11/maven-settings-2.0.11.pom
(2.2 kB at 198 kB/s)
[INFO] Downloading: https://repo.maven.apache.org/maven2/org/apache/maven/maven-model/2.0.11/maven-model-2.0.11.pom
[INFO] Downloaded: https://repo.maven.apache.org/maven2/org/apache/maven/maven-model/2.0.11/maven-model-2.0.11.pom
(3.2 kB at 232 kB/s)
[INFO] Downloading: https://repo.maven.apache.org/maven2/org/apache/maven/maven-profile/2.0.11/maven-profile-2.0.11.pom
[INFO] Downloaded: https://repo.maven.apache.org/maven2/org/apache/maven/maven-profile/2.0.11/maven-profile-2.0.11.pom
(2.0 kB at 170 kB/s)
[INFO] Downloading: https://repo.maven.apache.org/maven2/org/apache/maven/maven-artifact-manager/2.0.11/maven-artifact-manager-2.0.11.pom
[INFO] Downloaded: https://repo.maven.apache.org/maven2/org/apache/maven/maven-artifact-manager/2.0.11/maven-artifact-manager-2.0.11.pom
(2.6 kB at 239 kB/s)
[INFO] Downloading: https://repo.maven.apache.org/maven2/org/apache/maven/maven-repository-metadata/2.0.11/maven-repository-metadata-2.0.11.pom
[INFO] Downloaded: https://repo.maven.apache.org/maven2/org/apache/maven/maven-repository-metadata/2.0.11/maven-repository-metadata-2.0.11.pom
(2.3 kB at 188 kB/s)
[INFO] Downloading: https://repo.maven.apache.org/maven2/org/apache/maven/maven-artifact/2.0.11/maven-artifact-2.0.11.pom
[INFO] Downloaded: https://repo.maven.apache.org/maven2/org/apache/maven/maven-artifact/2.0.11/maven-artifact-2.0.11.pom
(1.6 kB at 144 kB/s)
[INFO] Downloading: https://repo.maven.apache.org/maven2/org/apache/maven/maven-plugin-registry/2.0.11/maven-plugin-registry-2.0.11.pom
[INFO] Downloaded: https://repo.maven.apache.org/maven2/org/apache/maven/maven-plugin-registry/2.0.11/maven-plugin-registry-2.0.11.pom
(1.9 kB at 176 kB/s)
[INFO] Downloading: https://repo.maven.apache.org/maven2/org/apache/ant/ant/1.8.2/ant-1.8.2.pom
[INFO] Downloaded: https://repo.maven.apache.org/maven2/org/apache/ant/ant/1.8.2/ant-1.8.2.pom
(9.9 kB at 898 kB/s)
[INFO] Downloading: https://repo.maven.apache.org/maven2/org/apache/ant/ant-parent/1.8.2/ant-parent-1.8.2.pom
[INFO] Downloaded: https://repo.maven.apache.org/maven2/org/apache/ant/ant-parent/1.8.2/ant-parent-1.8.2.pom
(4.7 kB at 426 kB/s)
[INFO] Downloading: https://repo.maven.apache.org/maven2/org/apache/ant/ant-launcher/1.8.2/ant-launcher-1.8.2.pom
[INFO] Downloaded: https://repo.maven.apache.org/maven2/org/apache/ant/ant-launcher/1.8.2/ant-launcher-1.8.2.pom
(2.4 kB at 220 kB/s)
[INFO] Downloading: https://repo.maven.apache.org/maven2/org/apache/maven/maven-plugin-api/2.0.11/maven-plugin-api-2.0.11.jar
[INFO] Downloading: https://repo.maven.apache.org/maven2/org/apache/maven/maven-project/2.0.11/maven-project-2.0.11.jar
[INFO] Downloading: https://repo.maven.apache.org/maven2/org/apache/maven/maven-settings/2.0.11/maven-settings-2.0.11.jar
[INFO] Downloading: https://repo.maven.apache.org/maven2/org/apache/maven/maven-profile/2.0.11/maven-profile-2.0.11.jar
[INFO] Downloading: https://repo.maven.apache.org/maven2/org/apache/maven/maven-model/2.0.11/maven-model-2.0.11.jar
[INFO] Downloaded: https://repo.maven.apache.org/maven2/org/apache/maven/maven-plugin-api/2.0.11/maven-plugin-api-2.0.11.jar
(13 kB at 934 kB/s)
[INFO] Downloading: https://repo.maven.apache.org/maven2/org/apache/maven/maven-artifact-manager/2.0.11/maven-artifact-manager-2.0.11.jar
[INFO] Downloaded: https://repo.maven.apache.org/maven2/org/apache/maven/maven-settings/2.0.11/maven-settings-2.0.11.jar
(51 kB at 2.9 MB/s)
[INFO] Downloading: https://repo.maven.apache.org/maven2/org/apache/maven/maven-repository-metadata/2.0.11/maven-repository-metadata-2.0.11.jar
[INFO] Downloaded: https://repo.maven.apache.org/maven2/org/apache/maven/maven-profile/2.0.11/maven-profile-2.0.11.jar
(37 kB at 1.9 MB/s)
[INFO] Downloading: https://repo.maven.apache.org/maven2/org/apache/maven/maven-plugin-registry/2.0.11/maven-plugin-registry-2.0.11.jar
[INFO] Downloaded: https://repo.maven.apache.org/maven2/org/apache/maven/maven-model/2.0.11/maven-model-2.0.11.jar
(97 kB at 4.4 MB/s)
[INFO] Downloading: https://repo.maven.apache.org/maven2/org/codehaus/plexus/plexus-interpolation/1.1/plexus-interpolation-1.1.jar
[INFO] Downloaded: https://repo.maven.apache.org/maven2/org/apache/maven/maven-artifact-manager/2.0.11/maven-artifact-manager-2.0.11.jar
(58 kB at 2.2 MB/s)
[INFO] Downloading: https://repo.maven.apache.org/maven2/org/apache/maven/maven-artifact/2.0.11/maven-artifact-2.0.11.jar
[INFO] Downloaded: https://repo.maven.apache.org/maven2/org/apache/maven/maven-repository-metadata/2.0.11/maven-repository-metadata-2.0.11.jar
(26 kB at 938 kB/s)
[INFO] Downloading: https://repo.maven.apache.org/maven2/org/apache/ant/ant/1.8.2/ant-1.8.2.jar
[INFO] Downloaded: https://repo.maven.apache.org/maven2/org/apache/maven/maven-plugin-registry/2.0.11/maven-plugin-registry-2.0.11.jar
(31 kB at 1.0 MB/s)
[INFO] Downloading: https://repo.maven.apache.org/maven2/org/apache/ant/ant-launcher/1.8.2/ant-launcher-1.8.2.jar
[INFO] Downloaded: https://repo.maven.apache.org/maven2/org/codehaus/plexus/plexus-interpolation/1.1/plexus-interpolation-1.1.jar
(35 kB at 1.0 MB/s)
[INFO] Downloaded: https://repo.maven.apache.org/maven2/org/apache/maven/maven-artifact/2.0.11/maven-artifact-2.0.11.jar
(90 kB at 2.1 MB/s)
[INFO] Downloaded: https://repo.maven.apache.org/maven2/org/apache/ant/ant-launcher/1.8.2/ant-launcher-1.8.2.jar
(12 kB at 293 kB/s)
[INFO] Downloaded: https://repo.maven.apache.org/maven2/org/apache/maven/maven-project/2.0.11/maven-project-2.0.11.jar
(123 kB at 1.8 MB/s)
[INFO] Downloaded: https://repo.maven.apache.org/maven2/org/apache/ant/ant/1.8.2/ant-1.8.2.jar
(1.9 MB at 13 MB/s)
[WARNING] Parameter tasks is deprecated, use target instead
[INFO] Executing tasks

main:
     [echo] *** Creating a testing repository ***
    [mkdir] Created dir: <https://builds.apache.org/job/Synapse%20-%20Trunk/ws/modules/core/target/test_repos/synapse/services>
    [mkdir] Created dir: <https://builds.apache.org/job/Synapse%20-%20Trunk/ws/modules/core/target/test_repos/client/modules>
    [mkdir] Created dir: <https://builds.apache.org/job/Synapse%20-%20Trunk/ws/modules/core/target/test_repos/synapse/synapse-libraries>
    [mkdir] Created dir: <https://builds.apache.org/job/Synapse%20-%20Trunk/ws/modules/core/target/library_repos>
     [copy] Copying 1 file to <https://builds.apache.org/job/Synapse%20-%20Trunk/ws/modules/core/target/test_repos/synapse/synapse-libraries>
     [copy] Copying 1 file to <https://builds.apache.org/job/Synapse%20-%20Trunk/ws/modules/core/target/test_repos/synapse/synapse-libraries>
     [copy] Copying 1 file to <https://builds.apache.org/job/Synapse%20-%20Trunk/ws/modules/core/target/library_repos>
[INFO] Executed tasks
[INFO] 
[INFO] --- maven-resources-plugin:2.5:testResources (default-testResources) @ synapse-core
---
[debug] execute contextualize
[INFO] Using 'UTF-8' encoding to copy filtered resources.
[INFO] Copying 57 resources
[INFO] Copying 3 resources
[INFO] 
[INFO] --- maven-compiler-plugin:3.5.1:testCompile (default-testCompile) @ synapse-core ---
[INFO] Changes detected - recompiling the module!
[INFO] Compiling 126 source files to <https://builds.apache.org/job/Synapse%20-%20Trunk/ws/modules/core/target/test-classes>
[INFO] <https://builds.apache.org/job/Synapse%20-%20Trunk/ws/modules/core/src/test/java/org/apache/synapse/util/TextFileDataSourceTest.java>:
Some input files use or override a deprecated API.
[INFO] <https://builds.apache.org/job/Synapse%20-%20Trunk/ws/modules/core/src/test/java/org/apache/synapse/util/TextFileDataSourceTest.java>:
Recompile with -Xlint:deprecation for details.
[INFO] <https://builds.apache.org/job/Synapse%20-%20Trunk/ws/modules/core/src/test/java/org/apache/synapse/rest/RESTMediationTestCase.java>:
Some input files use unchecked or unsafe operations.
[INFO] <https://builds.apache.org/job/Synapse%20-%20Trunk/ws/modules/core/src/test/java/org/apache/synapse/rest/RESTMediationTestCase.java>:
Recompile with -Xlint:unchecked for details.
[INFO] Some messages have been simplified; recompile with -Xdiags:verbose to get full output
[INFO] -------------------------------------------------------------
[ERROR] COMPILATION ERROR : 
[INFO] -------------------------------------------------------------
[ERROR] <https://builds.apache.org/job/Synapse%20-%20Trunk/ws/modules/core/src/test/java/org/apache/synapse/util/MessageHelperTest.java>:[55,24]
incompatible types: java.lang.String cannot be converted to org.apache.axis2.addressing.EndpointReference
[INFO] 1 error
[INFO] -------------------------------------------------------------
[INFO] ------------------------------------------------------------------------
[INFO] Reactor Summary:
[INFO] 
[INFO] Apache Synapse ..................................... SUCCESS [03:30 min]
[INFO] Apache Synapse - Secure Vault ...................... SUCCESS [ 53.579 s]
[INFO] Apache Synapse - Commons ........................... SUCCESS [01:03 min]
[INFO] Apache Synapse - Transports ........................ SUCCESS [ 34.654 s]
[INFO] Apache Synapse - Non-blocking HTTP/s Transport ..... SUCCESS [ 46.588 s]
[INFO] Apache Synapse - PIPE Transport .................... SUCCESS [  8.696 s]
[INFO] Apache Synapse - VFS Transport ..................... SUCCESS [ 20.962 s]
[INFO] Apache Synapse - FIX Transport ..................... SUCCESS [ 21.763 s]
[INFO] Apache Synapse - AMQP Transport .................... SUCCESS [ 17.272 s]
[INFO] Apache Synapse - Tasks ............................. SUCCESS [ 13.168 s]
[INFO] Apache Synapse - Core .............................. FAILURE [ 35.413 s]
[INFO] Apache Synapse - Extensions ........................ SKIPPED
[INFO] Apache Synapse - Samples ........................... SKIPPED
[INFO] Apache Synapse - Patches ........................... SKIPPED
[INFO] Apache Synapse - Experimental code ................. SKIPPED
[INFO] Apache Synapse ..................................... SKIPPED
[INFO] Apache Synapse - Web Application ................... SKIPPED
[INFO] Apache Synapse - Handler Module .................... SKIPPED
[INFO] Apache Synapse - XAR Maven Plugin .................. SKIPPED
[INFO] Apache Synapse - Configuration Migrator ............ SKIPPED
[INFO] Apache Synapse - Distribution ...................... SKIPPED
[INFO] Apache Synapse - Package skeleton ZIP .............. SKIPPED
[INFO] Apache Synapse - Package archetype ................. SKIPPED
[INFO] Apache Synapse - Integration ....................... SKIPPED
[INFO] ------------------------------------------------------------------------
[INFO] BUILD FAILURE
[INFO] ------------------------------------------------------------------------
[INFO] Total time: 10:02 min
[INFO] Finished at: 2019-08-21T17:11:33Z
[INFO] Final Memory: 107M/496M
[INFO] ------------------------------------------------------------------------
Waiting for Jenkins to finish collecting data
[ERROR] Failed to execute goal org.apache.maven.plugins:maven-compiler-plugin:3.5.1:testCompile
(default-testCompile) on project synapse-core: Compilation failure
[ERROR] <https://builds.apache.org/job/Synapse%20-%20Trunk/ws/modules/core/src/test/java/org/apache/synapse/util/MessageHelperTest.java>:[55,24]
incompatible types: java.lang.String cannot be converted to org.apache.axis2.addressing.EndpointReference
[ERROR] -> [Help 1]
[ERROR] 
[ERROR] To see the full stack trace of the errors, re-run Maven with the -e switch.
[ERROR] Re-run Maven using the -X switch to enable full debug logging.
[ERROR] 
[ERROR] For more information about the errors and possible solutions, please read the following
articles:
[ERROR] [Help 1] http://cwiki.apache.org/confluence/display/MAVEN/MojoFailureException
[ERROR] 
[ERROR] After correcting the problems, you can resume the build with the command
[ERROR]   mvn <goals> -rf :synapse-core
[JENKINS] Archiving <https://builds.apache.org/job/Synapse%20-%20Trunk/ws/modules/transports/optional/fix/pom.xml>
to org.apache.synapse/synapse-fix-transport/3.0.2-SNAPSHOT/synapse-fix-transport-3.0.2-SNAPSHOT.pom
[JENKINS] Archiving <https://builds.apache.org/job/Synapse%20-%20Trunk/ws/modules/transports/optional/fix/target/synapse-fix-transport-3.0.2-SNAPSHOT.jar>
to org.apache.synapse/synapse-fix-transport/3.0.2-SNAPSHOT/synapse-fix-transport-3.0.2-SNAPSHOT.jar
[JENKINS] Archiving <https://builds.apache.org/job/Synapse%20-%20Trunk/ws/modules/securevault/pom.xml>
to org.apache.synapse/synapse-securevault/3.0.2-SNAPSHOT/synapse-securevault-3.0.2-SNAPSHOT.pom
[JENKINS] Archiving <https://builds.apache.org/job/Synapse%20-%20Trunk/ws/modules/securevault/target/synapse-securevault-3.0.2-SNAPSHOT.jar>
to org.apache.synapse/synapse-securevault/3.0.2-SNAPSHOT/synapse-securevault-3.0.2-SNAPSHOT.jar
[JENKINS] Archiving <https://builds.apache.org/job/Synapse%20-%20Trunk/ws/modules/transports/pom.xml>
to org.apache.synapse/synapse-transports/3.0.2-SNAPSHOT/synapse-transports-3.0.2-SNAPSHOT.pom
[JENKINS] Archiving <https://builds.apache.org/job/Synapse%20-%20Trunk/ws/modules/documentation/pom.xml>
to org.apache.synapse/synapse-documentation/3.0.2-SNAPSHOT/synapse-documentation-3.0.2-SNAPSHOT.pom
[JENKINS] Archiving <https://builds.apache.org/job/Synapse%20-%20Trunk/ws/modules/migrator/pom.xml>
to org.apache.synapse/synapse-config-migrator/3.0.2-SNAPSHOT/synapse-config-migrator-3.0.2-SNAPSHOT.pom
[JENKINS] Archiving <https://builds.apache.org/job/Synapse%20-%20Trunk/ws/modules/commons/pom.xml>
to org.apache.synapse/synapse-commons/3.0.2-SNAPSHOT/synapse-commons-3.0.2-SNAPSHOT.pom
[JENKINS] Archiving <https://builds.apache.org/job/Synapse%20-%20Trunk/ws/modules/commons/target/synapse-commons-3.0.2-SNAPSHOT.jar>
to org.apache.synapse/synapse-commons/3.0.2-SNAPSHOT/synapse-commons-3.0.2-SNAPSHOT.jar
[JENKINS] Archiving <https://builds.apache.org/job/Synapse%20-%20Trunk/ws/modules/samples/pom.xml>
to org.apache.synapse/synapse-samples/3.0.2-SNAPSHOT/synapse-samples-3.0.2-SNAPSHOT.pom
[JENKINS] Archiving <https://builds.apache.org/job/Synapse%20-%20Trunk/ws/modules/war/pom.xml>
to org.apache.synapse/synapse-war/3.0.2-SNAPSHOT/synapse-war-3.0.2-SNAPSHOT.pom
[JENKINS] Archiving <https://builds.apache.org/job/Synapse%20-%20Trunk/ws/pom.xml> to
org.apache.synapse/Apache-Synapse/3.0.2-SNAPSHOT/Apache-Synapse-3.0.2-SNAPSHOT.pom
[Fast Archiver] Compressed 56.01 KB of artifacts by 57.1% relative to #5408
[JENKINS] Archiving <https://builds.apache.org/job/Synapse%20-%20Trunk/ws/modules/extensions/pom.xml>
to org.apache.synapse/synapse-extensions/3.0.2-SNAPSHOT/synapse-extensions-3.0.2-SNAPSHOT.pom
[JENKINS] Archiving <https://builds.apache.org/job/Synapse%20-%20Trunk/ws/modules/handler/pom.xml>
to org.apache.synapse/synapse-handler/3.0.2-SNAPSHOT/synapse-handler-3.0.2-SNAPSHOT.pom
[JENKINS] Archiving <https://builds.apache.org/job/Synapse%20-%20Trunk/ws/modules/xar-maven-plugin/pom.xml>
to org.apache.synapse/synapse-xar-maven-plugin/3.0.2-SNAPSHOT/synapse-xar-maven-plugin-3.0.2-SNAPSHOT.pom
[JENKINS] Archiving <https://builds.apache.org/job/Synapse%20-%20Trunk/ws/modules/tasks/pom.xml>
to org.apache.synapse/synapse-tasks/3.0.2-SNAPSHOT/synapse-tasks-3.0.2-SNAPSHOT.pom
[JENKINS] Archiving <https://builds.apache.org/job/Synapse%20-%20Trunk/ws/modules/tasks/target/synapse-tasks-3.0.2-SNAPSHOT.jar>
to org.apache.synapse/synapse-tasks/3.0.2-SNAPSHOT/synapse-tasks-3.0.2-SNAPSHOT.jar
[JENKINS] Archiving <https://builds.apache.org/job/Synapse%20-%20Trunk/ws/modules/packaging/package-archetype/pom.xml>
to org.apache.synapse/synapse-package-archetype/3.0.2-SNAPSHOT/synapse-package-archetype-3.0.2-SNAPSHOT.pom
[JENKINS] Archiving <https://builds.apache.org/job/Synapse%20-%20Trunk/ws/modules/transports/core/nhttp/pom.xml>
to org.apache.synapse/synapse-nhttp-transport/3.0.2-SNAPSHOT/synapse-nhttp-transport-3.0.2-SNAPSHOT.pom
[JENKINS] Archiving <https://builds.apache.org/job/Synapse%20-%20Trunk/ws/modules/transports/core/nhttp/target/synapse-nhttp-transport-3.0.2-SNAPSHOT.jar>
to org.apache.synapse/synapse-nhttp-transport/3.0.2-SNAPSHOT/synapse-nhttp-transport-3.0.2-SNAPSHOT.jar
[JENKINS] Archiving <https://builds.apache.org/job/Synapse%20-%20Trunk/ws/modules/transports/core/nhttp/target/synapse-nhttp-transport-3.0.2-SNAPSHOT-testkit-logs.zip>
to org.apache.synapse/synapse-nhttp-transport/3.0.2-SNAPSHOT/synapse-nhttp-transport-3.0.2-SNAPSHOT-testkit-logs.zip
[JENKINS] Archiving <https://builds.apache.org/job/Synapse%20-%20Trunk/ws/modules/transports/core/vfs/pom.xml>
to org.apache.synapse/synapse-vfs-transport/3.0.2-SNAPSHOT/synapse-vfs-transport-3.0.2-SNAPSHOT.pom
[JENKINS] Archiving <https://builds.apache.org/job/Synapse%20-%20Trunk/ws/modules/transports/core/vfs/target/synapse-vfs-transport-3.0.2-SNAPSHOT.jar>
to org.apache.synapse/synapse-vfs-transport/3.0.2-SNAPSHOT/synapse-vfs-transport-3.0.2-SNAPSHOT.jar
[JENKINS] Archiving <https://builds.apache.org/job/Synapse%20-%20Trunk/ws/modules/transports/core/vfs/target/synapse-vfs-transport-3.0.2-SNAPSHOT-testkit-logs.zip>
to org.apache.synapse/synapse-vfs-transport/3.0.2-SNAPSHOT/synapse-vfs-transport-3.0.2-SNAPSHOT-testkit-logs.zip
[JENKINS] Archiving <https://builds.apache.org/job/Synapse%20-%20Trunk/ws/modules/packaging/package-skeleton/pom.xml>
to org.apache.synapse/synapse-package-skeleton/3.0.2-SNAPSHOT/synapse-package-skeleton-3.0.2-SNAPSHOT.pom
[JENKINS] Archiving <https://builds.apache.org/job/Synapse%20-%20Trunk/ws/modules/integration/pom.xml>
to org.apache.synapse/synapse-integration/3.0.2-SNAPSHOT/synapse-integration-3.0.2-SNAPSHOT.pom
[JENKINS] Archiving <https://builds.apache.org/job/Synapse%20-%20Trunk/ws/modules/transports/core/pipe/pom.xml>
to org.apache.synapse/synapse-pipe-transport/3.0.2-SNAPSHOT/synapse-pipe-transport-3.0.2-SNAPSHOT.pom
[JENKINS] Archiving <https://builds.apache.org/job/Synapse%20-%20Trunk/ws/modules/transports/core/pipe/target/synapse-pipe-transport-3.0.2-SNAPSHOT.jar>
to org.apache.synapse/synapse-pipe-transport/3.0.2-SNAPSHOT/synapse-pipe-transport-3.0.2-SNAPSHOT.jar
[JENKINS] Archiving <https://builds.apache.org/job/Synapse%20-%20Trunk/ws/modules/core/pom.xml>
to org.apache.synapse/synapse-core/3.0.2-SNAPSHOT/synapse-core-3.0.2-SNAPSHOT.pom
[JENKINS] Archiving <https://builds.apache.org/job/Synapse%20-%20Trunk/ws/modules/core/target/synapse-test-lib.zip>
to org.apache.synapse/synapse-core/3.0.2-SNAPSHOT/synapse-core-3.0.2-SNAPSHOT-test-lib.zip
[JENKINS] Archiving <https://builds.apache.org/job/Synapse%20-%20Trunk/ws/modules/core/target/synapse-eiptest-lib.zip>
to org.apache.synapse/synapse-core/3.0.2-SNAPSHOT/synapse-core-3.0.2-SNAPSHOT-eiptest-lib.zip
[JENKINS] Archiving <https://builds.apache.org/job/Synapse%20-%20Trunk/ws/modules/core/target/synapse-eipcore-lib.zip>
to org.apache.synapse/synapse-core/3.0.2-SNAPSHOT/synapse-core-3.0.2-SNAPSHOT-eipcore-lib.zip
[JENKINS] Archiving <https://builds.apache.org/job/Synapse%20-%20Trunk/ws/modules/transports/optional/amqp/pom.xml>
to org.apache.synapse/synapse-amqp-transport/3.0.2-SNAPSHOT/synapse-amqp-transport-3.0.2-SNAPSHOT.pom
[JENKINS] Archiving <https://builds.apache.org/job/Synapse%20-%20Trunk/ws/modules/transports/optional/amqp/target/synapse-amqp-transport-3.0.2-SNAPSHOT.jar>
to org.apache.synapse/synapse-amqp-transport/3.0.2-SNAPSHOT/synapse-amqp-transport-3.0.2-SNAPSHOT.jar
[JENKINS] Archiving <https://builds.apache.org/job/Synapse%20-%20Trunk/ws/modules/patches/pom.xml>
to org.apache.synapse/synapse-patches/3.0.2-SNAPSHOT/synapse-patches-3.0.2-SNAPSHOT.pom
[JENKINS] Archiving <https://builds.apache.org/job/Synapse%20-%20Trunk/ws/modules/distribution/pom.xml>
to org.apache.synapse/synapse-distribution/3.0.2-SNAPSHOT/synapse-distribution-3.0.2-SNAPSHOT.pom
[JENKINS] Archiving <https://builds.apache.org/job/Synapse%20-%20Trunk/ws/modules/experimental/pom.xml>
to org.apache.synapse/synapse-experimental/3.0.2-SNAPSHOT/synapse-experimental-3.0.2-SNAPSHOT.pom
Sending e-mails to: dev@synapse.apache.org
[locks-and-latches] Releasing all the locks
[locks-and-latches] All the locks released
channel stopped

---------------------------------------------------------------------
To unsubscribe, e-mail: dev-unsubscribe@synapse.apache.org
For additional commands, e-mail: dev-help@synapse.apache.org


Mime
View raw message