synapse-dev mailing list archives

Site index · List index
Message view « Date » · « Thread »
Top « Date » · « Thread »
From Apache Jenkins Server <jenk...@builds.apache.org>
Subject Build failed in Jenkins: Synapse - Trunk #5134
Date Sat, 05 Sep 2015 09:59:43 GMT
See <https://builds.apache.org/job/Synapse%20-%20Trunk/5134/>

------------------------------------------
[...truncated 1169 lines...]
Running org.apache.synapse.core.axis2.SOAPConversionTest
Tests run: 2, Failures: 0, Errors: 0, Skipped: 0, Time elapsed: 0.733 sec
Running org.apache.synapse.core.axis2.Axis2MessageContextTest
Tests run: 2, Failures: 0, Errors: 0, Skipped: 0, Time elapsed: 0.698 sec
Running org.apache.synapse.libraries.util.LibDeployerUtilsTest
Tests run: 1, Failures: 0, Errors: 0, Skipped: 0, Time elapsed: 0.687 sec
Running org.apache.synapse.libraries.LibImportTest
Tests run: 4, Failures: 0, Errors: 0, Skipped: 0, Time elapsed: 1.087 sec
Running org.apache.synapse.libraries.eip.EipLibTest
Tests run: 1, Failures: 0, Errors: 0, Skipped: 0, Time elapsed: 0.967 sec
Running org.apache.synapse.TestMessageContextBuilder
Tests run: 0, Failures: 0, Errors: 0, Skipped: 0, Time elapsed: 0.001 sec
Running org.apache.synapse.eventing.SynapseEventSourceTest
Tests run: 1, Failures: 0, Errors: 0, Skipped: 0, Time elapsed: 0.709 sec
Running org.apache.synapse.eventing.builders.ResponseMessageBuilderTest
Tests run: 4, Failures: 0, Errors: 0, Skipped: 0, Time elapsed: 0.742 sec
Running org.apache.synapse.eventing.builders.MessageBuilderTest
Tests run: 5, Failures: 0, Errors: 0, Skipped: 0, Time elapsed: 0.697 sec
Running org.apache.synapse.eventing.filters.EventFilterTest
Tests run: 2, Failures: 0, Errors: 0, Skipped: 0, Time elapsed: 0.709 sec
Running org.apache.synapse.registry.url.SimpleURLRegistryTest
Tests run: 3, Failures: 0, Errors: 0, Skipped: 0, Time elapsed: 14.698 sec
Running org.apache.synapse.registry.DynamicResourceTest
Initializing in-memory registry for dynamic resource tests...
Testing dynamic sequence lookup...
Testing basic registry lookup functionality...
Testing basic sequence caching...
Testing advanced sequence caching...
Waiting for the cache to expire...
Testing sequence reloading...
Waiting for the cache to expire...
Testing for non-existing sequences...
Dynamic sequence lookup tests were successful...
Initializing in-memory registry for dynamic resource tests...
Testing dynamic endpoint lookup...
Testing basic registry lookup functionality...
Testing basic endpoint caching...
Testing advanced endpoint caching...
Waiting for the cache to expire...
Testing endpoint reloading...
Waiting for the cache to expire...
Testing for non-existing endpoints...
Dynamic endpoint lookup tests were successful...
Tests run: 2, Failures: 0, Errors: 0, Skipped: 0, Time elapsed: 40.712 sec
Running org.apache.synapse.endpoints.algorithms.RoundRobinAlgorithmTest
Tests run: 2, Failures: 0, Errors: 0, Skipped: 0, Time elapsed: 0.667 sec
Running org.apache.synapse.endpoints.algorithms.WeightedRRLCAlgorithmTest
Tests run: 2, Failures: 0, Errors: 0, Skipped: 0, Time elapsed: 0.513 sec
Running org.apache.synapse.endpoints.dispatch.SimpleClientSessionDispatcherTest
Tests run: 1, Failures: 0, Errors: 0, Skipped: 0, Time elapsed: 0.672 sec
Running org.apache.synapse.endpoints.dispatch.HttpSessionDispatcherTest
Tests run: 1, Failures: 0, Errors: 0, Skipped: 0, Time elapsed: 0.685 sec
Running org.apache.synapse.endpoints.BasicEndpointTest
Tests run: 8, Failures: 0, Errors: 0, Skipped: 0, Time elapsed: 0.668 sec

Results :

Tests run: 393, Failures: 0, Errors: 0, Skipped: 0

[JENKINS] Recording test results
[INFO] [bundle:bundle {execution: default-bundle}]
[WARNING] Bundle org.apache.synapse:synapse-core:bundle:2.2.0-SNAPSHOT : Instructions in Export-Package
that are never used: org\.apache\.synapse\.executors\..*|org\.apache\.synapse\.executors
Classpath: Jar:.,Jar:synapse-securevault,Jar:axiom-api,Jar:geronimo-activation_1.1_spec,Jar:commons-logging,Jar:jaxen,Jar:geronimo-stax-api_1.0_spec,Jar:apache-mime4j-core,Jar:axiom-impl,Jar:woodstox-core-asl,Jar:stax2-api,Jar:log4j,Jar:jline,Jar:commons-cli,Jar:commons-io,Jar:commons-codec,Jar:synapse-commons,Jar:activation,Jar:axis2-transport-base,Jar:axis2-kernel,Jar:geronimo-ws-metadata_2.0_spec,Jar:geronimo-jta_1.1_spec,Jar:servlet-api,Jar:commons-fileupload,Jar:wsdl4j,Jar:xmlschema-core,Jar:neethi,Jar:woden-core,Jar:jsr311-api,Jar:axiom-compat,Jar:commons-pool,Jar:commons-dbcp,Jar:snmp4j-agent,Jar:snmp4j,Jar:synapse-tasks,Jar:quartz,Jar:c3p0,Jar:slf4j-api,Jar:commons-collections,Jar:synapse-nhttp-transport,Jar:httpcore,Jar:httpcore-nio,Jar:axis2-transport-http,Jar:commons-httpclient,Jar:commons-lang,Jar:bcprov-jdk15on,Jar:wso2eventing-api,Jar:wso2caching-core,Jar:axis2-saaj,Jar:geronimo-saaj_1.3_spec,Jar:axiom-dom,Jar:axis2-clustering,Jar:tribes,Jar:juli,Jar:logkit,Jar:avalon-framework,Jar:wso2-uri-templates,Jar:axis2-adb

[WARNING] Bundle org.apache.synapse:synapse-core:bundle:2.2.0-SNAPSHOT : Superfluous export-package
instructions: [org.apache.synapse.executors.*]
[INFO] [jar:test-jar {execution: default}]
[INFO] Building jar: <https://builds.apache.org/job/Synapse%20-%20Trunk/ws/java/modules/core/target/synapse-core-2.2.0-SNAPSHOT-tests.jar>
[INFO] [install:install {execution: default-install}]
[INFO] Installing <https://builds.apache.org/job/Synapse%20-%20Trunk/ws/java/modules/core/target/synapse-core-2.2.0-SNAPSHOT.jar>
to <https://builds.apache.org/job/Synapse%20-%20Trunk/ws/.repository/org/apache/synapse/synapse-core/2.2.0-SNAPSHOT/synapse-core-2.2.0-SNAPSHOT.jar>
[INFO] Installing <https://builds.apache.org/job/Synapse%20-%20Trunk/ws/java/modules/core/target/synapse-test-lib.zip>
to <https://builds.apache.org/job/Synapse%20-%20Trunk/ws/.repository/org/apache/synapse/synapse-core/2.2.0-SNAPSHOT/synapse-core-2.2.0-SNAPSHOT.zip>
[INFO] Installing <https://builds.apache.org/job/Synapse%20-%20Trunk/ws/java/modules/core/target/synapse-eiptest-lib.zip>
to <https://builds.apache.org/job/Synapse%20-%20Trunk/ws/.repository/org/apache/synapse/synapse-core/2.2.0-SNAPSHOT/synapse-core-2.2.0-SNAPSHOT.zip>
[INFO] Installing <https://builds.apache.org/job/Synapse%20-%20Trunk/ws/java/modules/core/target/synapse-eipcore-lib.zip>
to <https://builds.apache.org/job/Synapse%20-%20Trunk/ws/.repository/org/apache/synapse/synapse-core/2.2.0-SNAPSHOT/synapse-core-2.2.0-SNAPSHOT.zip>
[INFO] Installing <https://builds.apache.org/job/Synapse%20-%20Trunk/ws/java/modules/core/target/synapse-core-2.2.0-SNAPSHOT-tests.jar>
to <https://builds.apache.org/job/Synapse%20-%20Trunk/ws/.repository/org/apache/synapse/synapse-core/2.2.0-SNAPSHOT/synapse-core-2.2.0-SNAPSHOT-tests.jar>
[INFO] [bundle:install {execution: default-install}]
[INFO] Installing org/apache/synapse/synapse-core/2.2.0-SNAPSHOT/synapse-core-2.2.0-SNAPSHOT.jar
[INFO] Writing OBR metadata
[WARNING] DEPRECATED [tasks]: Use target instead
[INFO] [antrun:run {execution: remove_test_lib}]
[WARNING] Parameter tasks is deprecated, use target instead
[INFO] Executing tasks

main:
   [delete] Deleting: <https://builds.apache.org/job/Synapse%20-%20Trunk/ws/java/modules/core/target/synapse-test-lib.zip>
   [delete] Deleting: <https://builds.apache.org/job/Synapse%20-%20Trunk/ws/java/modules/core/target/synapse-eiptest-lib.zip>
   [delete] Deleting: <https://builds.apache.org/job/Synapse%20-%20Trunk/ws/java/modules/core/target/synapse-eipcore-lib.zip>
[INFO] Executed tasks
[INFO] [site:site {execution: default-site}]
[INFO] Parent project loaded from repository: org.apache:apache:pom:9
[INFO] Relativizing decoration links with respect to project URL: http://synapse.apache.org
[INFO] Rendering site with org.apache.maven.skins:maven-default-skin:jar:1.0 skin.
[INFO] Generating "About" report.
[INFO] Generating "Source Repository" report.
[INFO] Generating "Plugin Management" report.
[INFO] Generating "Mailing Lists" report.
[INFO] Generating "Issue Tracking" report.
[INFO] Generating "Project Plugins" report.
[INFO] Generating "Dependency Convergence" report.
[INFO] Generating "Project Summary" report.
[INFO] Generating "Dependency Management" report.
[INFO] Generating "Dependencies" report.
[INFO] Generating "Project License" report.
[INFO] Generating "Project Team" report.
[INFO] Generating "Continuous Integration" report.
[FINDBUGS] No report found for mojo site
[JENKINS] Archiving site from <https://builds.apache.org/job/Synapse%20-%20Trunk/ws/java/modules/core/target/site>
to /x1/jenkins/jenkins-home/jobs/Synapse - Trunk/site/synapse-core
[INFO] ------------------------------------------------------------------------
[INFO] Building Apache Synapse - Extensions
[INFO]    task-segment: [clean, install, site]
[INFO] ------------------------------------------------------------------------
[INFO] [clean:clean {execution: default-clean}]
[INFO] Deleting <https://builds.apache.org/job/Synapse%20-%20Trunk/ws/java/modules/extensions/target>
[INFO] [remote-resources:process {execution: default}]
[INFO] snapshot org.apache.synapse:synapse-core:2.2.0-SNAPSHOT: checking for updates from
wso2-m2-snapshots
[INFO] snapshot org.apache.synapse:synapse-core:2.2.0-SNAPSHOT: checking for updates from
apache.snapshots
[WARNING] org.apache.velocity.runtime.exception.ReferenceException: reference : template =
META-INF/DEPENDENCIES.vm [line 40,column 14] : $license.name is not a valid reference.
[debug] execute contextualize
[INFO] [resources:resources {execution: default-resources}]
[INFO] Using 'UTF-8' encoding to copy filtered resources.
[INFO] Copying 3 resources
[INFO] Copying 3 resources
[INFO] [compiler:compile {execution: default-compile}]
[INFO] Compiling 25 source files to <https://builds.apache.org/job/Synapse%20-%20Trunk/ws/java/modules/extensions/target/classes>
[INFO] -------------------------------------------------------------
[ERROR] COMPILATION ERROR : 
[INFO] -------------------------------------------------------------
[ERROR] <https://builds.apache.org/job/Synapse%20-%20Trunk/ws/java/modules/extensions/src/main/java/org/apache/synapse/format/syslog/SyslogMessageBuilder.java>:[128,28]
cannot find symbol
symbol  : constructor OMLinkedListImplFactory()
location: class org.apache.axiom.om.impl.llom.factory.OMLinkedListImplFactory
[INFO] 1 error
[INFO] -------------------------------------------------------------
[INFO] ------------------------------------------------------------------------
[ERROR] BUILD FAILURE
[INFO] ------------------------------------------------------------------------
[INFO] Compilation failure
<https://builds.apache.org/job/Synapse%20-%20Trunk/ws/java/modules/extensions/src/main/java/org/apache/synapse/format/syslog/SyslogMessageBuilder.java>:[128,28]
cannot find symbol
symbol  : constructor OMLinkedListImplFactory()
location: class org.apache.axiom.om.impl.llom.factory.OMLinkedListImplFactory

[INFO] ------------------------------------------------------------------------
[INFO] For more information, run Maven with the -e switch
[INFO] ------------------------------------------------------------------------
[INFO] Total time: 5 minutes 30 seconds
[INFO] Finished at: Sat Sep 05 10:00:03 UTC 2015
[INFO] Final Memory: 191M/685M
[INFO] ------------------------------------------------------------------------
Waiting for Jenkins to finish collecting data
[JENKINS] Archiving <https://builds.apache.org/job/Synapse%20-%20Trunk/ws/java/modules/tasks/pom.xml>
to org.apache.synapse/synapse-tasks/2.2.0-SNAPSHOT/synapse-tasks-2.2.0-SNAPSHOT.pom
[JENKINS] Archiving <https://builds.apache.org/job/Synapse%20-%20Trunk/ws/java/modules/tasks/target/synapse-tasks-2.2.0-SNAPSHOT.jar>
to org.apache.synapse/synapse-tasks/2.2.0-SNAPSHOT/synapse-tasks-2.2.0-SNAPSHOT.jar
Sending artifact delta relative to Synapse - Trunk » Apache Synapse - Tasks #5133
Archived 2 artifacts
Archive block size is 32768
Received 0 blocks and 38327 bytes
Compression is 0.0%
Took 0.2 sec
[JENKINS] Archiving <https://builds.apache.org/job/Synapse%20-%20Trunk/ws/java/modules/extensions/pom.xml>
to org.apache.synapse/synapse-extensions/2.2.0-SNAPSHOT/synapse-extensions-2.2.0-SNAPSHOT.pom
Sending artifact delta relative to Synapse - Trunk » Apache Synapse - Extensions #5133
Archived 1 artifacts
Archive block size is 32768
Received 0 blocks and 6064 bytes
Compression is 0.0%
Took 0.66 sec
[JENKINS] Archiving <https://builds.apache.org/job/Synapse%20-%20Trunk/ws/.repository/org/apache/synapse/Apache-Synapse/2.2.0-SNAPSHOT/Apache-Synapse-2.2.0-SNAPSHOT.pom>
to org.apache.synapse/Apache-Synapse/2.2.0-SNAPSHOT/Apache-Synapse-2.2.0-SNAPSHOT.pom
<https://builds.apache.org/job/Synapse%20-%20Trunk/ws/.repository/org/apache/synapse/Apache-Synapse/2.2.0-SNAPSHOT/Apache-Synapse-2.2.0-SNAPSHOT.pom>
is not inside <https://builds.apache.org/job/Synapse%20-%20Trunk/ws/java/;> will archive
in a separate pass
Sending artifact delta relative to Synapse - Trunk » Apache Synapse #5133
Archived 1 artifacts
Archive block size is 32768
Received 1 blocks and 21185 bytes
Compression is 60.7%
Took 0.87 sec
[JENKINS] Archiving <https://builds.apache.org/job/Synapse%20-%20Trunk/ws/java/modules/commons/pom.xml>
to org.apache.synapse/synapse-commons/2.2.0-SNAPSHOT/synapse-commons-2.2.0-SNAPSHOT.pom
[JENKINS] Archiving <https://builds.apache.org/job/Synapse%20-%20Trunk/ws/java/modules/commons/target/synapse-commons-2.2.0-SNAPSHOT.jar>
to org.apache.synapse/synapse-commons/2.2.0-SNAPSHOT/synapse-commons-2.2.0-SNAPSHOT.jar
Sending artifact delta relative to Synapse - Trunk » Apache Synapse - Commons #5133
Archived 2 artifacts
Archive block size is 32768
Received 0 blocks and 180657 bytes
Compression is 0.0%
Took 1.3 sec
[JENKINS] Archiving <https://builds.apache.org/job/Synapse%20-%20Trunk/ws/java/modules/transports/core/nhttp/pom.xml>
to org.apache.synapse/synapse-nhttp-transport/2.2.0-SNAPSHOT/synapse-nhttp-transport-2.2.0-SNAPSHOT.pom
[JENKINS] Archiving <https://builds.apache.org/job/Synapse%20-%20Trunk/ws/java/modules/transports/core/nhttp/target/synapse-nhttp-transport-2.2.0-SNAPSHOT.jar>
to org.apache.synapse/synapse-nhttp-transport/2.2.0-SNAPSHOT/synapse-nhttp-transport-2.2.0-SNAPSHOT.jar
[JENKINS] Archiving <https://builds.apache.org/job/Synapse%20-%20Trunk/ws/java/modules/transports/core/nhttp/target/synapse-nhttp-transport-2.2.0-SNAPSHOT-testkit-logs.zip>
to org.apache.synapse/synapse-nhttp-transport/2.2.0-SNAPSHOT/synapse-nhttp-transport-2.2.0-SNAPSHOT-testkit-logs.zip
Sending artifact delta relative to Synapse - Trunk » Apache Synapse - Non-blocking HTTP/s
Transport #5133
Archived 3 artifacts
Archive block size is 32768
Received 0 blocks and 1543087 bytes
Compression is 0.0%
Took 4.7 sec
[JENKINS] Archiving <https://builds.apache.org/job/Synapse%20-%20Trunk/ws/java/modules/transports/optional/fix/pom.xml>
to org.apache.synapse/synapse-fix-transport/2.2.0-SNAPSHOT/synapse-fix-transport-2.2.0-SNAPSHOT.pom
[JENKINS] Archiving <https://builds.apache.org/job/Synapse%20-%20Trunk/ws/java/modules/transports/optional/fix/target/synapse-fix-transport-2.2.0-SNAPSHOT.jar>
to org.apache.synapse/synapse-fix-transport/2.2.0-SNAPSHOT/synapse-fix-transport-2.2.0-SNAPSHOT.jar
Sending artifact delta relative to Synapse - Trunk » Apache Synapse - FIX Transport #5133
Archived 2 artifacts
Archive block size is 32768
Received 0 blocks and 59002 bytes
Compression is 0.0%
Took 0.82 sec
[JENKINS] Archiving <https://builds.apache.org/job/Synapse%20-%20Trunk/ws/.repository/org/apache/synapse/synapse-transports/2.2.0-SNAPSHOT/synapse-transports-2.2.0-SNAPSHOT.pom>
to org.apache.synapse/synapse-transports/2.2.0-SNAPSHOT/synapse-transports-2.2.0-SNAPSHOT.pom
<https://builds.apache.org/job/Synapse%20-%20Trunk/ws/.repository/org/apache/synapse/synapse-transports/2.2.0-SNAPSHOT/synapse-transports-2.2.0-SNAPSHOT.pom>
is not inside <https://builds.apache.org/job/Synapse%20-%20Trunk/ws/java/modules/transports/;>
will archive in a separate pass
Sending artifact delta relative to Synapse - Trunk » Apache Synapse - Transports #5133
Archived 1 artifacts
Archive block size is 32768
Received 0 blocks and 2952 bytes
Compression is 0.0%
Took 0.59 sec
[JENKINS] Archiving <https://builds.apache.org/job/Synapse%20-%20Trunk/ws/java/modules/securevault/pom.xml>
to org.apache.synapse/synapse-securevault/2.2.0-SNAPSHOT/synapse-securevault-2.2.0-SNAPSHOT.pom
[JENKINS] Archiving <https://builds.apache.org/job/Synapse%20-%20Trunk/ws/java/modules/securevault/target/synapse-securevault-2.2.0-SNAPSHOT.jar>
to org.apache.synapse/synapse-securevault/2.2.0-SNAPSHOT/synapse-securevault-2.2.0-SNAPSHOT.jar
Sending artifact delta relative to Synapse - Trunk » Apache Synapse - Secure Vault #5133
Archived 2 artifacts
Archive block size is 32768
Received 0 blocks and 91991 bytes
Compression is 0.0%
Took 1.1 sec
[JENKINS] Archiving <https://builds.apache.org/job/Synapse%20-%20Trunk/ws/java/modules/transports/core/pipe/pom.xml>
to org.apache.synapse/synapse-pipe-transport/2.2.0-SNAPSHOT/synapse-pipe-transport-2.2.0-SNAPSHOT.pom
[JENKINS] Archiving <https://builds.apache.org/job/Synapse%20-%20Trunk/ws/java/modules/transports/core/pipe/target/synapse-pipe-transport-2.2.0-SNAPSHOT.jar>
to org.apache.synapse/synapse-pipe-transport/2.2.0-SNAPSHOT/synapse-pipe-transport-2.2.0-SNAPSHOT.jar
Sending artifact delta relative to Synapse - Trunk » Apache Synapse - PIPE Transport #5133
Archived 2 artifacts
Archive block size is 32768
Received 0 blocks and 23595 bytes
Compression is 0.0%
Took 1.5 sec
[JENKINS] Archiving <https://builds.apache.org/job/Synapse%20-%20Trunk/ws/java/modules/transports/optional/amqp/pom.xml>
to org.apache.synapse/synapse-amqp-transport/2.2.0-SNAPSHOT/synapse-amqp-transport-2.2.0-SNAPSHOT.pom
[JENKINS] Archiving <https://builds.apache.org/job/Synapse%20-%20Trunk/ws/java/modules/transports/optional/amqp/target/synapse-amqp-transport-2.2.0-SNAPSHOT.jar>
to org.apache.synapse/synapse-amqp-transport/2.2.0-SNAPSHOT/synapse-amqp-transport-2.2.0-SNAPSHOT.jar
Sending artifact delta relative to Synapse - Trunk » Apache Synapse - AMQP Transport #5133
Archived 2 artifacts
Archive block size is 32768
Received 0 blocks and 73544 bytes
Compression is 0.0%
Took 2 sec
[JENKINS] Archiving <https://builds.apache.org/job/Synapse%20-%20Trunk/ws/java/modules/core/pom.xml>
to org.apache.synapse/synapse-core/2.2.0-SNAPSHOT/synapse-core-2.2.0-SNAPSHOT.pom
[JENKINS] Archiving <https://builds.apache.org/job/Synapse%20-%20Trunk/ws/java/modules/core/target/synapse-core-2.2.0-SNAPSHOT.jar>
to org.apache.synapse/synapse-core/2.2.0-SNAPSHOT/synapse-core-2.2.0-SNAPSHOT.jar
[JENKINS] Archiving <https://builds.apache.org/job/Synapse%20-%20Trunk/ws/java/modules/core/target/synapse-core-2.2.0-SNAPSHOT-tests.jar>
to org.apache.synapse/synapse-core/2.2.0-SNAPSHOT/synapse-core-2.2.0-SNAPSHOT-tests.jar
Sending artifact delta relative to Synapse - Trunk » Apache Synapse - Core #5133
Archived 3 artifacts
Archive block size is 32768
Received 0 blocks and 1448127 bytes
Compression is 0.0%
Took 1.6 sec
[JENKINS] Archiving <https://builds.apache.org/job/Synapse%20-%20Trunk/ws/java/modules/transports/core/vfs/pom.xml>
to org.apache.synapse/synapse-vfs-transport/2.2.0-SNAPSHOT/synapse-vfs-transport-2.2.0-SNAPSHOT.pom
[JENKINS] Archiving <https://builds.apache.org/job/Synapse%20-%20Trunk/ws/java/modules/transports/core/vfs/target/synapse-vfs-transport-2.2.0-SNAPSHOT.jar>
to org.apache.synapse/synapse-vfs-transport/2.2.0-SNAPSHOT/synapse-vfs-transport-2.2.0-SNAPSHOT.jar
[JENKINS] Archiving <https://builds.apache.org/job/Synapse%20-%20Trunk/ws/java/modules/transports/core/vfs/target/synapse-vfs-transport-2.2.0-SNAPSHOT-testkit-logs.zip>
to org.apache.synapse/synapse-vfs-transport/2.2.0-SNAPSHOT/synapse-vfs-transport-2.2.0-SNAPSHOT-testkit-logs.zip
Sending artifact delta relative to Synapse - Trunk » Apache Synapse - VFS Transport #5133
Archived 3 artifacts
Archive block size is 32768
Received 0 blocks and 414127 bytes
Compression is 0.0%
Took 1.4 sec
Sending e-mails to: dev@synapse.apache.org
Sending e-mails to: dev@synapse.apache.org
channel stopped
[locks-and-latches] Releasing all the locks
[locks-and-latches] All the locks released

---------------------------------------------------------------------
To unsubscribe, e-mail: dev-unsubscribe@synapse.apache.org
For additional commands, e-mail: dev-help@synapse.apache.org


Mime
View raw message