synapse-dev mailing list archives

Site index · List index
Message view « Date » · « Thread »
Top « Date » · « Thread »
From Apache Jenkins Server <jenk...@builds.apache.org>
Subject Build failed in Jenkins: Synapse - Trunk #4972
Date Sat, 23 May 2015 03:07:05 GMT
See <https://builds.apache.org/job/Synapse%20-%20Trunk/4972/>

------------------------------------------
[...truncated 27 lines...]
[INFO] Reactor build order: 
[INFO]   Apache Synapse
[INFO]   Apache Synapse - Secure Vault
[INFO]   Apache Synapse - Commons
[INFO]   Apache Synapse - Transports
[INFO]   Apache Synapse - Non-blocking HTTP/s Transport
[INFO]   Apache Synapse - PIPE Transport
[INFO]   Apache Synapse - VFS Transport
[INFO]   Apache Synapse - FIX Transport
[INFO]   Apache Synapse - AMQP Transport
[INFO]   Apache Synapse - Tasks
[INFO]   Apache Synapse - Core
[INFO]   Apache Synapse - Extensions
[INFO]   Apache Synapse - Samples
[INFO]   Apache Synapse - Patches
[INFO]   Apache Synapse - Experimental code
[INFO]   Apache Synapse - Documentation
[INFO]   Apache Synapse - Web Application
[INFO]   Apache Synapse - Handler Module
[INFO]   Apache Synapse - XAR Maven Plugin
[INFO]   Apache Synapse - Configuration Migrator
[INFO]   Apache Synapse - Distribution
[INFO]   Apache Synapse - Package skeleton ZIP
[INFO]   Apache Synapse - Package archetype
[INFO]   Apache Synapse - Integration
[WARNING] POM for 'biz.aQute:bndlib:pom:1.50.0:runtime' is invalid.

Its dependencies (if any) will NOT be available to the current build.
[INFO] ------------------------------------------------------------------------
[INFO] Building Apache Synapse
[INFO]    task-segment: [clean, install, site]
[INFO] ------------------------------------------------------------------------
[INFO] [clean:clean {execution: default-clean}]
[INFO] Deleting <https://builds.apache.org/job/Synapse%20-%20Trunk/ws/java/target>
[INFO] Setting property: classpath.resource.loader.class => 'org.codehaus.plexus.velocity.ContextClassLoaderResourceLoader'.
[INFO] Setting property: velocimacro.messages.on => 'false'.
[INFO] Setting property: resource.loader => 'classpath'.
[INFO] Setting property: resource.manager.logwhenfound => 'false'.
[INFO] [remote-resources:process {execution: default}]
[INFO] [site:attach-descriptor {execution: default-attach-descriptor}]
[INFO] [install:install {execution: default-install}]
[INFO] Installing <https://builds.apache.org/job/Synapse%20-%20Trunk/ws/java/pom.xml>
to <https://builds.apache.org/job/Synapse%20-%20Trunk/ws/.repository/org/apache/synapse/Apache-Synapse/2.2.0-SNAPSHOT/Apache-Synapse-2.2.0-SNAPSHOT.pom>
[INFO] [site:site {execution: default-site}]
[INFO] Parent project loaded from repository: org.apache:apache:pom:9
[WARNING] Unable to find a URL to the parent project. The parent menu will NOT be added.
[INFO] Relativizing decoration links with respect to project URL: http://synapse.apache.org/
[INFO] Rendering site with org.apache.maven.skins:maven-default-skin:jar:1.0 skin.
[INFO] Generating "About" report.
[INFO] Generating "Source Repository" report.
[INFO] Generating "Plugin Management" report.
[INFO] Generating "Mailing Lists" report.
[INFO] Generating "Issue Tracking" report.
[INFO] Generating "Project Plugins" report.
[INFO] Generating "Dependency Convergence" report.
[INFO] Generating "Project Summary" report.
[INFO] Generating "Dependency Management" report.
[INFO] snapshot org.apache.axis2:addressing:1.7.0-SNAPSHOT: checking for updates from wso2-m2-snapshots
[INFO] snapshot org.apache.axis2:addressing:1.7.0-SNAPSHOT: checking for updates from apache.snapshots
Downloading: http://repository.apache.org/snapshots/org/apache/axis2/addressing/1.7.0-SNAPSHOT/addressing-1.7.0-20150523.022540-2005.pom
5K downloaded  (addressing-1.7.0-20150523.022540-2005.pom)
[INFO] snapshot org.apache.axis2:axis2-parent:1.7.0-SNAPSHOT: checking for updates from wso2-m2-snapshots
[INFO] snapshot org.apache.axis2:axis2-parent:1.7.0-SNAPSHOT: checking for updates from apache.snapshots
Downloading: http://repository.apache.org/snapshots/org/apache/axis2/axis2-parent/1.7.0-SNAPSHOT/axis2-parent-1.7.0-20150523.022434-2057.pom
49K downloaded  (axis2-parent-1.7.0-20150523.022434-2057.pom)
[INFO] snapshot org.apache.axis2:axis2-adb:1.7.0-SNAPSHOT: checking for updates from wso2-m2-snapshots
[INFO] snapshot org.apache.axis2:axis2-adb:1.7.0-SNAPSHOT: checking for updates from apache.snapshots
Downloading: http://repository.apache.org/snapshots/org/apache/axis2/axis2-adb/1.7.0-SNAPSHOT/axis2-adb-1.7.0-20150523.022524-2028.pom
4K downloaded  (axis2-adb-1.7.0-20150523.022524-2028.pom)
[INFO] snapshot org.apache.axis2:axis2-clustering:1.7.0-SNAPSHOT: checking for updates from
wso2-m2-snapshots
[INFO] snapshot org.apache.axis2:axis2-clustering:1.7.0-SNAPSHOT: checking for updates from
apache.snapshots
Downloading: http://repository.apache.org/snapshots/org/apache/axis2/axis2-clustering/1.7.0-SNAPSHOT/axis2-clustering-1.7.0-20150523.022857-1984.pom
5K downloaded  (axis2-clustering-1.7.0-20150523.022857-1984.pom)
[INFO] snapshot org.apache.axis2:axis2-codegen:1.7.0-SNAPSHOT: checking for updates from wso2-m2-snapshots
[INFO] snapshot org.apache.axis2:axis2-codegen:1.7.0-SNAPSHOT: checking for updates from apache.snapshots
Downloading: http://repository.apache.org/snapshots/org/apache/axis2/axis2-codegen/1.7.0-SNAPSHOT/axis2-codegen-1.7.0-20150523.022641-2007.pom
11K downloaded  (axis2-codegen-1.7.0-20150523.022641-2007.pom)
[INFO] snapshot org.apache.axis2:axis2-jaxws:1.7.0-SNAPSHOT: checking for updates from wso2-m2-snapshots
[INFO] snapshot org.apache.axis2:axis2-jaxws:1.7.0-SNAPSHOT: checking for updates from apache.snapshots
Downloading: http://repository.apache.org/snapshots/org/apache/axis2/axis2-jaxws/1.7.0-SNAPSHOT/axis2-jaxws-1.7.0-20150523.023025-1934.pom
18K downloaded  (axis2-jaxws-1.7.0-20150523.023025-1934.pom)
[INFO] snapshot org.apache.axis2:axis2-kernel:1.7.0-SNAPSHOT: checking for updates from wso2-m2-snapshots
[INFO] snapshot org.apache.axis2:axis2-kernel:1.7.0-SNAPSHOT: checking for updates from apache.snapshots
Downloading: http://repository.apache.org/snapshots/org/apache/axis2/axis2-kernel/1.7.0-SNAPSHOT/axis2-kernel-1.7.0-20150523.022509-2034.pom
10K downloaded  (axis2-kernel-1.7.0-20150523.022509-2034.pom)
[INFO] snapshot org.apache.axis2:axis2-mtompolicy:1.7.0-SNAPSHOT: checking for updates from
wso2-m2-snapshots
[INFO] snapshot org.apache.axis2:axis2-mtompolicy:1.7.0-SNAPSHOT: checking for updates from
apache.snapshots
Downloading: http://repository.apache.org/snapshots/org/apache/axis2/axis2-mtompolicy/1.7.0-SNAPSHOT/axis2-mtompolicy-1.7.0-20150523.024104-1898.pom
3K downloaded  (axis2-mtompolicy-1.7.0-20150523.024104-1898.pom)
[INFO] snapshot org.apache.axis2:axis2-saaj:1.7.0-SNAPSHOT: checking for updates from wso2-m2-snapshots
[INFO] snapshot org.apache.axis2:axis2-saaj:1.7.0-SNAPSHOT: checking for updates from apache.snapshots
Downloading: http://repository.apache.org/snapshots/org/apache/axis2/axis2-saaj/1.7.0-SNAPSHOT/axis2-saaj-1.7.0-20150523.022929-1957.pom
7K downloaded  (axis2-saaj-1.7.0-20150523.022929-1957.pom)
[INFO] snapshot org.apache.axis2:axis2-transport-base:1.7.0-SNAPSHOT: checking for updates
from wso2-m2-snapshots
[INFO] snapshot org.apache.axis2:axis2-transport-base:1.7.0-SNAPSHOT: checking for updates
from apache.snapshots
Downloading: http://repository.apache.org/snapshots/org/apache/axis2/axis2-transport-base/1.7.0-SNAPSHOT/axis2-transport-base-1.7.0-20150523.022552-1478.pom
3K downloaded  (axis2-transport-base-1.7.0-20150523.022552-1478.pom)
[INFO] snapshot org.apache.axis2:axis2-transport-http:1.7.0-SNAPSHOT: checking for updates
from wso2-m2-snapshots
[INFO] snapshot org.apache.axis2:axis2-transport-http:1.7.0-SNAPSHOT: checking for updates
from apache.snapshots
Downloading: http://repository.apache.org/snapshots/org/apache/axis2/axis2-transport-http/1.7.0-SNAPSHOT/axis2-transport-http-1.7.0-20150523.022628-2011.pom
5K downloaded  (axis2-transport-http-1.7.0-20150523.022628-2011.pom)
[INFO] snapshot org.apache.axis2:axis2-transport-jms:1.7.0-SNAPSHOT: checking for updates
from wso2-m2-snapshots
[INFO] snapshot org.apache.axis2:axis2-transport-jms:1.7.0-SNAPSHOT: checking for updates
from apache.snapshots
Downloading: http://repository.apache.org/snapshots/org/apache/axis2/axis2-transport-jms/1.7.0-SNAPSHOT/axis2-transport-jms-1.7.0-20150523.025602-1390.pom
7K downloaded  (axis2-transport-jms-1.7.0-20150523.025602-1390.pom)
[INFO] snapshot org.apache.axis2:axis2-transport-local:1.7.0-SNAPSHOT: checking for updates
from wso2-m2-snapshots
[INFO] snapshot org.apache.axis2:axis2-transport-local:1.7.0-SNAPSHOT: checking for updates
from apache.snapshots
Downloading: http://repository.apache.org/snapshots/org/apache/axis2/axis2-transport-local/1.7.0-SNAPSHOT/axis2-transport-local-1.7.0-20150523.022531-2020.pom
4K downloaded  (axis2-transport-local-1.7.0-20150523.022531-2020.pom)
[INFO] snapshot org.apache.axis2:axis2-transport-mail:1.7.0-SNAPSHOT: checking for updates
from wso2-m2-snapshots
[INFO] snapshot org.apache.axis2:axis2-transport-mail:1.7.0-SNAPSHOT: checking for updates
from apache.snapshots
Downloading: http://repository.apache.org/snapshots/org/apache/axis2/axis2-transport-mail/1.7.0-SNAPSHOT/axis2-transport-mail-1.7.0-20150523.025710-1390.pom
5K downloaded  (axis2-transport-mail-1.7.0-20150523.025710-1390.pom)
[INFO] snapshot org.apache.axis2:mex:1.7.0-SNAPSHOT: checking for updates from wso2-m2-snapshots
[INFO] snapshot org.apache.axis2:mex:1.7.0-SNAPSHOT: checking for updates from apache.snapshots
Downloading: http://repository.apache.org/snapshots/org/apache/axis2/mex/1.7.0-SNAPSHOT/mex-1.7.0-20150523.025121-1855.pom
5K downloaded  (mex-1.7.0-20150523.025121-1855.pom)
Downloading: http://dist.wso2.org/maven2//org/apache/bsf/bsf-all/3.0/bsf-all-3.0.pom
[INFO] Unable to find resource 'org.apache.bsf:bsf-all:pom:3.0' in repository wso2-m2 (http://dist.wso2.org/maven2/)
Downloading: https://oosnmp.net/dist/release//org/apache/bsf/bsf-all/3.0/bsf-all-3.0.pom
[WARNING] Unable to get resource 'org.apache.bsf:bsf-all:pom:3.0' from repository snmp4j-repo
(https://oosnmp.net/dist/release/): Error transferring file: sun.security.validator.ValidatorException:
PKIX path building failed: sun.security.provider.certpath.SunCertPathBuilderException: unable
to find valid certification path to requested target
Downloading: http://repo1.maven.org/maven2/org/apache/bsf/bsf-all/3.0/bsf-all-3.0.pom
[INFO] Unable to find resource 'org.apache.bsf:bsf-all:pom:3.0' in repository central (http://repo1.maven.org/maven2)
[INFO] snapshot org.apache.neethi:neethi:3.0.4-SNAPSHOT: checking for updates from wso2-m2-snapshots
[INFO] snapshot org.apache.neethi:neethi:3.0.4-SNAPSHOT: checking for updates from apache.snapshots
Downloading: http://repository.apache.org/snapshots/org/apache/neethi/neethi/3.0.4-SNAPSHOT/neethi-3.0.4-20140501.061056-2.pom
12K downloaded  (neethi-3.0.4-20140501.061056-2.pom)
[INFO] snapshot org.apache.rampart:rampart:1.7.0-SNAPSHOT: checking for updates from wso2-m2-snapshots
[INFO] snapshot org.apache.rampart:rampart:1.7.0-SNAPSHOT: checking for updates from apache.snapshots
Downloading: http://repository.apache.org/snapshots/org/apache/rampart/rampart/1.7.0-SNAPSHOT/rampart-1.7.0-20150523.030526-1383.pom
4K downloaded  (rampart-1.7.0-20150523.030526-1383.pom)
[INFO] snapshot org.apache.rampart:rampart-project:1.7.0-SNAPSHOT: checking for updates from
wso2-m2-snapshots
[INFO] snapshot org.apache.rampart:rampart-project:1.7.0-SNAPSHOT: checking for updates from
apache.snapshots
Downloading: http://repository.apache.org/snapshots/org/apache/rampart/rampart-project/1.7.0-SNAPSHOT/rampart-project-1.7.0-20150523.030534-1383.pom
21K downloaded  (rampart-project-1.7.0-20150523.030534-1383.pom)
[INFO] snapshot org.apache.rampart:rampart-core:1.7.0-SNAPSHOT: checking for updates from
wso2-m2-snapshots
[INFO] snapshot org.apache.rampart:rampart-core:1.7.0-SNAPSHOT: checking for updates from
apache.snapshots
Downloading: http://repository.apache.org/snapshots/org/apache/rampart/rampart-core/1.7.0-SNAPSHOT/rampart-core-1.7.0-20150523.030527-1383.pom
3K downloaded  (rampart-core-1.7.0-20150523.030527-1383.pom)
[INFO] snapshot org.apache.rampart:rampart-policy:1.7.0-SNAPSHOT: checking for updates from
wso2-m2-snapshots
[INFO] snapshot org.apache.rampart:rampart-policy:1.7.0-SNAPSHOT: checking for updates from
apache.snapshots
Downloading: http://repository.apache.org/snapshots/org/apache/rampart/rampart-policy/1.7.0-SNAPSHOT/rampart-policy-1.7.0-20150523.030533-1383.pom
2K downloaded  (rampart-policy-1.7.0-20150523.030533-1383.pom)
[INFO] snapshot org.apache.rampart:rampart-trust:1.7.0-SNAPSHOT: checking for updates from
wso2-m2-snapshots
[INFO] snapshot org.apache.rampart:rampart-trust:1.7.0-SNAPSHOT: checking for updates from
apache.snapshots
Downloading: http://repository.apache.org/snapshots/org/apache/rampart/rampart-trust/1.7.0-SNAPSHOT/rampart-trust-1.7.0-20150523.030539-1383.pom
3K downloaded  (rampart-trust-1.7.0-20150523.030539-1383.pom)
[INFO] snapshot org.apache.woden:woden-core:1.0-SNAPSHOT: checking for updates from wso2-m2-snapshots
[INFO] snapshot org.apache.woden:woden-core:1.0-SNAPSHOT: checking for updates from apache.snapshots
Downloading: http://repository.apache.org/snapshots/org/apache/woden/woden-core/1.0-SNAPSHOT/woden-core-1.0-20150508.182037-537.pom
5K downloaded  (woden-core-1.0-20150508.182037-537.pom)
[INFO] snapshot org.apache.woden:woden:1.0-SNAPSHOT: checking for updates from wso2-m2-snapshots
[INFO] snapshot org.apache.woden:woden:1.0-SNAPSHOT: checking for updates from apache.snapshots
Downloading: http://repository.apache.org/snapshots/org/apache/woden/woden/1.0-SNAPSHOT/woden-1.0-20150508.182034-953.pom
13K downloaded  (woden-1.0-20150508.182034-953.pom)
[INFO] snapshot org.apache.ws.commons.axiom:axiom-api:1.2.15-SNAPSHOT: checking for updates
from wso2-m2-snapshots
[INFO] snapshot org.apache.ws.commons.axiom:axiom-api:1.2.15-SNAPSHOT: checking for updates
from apache.snapshots
Downloading: http://repository.apache.org/snapshots/org/apache/ws/commons/axiom/axiom-api/1.2.15-SNAPSHOT/axiom-api-1.2.15-20150523.021020-680.pom
16K downloaded  (axiom-api-1.2.15-20150523.021020-680.pom)
[INFO] snapshot org.apache.ws.commons.axiom:axiom:1.2.15-SNAPSHOT: checking for updates from
wso2-m2-snapshots
[INFO] snapshot org.apache.ws.commons.axiom:axiom:1.2.15-SNAPSHOT: checking for updates from
apache.snapshots
Downloading: http://repository.apache.org/snapshots/org/apache/ws/commons/axiom/axiom/1.2.15-SNAPSHOT/axiom-1.2.15-20150523.020739-699.pom
40K downloaded  (axiom-1.2.15-20150523.020739-699.pom)
[INFO] snapshot org.apache.ws:ws-parent:1-SNAPSHOT: checking for updates from apache.snapshots
[INFO] snapshot org.apache.ws:ws-parent:1-SNAPSHOT: checking for updates from wso2-m2-snapshots
Downloading: http://repository.apache.org/snapshots/org/apache/ws/ws-parent/1-SNAPSHOT/ws-parent-1-20150516.185524-5.pom
4K downloaded  (ws-parent-1-20150516.185524-5.pom)
[INFO] snapshot org.apache.ws.commons.axiom:axiom-dom:1.2.15-SNAPSHOT: checking for updates
from wso2-m2-snapshots
[INFO] snapshot org.apache.ws.commons.axiom:axiom-dom:1.2.15-SNAPSHOT: checking for updates
from apache.snapshots
Downloading: http://repository.apache.org/snapshots/org/apache/ws/commons/axiom/axiom-dom/1.2.15-SNAPSHOT/axiom-dom-1.2.15-20150523.021546-662.pom
6K downloaded  (axiom-dom-1.2.15-20150523.021546-662.pom)
[INFO] snapshot org.apache.ws.commons.axiom:implementations:1.2.15-SNAPSHOT: checking for
updates from wso2-m2-snapshots
[INFO] snapshot org.apache.ws.commons.axiom:implementations:1.2.15-SNAPSHOT: checking for
updates from apache.snapshots
Downloading: http://repository.apache.org/snapshots/org/apache/ws/commons/axiom/implementations/1.2.15-SNAPSHOT/implementations-1.2.15-20150523.021126-127.pom
4K downloaded  (implementations-1.2.15-20150523.021126-127.pom)
[INFO] snapshot org.apache.ws.commons.axiom:axiom-impl:1.2.15-SNAPSHOT: checking for updates
from wso2-m2-snapshots
[INFO] snapshot org.apache.ws.commons.axiom:axiom-impl:1.2.15-SNAPSHOT: checking for updates
from apache.snapshots
Downloading: http://repository.apache.org/snapshots/org/apache/ws/commons/axiom/axiom-impl/1.2.15-SNAPSHOT/axiom-impl-1.2.15-20150523.021318-668.pom
5K downloaded  (axiom-impl-1.2.15-20150523.021318-668.pom)
Downloading: http://dist.wso2.org/maven2//quickfixj/quickfixj-all/1.4.0/quickfixj-all-1.4.0.pom
[INFO] Unable to find resource 'quickfixj:quickfixj-all:pom:1.4.0' in repository wso2-m2 (http://dist.wso2.org/maven2/)
Downloading: https://oosnmp.net/dist/release//quickfixj/quickfixj-all/1.4.0/quickfixj-all-1.4.0.pom
[WARNING] Unable to get resource 'quickfixj:quickfixj-all:pom:1.4.0' from repository snmp4j-repo
(https://oosnmp.net/dist/release/): Error transferring file: sun.security.validator.ValidatorException:
PKIX path building failed: sun.security.provider.certpath.SunCertPathBuilderException: unable
to find valid certification path to requested target
Downloading: http://repo1.maven.org/maven2/quickfixj/quickfixj-all/1.4.0/quickfixj-all-1.4.0.pom
[INFO] Unable to find resource 'quickfixj:quickfixj-all:pom:1.4.0' in repository central (http://repo1.maven.org/maven2)
[INFO] snapshot org.apache.axis2:axis2-transport-testkit:1.7.0-SNAPSHOT: checking for updates
from wso2-m2-snapshots
[INFO] snapshot org.apache.axis2:axis2-transport-testkit:1.7.0-SNAPSHOT: checking for updates
from apache.snapshots
Downloading: http://repository.apache.org/snapshots/org/apache/axis2/axis2-transport-testkit/1.7.0-SNAPSHOT/axis2-transport-testkit-1.7.0-20150523.022559-1476.pom
10K downloaded  (axis2-transport-testkit-1.7.0-20150523.022559-1476.pom)
[INFO] Generating "Dependencies" report.
[INFO] Generating "Project License" report.
[INFO] Generating "Project Modules" report.
[INFO] Generating "Project Team" report.
[INFO] Generating "Continuous Integration" report.
[FINDBUGS] No report found for mojo site
[JENKINS] Archiving site from <https://builds.apache.org/job/Synapse%20-%20Trunk/ws/java/target/site>
to /x1/jenkins/jenkins-home/jobs/Synapse - Trunk/site
log4j:WARN No appenders could be found for logger (org.apache.commons.beanutils.converters.BooleanConverter).
log4j:WARN Please initialize the log4j system properly.
[INFO] ------------------------------------------------------------------------
[INFO] Building Apache Synapse - Secure Vault
[INFO]    task-segment: [clean, install, site]
[INFO] ------------------------------------------------------------------------
[INFO] [clean:clean {execution: default-clean}]
[INFO] [remote-resources:process {execution: default}]
[INFO] ------------------------------------------------------------------------
[ERROR] BUILD ERROR
[INFO] ------------------------------------------------------------------------
[INFO] Failed to resolve dependencies for one or more projects in the reactor. Reason: Unable
to get dependency information: Unable to read the metadata file for artifact 'org.apache.geronimo.specs:geronimo-stax-api_1.0_spec:jar':
Cannot find parent: org.apache.geronimo.genesis.config:config for project: null:project-config:pom:1.1
for project null:project-config:pom:1.1
  org.apache.geronimo.specs:geronimo-stax-api_1.0_spec:jar:1.0.1

from the specified remote repositories:
  apache.snapshots (http://repository.apache.org/snapshots),
  central (http://repo1.maven.org/maven2),
  snmp4j-repo (https://oosnmp.net/dist/release/),
  wso2-m2-snapshots (http://dist.wso2.org/snapshots/maven2/),
  wso2-m2 (http://dist.wso2.org/maven2/)

Path to dependency: 
	1) org.apache.synapse:synapse-securevault:bundle:2.2.0-SNAPSHOT
	2) org.apache.ws.commons.axiom:axiom-api:jar:1.2.15-SNAPSHOT



Not a v4.0.0 POM. for project org.apache.geronimo.genesis.config:config at <https://builds.apache.org/job/Synapse%20-%20Trunk/ws/.repository/org/apache/geronimo/genesis/config/config/1.1/config-1.1.pom>
[INFO] ------------------------------------------------------------------------
[INFO] For more information, run Maven with the -e switch
[INFO] ------------------------------------------------------------------------
[INFO] Total time: 1 minute 1 second
[INFO] Finished at: Sat May 23 03:07:01 UTC 2015
[INFO] Final Memory: 89M/766M
[INFO] ------------------------------------------------------------------------
[JENKINS] Archiving <https://builds.apache.org/job/Synapse%20-%20Trunk/ws/.repository/org/apache/synapse/Apache-Synapse/2.2.0-SNAPSHOT/Apache-Synapse-2.2.0-SNAPSHOT.pom>
to org.apache.synapse/Apache-Synapse/2.2.0-SNAPSHOT/Apache-Synapse-2.2.0-SNAPSHOT.pom
<https://builds.apache.org/job/Synapse%20-%20Trunk/ws/.repository/org/apache/synapse/Apache-Synapse/2.2.0-SNAPSHOT/Apache-Synapse-2.2.0-SNAPSHOT.pom>
is not inside <https://builds.apache.org/job/Synapse%20-%20Trunk/ws/java/;> will archive
in a separate pass
Sending artifact delta relative to Synapse - Trunk » Apache Synapse #4971
Archived 1 artifacts
Archive block size is 32768
Received 1 blocks and 21185 bytes
Compression is 60.7%
Took 90 ms
[JENKINS] Archiving <https://builds.apache.org/job/Synapse%20-%20Trunk/ws/java/modules/securevault/pom.xml>
to org.apache.synapse/synapse-securevault/2.2.0-SNAPSHOT/synapse-securevault-2.2.0-SNAPSHOT.pom
Sending artifact delta relative to Synapse - Trunk » Apache Synapse - Secure Vault #4970
Archived 1 artifacts
Archive block size is 32768
Received 0 blocks and 4444 bytes
Compression is 0.0%
Took 0.1 sec
Sending e-mails to: dev@synapse.apache.org
channel stopped
[locks-and-latches] Releasing all the locks
[locks-and-latches] All the locks released

---------------------------------------------------------------------
To unsubscribe, e-mail: dev-unsubscribe@synapse.apache.org
For additional commands, e-mail: dev-help@synapse.apache.org


Mime
View raw message