synapse-dev mailing list archives

Site index · List index
Message view « Date » · « Thread »
Top « Date » · « Thread »
From Apache Jenkins Server <jenk...@builds.apache.org>
Subject Build failed in Jenkins: Synapse - Trunk #4943
Date Sat, 02 May 2015 13:59:02 GMT
See <https://builds.apache.org/job/Synapse%20-%20Trunk/4943/>

------------------------------------------
[...truncated 1471361 lines...]
Received 0 blocks and 39690 bytes
Compression is 0.0%
Took 0.12 sec
[JENKINS] Archiving <https://builds.apache.org/job/Synapse%20-%20Trunk/ws/java/modules/tasks/pom.xml>
to org.apache.synapse/synapse-tasks/2.2.0-SNAPSHOT/synapse-tasks-2.2.0-SNAPSHOT.pom
[JENKINS] Archiving <https://builds.apache.org/job/Synapse%20-%20Trunk/ws/java/modules/tasks/target/synapse-tasks-2.2.0-SNAPSHOT.jar>
to org.apache.synapse/synapse-tasks/2.2.0-SNAPSHOT/synapse-tasks-2.2.0-SNAPSHOT.jar
Sending artifact delta relative to Synapse - Trunk » Apache Synapse - Tasks #4942
Archived 2 artifacts
Archive block size is 32768
Received 0 blocks and 38284 bytes
Compression is 0.0%
Took 0.13 sec
[JENKINS] Archiving <https://builds.apache.org/job/Synapse%20-%20Trunk/ws/java/modules/extensions/pom.xml>
to org.apache.synapse/synapse-extensions/2.2.0-SNAPSHOT/synapse-extensions-2.2.0-SNAPSHOT.pom
[JENKINS] Archiving <https://builds.apache.org/job/Synapse%20-%20Trunk/ws/java/modules/extensions/target/synapse-extensions-2.2.0-SNAPSHOT.jar>
to org.apache.synapse/synapse-extensions/2.2.0-SNAPSHOT/synapse-extensions-2.2.0-SNAPSHOT.jar
Sending artifact delta relative to Synapse - Trunk » Apache Synapse - Extensions #4942
Archived 2 artifacts
Archive block size is 32768
Received 0 blocks and 81273 bytes
Compression is 0.0%
Took 0.12 sec
[JENKINS] Archiving <https://builds.apache.org/job/Synapse%20-%20Trunk/ws/java/modules/experimental/pom.xml>
to org.apache.synapse/synapse-experimental/2.2.0-SNAPSHOT/synapse-experimental-2.2.0-SNAPSHOT.pom
[JENKINS] Archiving <https://builds.apache.org/job/Synapse%20-%20Trunk/ws/java/modules/experimental/target/synapse-experimental-2.2.0-SNAPSHOT.jar>
to org.apache.synapse/synapse-experimental/2.2.0-SNAPSHOT/synapse-experimental-2.2.0-SNAPSHOT.jar
Sending artifact delta relative to Synapse - Trunk » Apache Synapse - Experimental code #4942
Archived 2 artifacts
Archive block size is 32768
Received 0 blocks and 32868 bytes
Compression is 0.0%
Took 78 ms
[JENKINS] Archiving <https://builds.apache.org/job/Synapse%20-%20Trunk/ws/.repository/org/apache/synapse/Apache-Synapse/2.2.0-SNAPSHOT/Apache-Synapse-2.2.0-SNAPSHOT.pom>
to org.apache.synapse/Apache-Synapse/2.2.0-SNAPSHOT/Apache-Synapse-2.2.0-SNAPSHOT.pom
<https://builds.apache.org/job/Synapse%20-%20Trunk/ws/.repository/org/apache/synapse/Apache-Synapse/2.2.0-SNAPSHOT/Apache-Synapse-2.2.0-SNAPSHOT.pom>
is not inside <https://builds.apache.org/job/Synapse%20-%20Trunk/ws/java/;> will archive
in a separate pass
Sending artifact delta relative to Synapse - Trunk » Apache Synapse #4942
Archived 1 artifacts
Archive block size is 32768
Received 1 blocks and 21185 bytes
Compression is 60.7%
Took 0.12 sec
[JENKINS] Archiving <https://builds.apache.org/job/Synapse%20-%20Trunk/ws/java/modules/commons/pom.xml>
to org.apache.synapse/synapse-commons/2.2.0-SNAPSHOT/synapse-commons-2.2.0-SNAPSHOT.pom
[JENKINS] Archiving <https://builds.apache.org/job/Synapse%20-%20Trunk/ws/java/modules/commons/target/synapse-commons-2.2.0-SNAPSHOT.jar>
to org.apache.synapse/synapse-commons/2.2.0-SNAPSHOT/synapse-commons-2.2.0-SNAPSHOT.jar
Sending artifact delta relative to Synapse - Trunk » Apache Synapse - Commons #4942
Archived 2 artifacts
Archive block size is 32768
Received 0 blocks and 180375 bytes
Compression is 0.0%
Took 0.2 sec
[JENKINS] Archiving <https://builds.apache.org/job/Synapse%20-%20Trunk/ws/java/modules/transports/core/nhttp/pom.xml>
to org.apache.synapse/synapse-nhttp-transport/2.2.0-SNAPSHOT/synapse-nhttp-transport-2.2.0-SNAPSHOT.pom
[JENKINS] Archiving <https://builds.apache.org/job/Synapse%20-%20Trunk/ws/java/modules/transports/core/nhttp/target/synapse-nhttp-transport-2.2.0-SNAPSHOT.jar>
to org.apache.synapse/synapse-nhttp-transport/2.2.0-SNAPSHOT/synapse-nhttp-transport-2.2.0-SNAPSHOT.jar
[JENKINS] Archiving <https://builds.apache.org/job/Synapse%20-%20Trunk/ws/java/modules/transports/core/nhttp/target/synapse-nhttp-transport-2.2.0-SNAPSHOT-testkit-logs.zip>
to org.apache.synapse/synapse-nhttp-transport/2.2.0-SNAPSHOT/synapse-nhttp-transport-2.2.0-SNAPSHOT-testkit-logs.zip
Sending artifact delta relative to Synapse - Trunk » Apache Synapse - Non-blocking HTTP/s
Transport #4942
Archived 3 artifacts
Archive block size is 32768
Received 0 blocks and 1467926 bytes
Compression is 0.0%
Took 0.87 sec
[JENKINS] Archiving <https://builds.apache.org/job/Synapse%20-%20Trunk/ws/.repository/org/apache/synapse/synapse-package-skeleton/2.2.0-SNAPSHOT/synapse-package-skeleton-2.2.0-SNAPSHOT.pom>
to org.apache.synapse/synapse-package-skeleton/2.2.0-SNAPSHOT/synapse-package-skeleton-2.2.0-SNAPSHOT.pom
[JENKINS] Archiving <https://builds.apache.org/job/Synapse%20-%20Trunk/ws/java/modules/packaging/package-skeleton/target/synapse-package-skeleton-2.2.0-SNAPSHOT-skeleton.zip>
to org.apache.synapse/synapse-package-skeleton/2.2.0-SNAPSHOT/synapse-package-skeleton-2.2.0-SNAPSHOT-skeleton.zip
<https://builds.apache.org/job/Synapse%20-%20Trunk/ws/.repository/org/apache/synapse/synapse-package-skeleton/2.2.0-SNAPSHOT/synapse-package-skeleton-2.2.0-SNAPSHOT.pom>
is not inside <https://builds.apache.org/job/Synapse%20-%20Trunk/ws/java/modules/packaging/package-skeleton/;>
will archive in a separate pass
Sending artifact delta relative to Synapse - Trunk » Apache Synapse - Package skeleton ZIP
#4942
Archived 1 artifacts
Archive block size is 32768
Received 12 blocks and 69290 bytes
Compression is 85.0%
Took 0.24 sec
Sending artifact delta relative to Synapse - Trunk » Apache Synapse - Package skeleton ZIP
#4942
Archived 1 artifacts
Archive block size is 32768
Received 0 blocks and 3370 bytes
Compression is 0.0%
Took 27 ms
[JENKINS] Archiving <https://builds.apache.org/job/Synapse%20-%20Trunk/ws/.repository/org/apache/synapse/synapse-distribution/2.2.0-SNAPSHOT/synapse-distribution-2.2.0-SNAPSHOT.pom>
to org.apache.synapse/synapse-distribution/2.2.0-SNAPSHOT/synapse-distribution-2.2.0-SNAPSHOT.pom
[JENKINS] Archiving <https://builds.apache.org/job/Synapse%20-%20Trunk/ws/java/modules/distribution/target/synapse-2.2.0-SNAPSHOT-bin.zip>
to org.apache.synapse/synapse-distribution/2.2.0-SNAPSHOT/synapse-distribution-2.2.0-SNAPSHOT-bin.zip
<https://builds.apache.org/job/Synapse%20-%20Trunk/ws/.repository/org/apache/synapse/synapse-distribution/2.2.0-SNAPSHOT/synapse-distribution-2.2.0-SNAPSHOT.pom>
is not inside <https://builds.apache.org/job/Synapse%20-%20Trunk/ws/java/modules/distribution/;>
will archive in a separate pass
Sending artifact delta relative to Synapse - Trunk » Apache Synapse - Distribution #4942
Archived 1 artifacts
Archive block size is 32768
Received 829 blocks and 9003638 bytes
Compression is 75.1%
Took 7 sec
Sending artifact delta relative to Synapse - Trunk » Apache Synapse - Distribution #4942
Archived 1 artifacts
Archive block size is 32768
Received 0 blocks and 7441 bytes
Compression is 0.0%
Took 0.6 sec
[JENKINS] Archiving <https://builds.apache.org/job/Synapse%20-%20Trunk/ws/java/modules/war/pom.xml>
to org.apache.synapse/synapse-war/2.2.0-SNAPSHOT/synapse-war-2.2.0-SNAPSHOT.pom
[JENKINS] Archiving <https://builds.apache.org/job/Synapse%20-%20Trunk/ws/java/target/synapse.war>
to org.apache.synapse/synapse-war/2.2.0-SNAPSHOT/synapse-war-2.2.0-SNAPSHOT.war
<https://builds.apache.org/job/Synapse%20-%20Trunk/ws/java/target/synapse.war> is not
inside <https://builds.apache.org/job/Synapse%20-%20Trunk/ws/java/modules/war/;> will
archive in a separate pass
Sending artifact delta relative to Synapse - Trunk » Apache Synapse - Web Application #4942
Archived 1 artifacts
Archive block size is 32768
Received 0 blocks and 11207 bytes
Compression is 0.0%
Took 3.7 sec
Sending artifact delta relative to Synapse - Trunk » Apache Synapse - Web Application #4942
Archived 1 artifacts
Archive block size is 32768
Received 831 blocks and 7828296 bytes
Compression is 77.7%
Took 2.9 sec
[JENKINS] Archiving <https://builds.apache.org/job/Synapse%20-%20Trunk/ws/java/modules/patches/pom.xml>
to org.apache.synapse/synapse-patches/2.2.0-SNAPSHOT/synapse-patches-2.2.0-SNAPSHOT.pom
[JENKINS] Archiving <https://builds.apache.org/job/Synapse%20-%20Trunk/ws/java/modules/patches/target/synapse-patches-2.2.0-SNAPSHOT.jar>
to org.apache.synapse/synapse-patches/2.2.0-SNAPSHOT/synapse-patches-2.2.0-SNAPSHOT.jar
[JENKINS] Archiving <https://builds.apache.org/job/Synapse%20-%20Trunk/ws/java/modules/patches/target/synapse-patches-2.2.0-SNAPSHOT-jars.zip>
to org.apache.synapse/synapse-patches/2.2.0-SNAPSHOT/synapse-patches-2.2.0-SNAPSHOT-jars.zip
Sending artifact delta relative to Synapse - Trunk » Apache Synapse - Patches #4942
Archived 3 artifacts
Archive block size is 32768
Received 0 blocks and 33810 bytes
Compression is 0.0%
Took 0.16 sec
[JENKINS] Archiving <https://builds.apache.org/job/Synapse%20-%20Trunk/ws/java/modules/packaging/package-archetype/pom.xml>
to org.apache.synapse/synapse-package-archetype/2.2.0-SNAPSHOT/synapse-package-archetype-2.2.0-SNAPSHOT.pom
[JENKINS] Archiving <https://builds.apache.org/job/Synapse%20-%20Trunk/ws/java/modules/packaging/package-archetype/target/synapse-package-archetype-2.2.0-SNAPSHOT.jar>
to org.apache.synapse/synapse-package-archetype/2.2.0-SNAPSHOT/synapse-package-archetype-2.2.0-SNAPSHOT.jar
Sending artifact delta relative to Synapse - Trunk » Apache Synapse - Package archetype #4942
Archived 2 artifacts
Archive block size is 32768
Received 0 blocks and 20435 bytes
Compression is 0.0%
Took 0.14 sec
[JENKINS] Archiving <https://builds.apache.org/job/Synapse%20-%20Trunk/ws/java/modules/transports/optional/fix/pom.xml>
to org.apache.synapse/synapse-fix-transport/2.2.0-SNAPSHOT/synapse-fix-transport-2.2.0-SNAPSHOT.pom
[JENKINS] Archiving <https://builds.apache.org/job/Synapse%20-%20Trunk/ws/java/modules/transports/optional/fix/target/synapse-fix-transport-2.2.0-SNAPSHOT.jar>
to org.apache.synapse/synapse-fix-transport/2.2.0-SNAPSHOT/synapse-fix-transport-2.2.0-SNAPSHOT.jar
Sending artifact delta relative to Synapse - Trunk » Apache Synapse - FIX Transport #4942
Archived 2 artifacts
Archive block size is 32768
Received 0 blocks and 58955 bytes
Compression is 0.0%
Took 0.14 sec
[JENKINS] Archiving <https://builds.apache.org/job/Synapse%20-%20Trunk/ws/.repository/org/apache/synapse/synapse-transports/2.2.0-SNAPSHOT/synapse-transports-2.2.0-SNAPSHOT.pom>
to org.apache.synapse/synapse-transports/2.2.0-SNAPSHOT/synapse-transports-2.2.0-SNAPSHOT.pom
<https://builds.apache.org/job/Synapse%20-%20Trunk/ws/.repository/org/apache/synapse/synapse-transports/2.2.0-SNAPSHOT/synapse-transports-2.2.0-SNAPSHOT.pom>
is not inside <https://builds.apache.org/job/Synapse%20-%20Trunk/ws/java/modules/transports/;>
will archive in a separate pass
Sending artifact delta relative to Synapse - Trunk » Apache Synapse - Transports #4942
Archived 1 artifacts
Archive block size is 32768
Received 0 blocks and 2952 bytes
Compression is 0.0%
Took 71 ms
[JENKINS] Archiving <https://builds.apache.org/job/Synapse%20-%20Trunk/ws/java/modules/samples/pom.xml>
to org.apache.synapse/synapse-samples/2.2.0-SNAPSHOT/synapse-samples-2.2.0-SNAPSHOT.pom
[JENKINS] Archiving <https://builds.apache.org/job/Synapse%20-%20Trunk/ws/java/modules/samples/target/synapse-samples-2.2.0-SNAPSHOT.jar>
to org.apache.synapse/synapse-samples/2.2.0-SNAPSHOT/synapse-samples-2.2.0-SNAPSHOT.jar
Sending artifact delta relative to Synapse - Trunk » Apache Synapse - Samples #4942
Archived 2 artifacts
Archive block size is 32768
Received 0 blocks and 106990 bytes
Compression is 0.0%
Took 73 ms
[JENKINS] Archiving <https://builds.apache.org/job/Synapse%20-%20Trunk/ws/java/modules/securevault/pom.xml>
to org.apache.synapse/synapse-securevault/2.2.0-SNAPSHOT/synapse-securevault-2.2.0-SNAPSHOT.pom
[JENKINS] Archiving <https://builds.apache.org/job/Synapse%20-%20Trunk/ws/java/modules/securevault/target/synapse-securevault-2.2.0-SNAPSHOT.jar>
to org.apache.synapse/synapse-securevault/2.2.0-SNAPSHOT/synapse-securevault-2.2.0-SNAPSHOT.jar
Sending artifact delta relative to Synapse - Trunk » Apache Synapse - Secure Vault #4942
Archived 2 artifacts
Archive block size is 32768
Received 0 blocks and 91979 bytes
Compression is 0.0%
Took 57 ms
[JENKINS] Archiving <https://builds.apache.org/job/Synapse%20-%20Trunk/ws/.repository/org/apache/synapse/synapse-documentation/2.2.0-SNAPSHOT/synapse-documentation-2.2.0-SNAPSHOT.pom>
to org.apache.synapse/synapse-documentation/2.2.0-SNAPSHOT/synapse-documentation-2.2.0-SNAPSHOT.pom
[JENKINS] Archiving <https://builds.apache.org/job/Synapse%20-%20Trunk/ws/java/modules/documentation/target/synapse-documentation-2.2.0-SNAPSHOT-site.xml>
to org.apache.synapse/synapse-documentation/2.2.0-SNAPSHOT/synapse-documentation-2.2.0-SNAPSHOT-site.xml
[JENKINS] Archiving <https://builds.apache.org/job/Synapse%20-%20Trunk/ws/java/modules/documentation/target/synapse-documentation-2.2.0-SNAPSHOT-docs.zip>
to org.apache.synapse/synapse-documentation/2.2.0-SNAPSHOT/synapse-documentation-2.2.0-SNAPSHOT-docs.zip
<https://builds.apache.org/job/Synapse%20-%20Trunk/ws/.repository/org/apache/synapse/synapse-documentation/2.2.0-SNAPSHOT/synapse-documentation-2.2.0-SNAPSHOT.pom>
is not inside <https://builds.apache.org/job/Synapse%20-%20Trunk/ws/java/modules/documentation/;>
will archive in a separate pass
Sending artifact delta relative to Synapse - Trunk » Apache Synapse - Documentation #4942
Archived 2 artifacts
Archive block size is 32768
Received 3 blocks and 778313 bytes
Compression is 11.2%
Took 0.32 sec
Sending artifact delta relative to Synapse - Trunk » Apache Synapse - Documentation #4942
Archived 1 artifacts
Archive block size is 32768
Received 0 blocks and 4459 bytes
Compression is 0.0%
Took 30 ms
[JENKINS] Archiving <https://builds.apache.org/job/Synapse%20-%20Trunk/ws/java/modules/transports/core/pipe/pom.xml>
to org.apache.synapse/synapse-pipe-transport/2.2.0-SNAPSHOT/synapse-pipe-transport-2.2.0-SNAPSHOT.pom
[JENKINS] Archiving <https://builds.apache.org/job/Synapse%20-%20Trunk/ws/java/modules/transports/core/pipe/target/synapse-pipe-transport-2.2.0-SNAPSHOT.jar>
to org.apache.synapse/synapse-pipe-transport/2.2.0-SNAPSHOT/synapse-pipe-transport-2.2.0-SNAPSHOT.jar
Sending artifact delta relative to Synapse - Trunk » Apache Synapse - PIPE Transport #4942
Archived 2 artifacts
Archive block size is 32768
Received 0 blocks and 23552 bytes
Compression is 0.0%
Took 97 ms
[JENKINS] Archiving <https://builds.apache.org/job/Synapse%20-%20Trunk/ws/java/modules/integration/pom.xml>
to org.apache.synapse/synapse-integration/2.2.0-SNAPSHOT/synapse-integration-2.2.0-SNAPSHOT.pom
[JENKINS] Archiving <https://builds.apache.org/job/Synapse%20-%20Trunk/ws/java/modules/integration/target/synapse-integration-2.2.0-SNAPSHOT.jar>
to org.apache.synapse/synapse-integration/2.2.0-SNAPSHOT/synapse-integration-2.2.0-SNAPSHOT.jar
Sending artifact delta relative to Synapse - Trunk » Apache Synapse - Integration #4942
Archived 2 artifacts
Archive block size is 32768
Received 0 blocks and 32973 bytes
Compression is 0.0%
Took 52 ms
[JENKINS] Archiving <https://builds.apache.org/job/Synapse%20-%20Trunk/ws/java/modules/transports/optional/amqp/pom.xml>
to org.apache.synapse/synapse-amqp-transport/2.2.0-SNAPSHOT/synapse-amqp-transport-2.2.0-SNAPSHOT.pom
[JENKINS] Archiving <https://builds.apache.org/job/Synapse%20-%20Trunk/ws/java/modules/transports/optional/amqp/target/synapse-amqp-transport-2.2.0-SNAPSHOT.jar>
to org.apache.synapse/synapse-amqp-transport/2.2.0-SNAPSHOT/synapse-amqp-transport-2.2.0-SNAPSHOT.jar
Sending artifact delta relative to Synapse - Trunk » Apache Synapse - AMQP Transport #4942
Archived 2 artifacts
Archive block size is 32768
Received 0 blocks and 73522 bytes
Compression is 0.0%
Took 76 ms
[JENKINS] Archiving <https://builds.apache.org/job/Synapse%20-%20Trunk/ws/java/modules/core/pom.xml>
to org.apache.synapse/synapse-core/2.2.0-SNAPSHOT/synapse-core-2.2.0-SNAPSHOT.pom
[JENKINS] Archiving <https://builds.apache.org/job/Synapse%20-%20Trunk/ws/java/modules/core/target/synapse-core-2.2.0-SNAPSHOT.jar>
to org.apache.synapse/synapse-core/2.2.0-SNAPSHOT/synapse-core-2.2.0-SNAPSHOT.jar
[JENKINS] Archiving <https://builds.apache.org/job/Synapse%20-%20Trunk/ws/java/modules/core/target/synapse-core-2.2.0-SNAPSHOT-tests.jar>
to org.apache.synapse/synapse-core/2.2.0-SNAPSHOT/synapse-core-2.2.0-SNAPSHOT-tests.jar
Sending artifact delta relative to Synapse - Trunk » Apache Synapse - Core #4942
Archived 3 artifacts
Archive block size is 32768
Received 0 blocks and 1448030 bytes
Compression is 0.0%
Took 0.61 sec
[JENKINS] Archiving <https://builds.apache.org/job/Synapse%20-%20Trunk/ws/java/modules/transports/core/vfs/pom.xml>
to org.apache.synapse/synapse-vfs-transport/2.2.0-SNAPSHOT/synapse-vfs-transport-2.2.0-SNAPSHOT.pom
[JENKINS] Archiving <https://builds.apache.org/job/Synapse%20-%20Trunk/ws/java/modules/transports/core/vfs/target/synapse-vfs-transport-2.2.0-SNAPSHOT.jar>
to org.apache.synapse/synapse-vfs-transport/2.2.0-SNAPSHOT/synapse-vfs-transport-2.2.0-SNAPSHOT.jar
[JENKINS] Archiving <https://builds.apache.org/job/Synapse%20-%20Trunk/ws/java/modules/transports/core/vfs/target/synapse-vfs-transport-2.2.0-SNAPSHOT-testkit-logs.zip>
to org.apache.synapse/synapse-vfs-transport/2.2.0-SNAPSHOT/synapse-vfs-transport-2.2.0-SNAPSHOT-testkit-logs.zip
Sending artifact delta relative to Synapse - Trunk » Apache Synapse - VFS Transport #4942
Archived 3 artifacts
Archive block size is 32768
Received 0 blocks and 413947 bytes
Compression is 0.0%
Took 0.39 sec
channel stopped
[locks-and-latches] Releasing all the locks
[locks-and-latches] All the locks released
Maven RedeployPublisher use remote ubuntu-1 maven settings from : /home/jenkins/.m2/settings.xml
[INFO] Deployment in https://repository.apache.org/content/repositories/snapshots (id=apache.snapshots.https,uniqueVersion=false)
Deploying the main artifact Apache-Synapse-2.2.0-SNAPSHOT.pom
[INFO] Deployment in https://repository.apache.org/content/repositories/snapshots (id=apache.snapshots.https,uniqueVersion=false)
Deploying the main artifact synapse-amqp-transport-2.2.0-SNAPSHOT.jar
[INFO] Deployment in https://repository.apache.org/content/repositories/snapshots (id=apache.snapshots.https,uniqueVersion=false)
Deploying the main artifact synapse-commons-2.2.0-SNAPSHOT.jar
[INFO] Deployment in https://repository.apache.org/content/repositories/snapshots (id=apache.snapshots.https,uniqueVersion=false)
Deploying the main artifact synapse-config-migrator-2.2.0-SNAPSHOT.jar
[INFO] Deployment in https://repository.apache.org/content/repositories/snapshots (id=apache.snapshots.https,uniqueVersion=false)
Deploying the main artifact synapse-core-2.2.0-SNAPSHOT.jar
Deploying the main artifact synapse-core-2.2.0-SNAPSHOT-tests.jar
[INFO] Deployment in https://repository.apache.org/content/repositories/snapshots (id=apache.snapshots.https,uniqueVersion=false)
Deploying the main artifact synapse-distribution-2.2.0-SNAPSHOT.pom
Deploying the main artifact synapse-distribution-2.2.0-SNAPSHOT-bin.zip
[INFO] Deployment in https://repository.apache.org/content/repositories/snapshots (id=apache.snapshots.https,uniqueVersion=false)
Deploying the main artifact synapse-documentation-2.2.0-SNAPSHOT.pom
ERROR: Error deploying artifact: Failed to transfer file: https://repository.apache.org/content/repositories/snapshots/org/apache/synapse/synapse-documentation/2.2.0-SNAPSHOT/synapse-documentation-2.2.0-SNAPSHOT.pom.sha1.
Return code is: 502, ReasonPhrase: Proxy Error.
org.apache.maven.artifact.deployer.ArtifactDeploymentException: Error deploying artifact:
Failed to transfer file: https://repository.apache.org/content/repositories/snapshots/org/apache/synapse/synapse-documentation/2.2.0-SNAPSHOT/synapse-documentation-2.2.0-SNAPSHOT.pom.sha1.
Return code is: 502, ReasonPhrase: Proxy Error.
	at hudson.maven.artifact.deployer.DefaultArtifactDeployer.deploy(DefaultArtifactDeployer.java:175)
	at hudson.maven.reporters.MavenArtifactRecord.deploy(MavenArtifactRecord.java:193)
	at hudson.maven.RedeployPublisher.perform(RedeployPublisher.java:176)
	at hudson.tasks.BuildStepMonitor$1.perform(BuildStepMonitor.java:20)
	at hudson.model.AbstractBuild$AbstractBuildExecution.perform(AbstractBuild.java:756)
	at hudson.model.AbstractBuild$AbstractBuildExecution.performAllBuildSteps(AbstractBuild.java:720)
	at hudson.maven.MavenModuleSetBuild$MavenModuleSetBuildExecution.post2(MavenModuleSetBuild.java:1037)
	at hudson.model.AbstractBuild$AbstractBuildExecution.post(AbstractBuild.java:669)
	at hudson.model.Run.execute(Run.java:1731)
	at hudson.maven.MavenModuleSetBuild.run(MavenModuleSetBuild.java:529)
	at hudson.model.ResourceController.execute(ResourceController.java:88)
	at hudson.model.Executor.run(Executor.java:232)
Caused by: org.apache.maven.wagon.TransferFailedException: Failed to transfer file: https://repository.apache.org/content/repositories/snapshots/org/apache/synapse/synapse-documentation/2.2.0-SNAPSHOT/synapse-documentation-2.2.0-SNAPSHOT.pom.sha1.
Return code is: 502, ReasonPhrase: Proxy Error.
	at org.apache.maven.wagon.shared.http4.AbstractHttpClientWagon.put(AbstractHttpClientWagon.java:626)
	at org.apache.maven.wagon.shared.http4.AbstractHttpClientWagon.put(AbstractHttpClientWagon.java:524)
	at org.apache.maven.wagon.shared.http4.AbstractHttpClientWagon.put(AbstractHttpClientWagon.java:505)
	at org.apache.maven.wagon.shared.http4.AbstractHttpClientWagon.put(AbstractHttpClientWagon.java:485)
	at org.apache.maven.repository.legacy.DefaultWagonManager.putRemoteFile(DefaultWagonManager.java:569)
	at org.apache.maven.repository.legacy.DefaultWagonManager.putArtifact(DefaultWagonManager.java:494)
	at hudson.maven.artifact.deployer.DefaultArtifactDeployer.deploy(DefaultArtifactDeployer.java:160)
	... 11 more
[INFO] Deployment failed after 3 min 15 sec
Build step 'Deploy artifacts to Maven repository' changed build result to FAILURE

---------------------------------------------------------------------
To unsubscribe, e-mail: dev-unsubscribe@synapse.apache.org
For additional commands, e-mail: dev-help@synapse.apache.org


Mime
View raw message