synapse-dev mailing list archives

Site index · List index
Message view « Date » · « Thread »
Top « Date » · « Thread »
From Apache Jenkins Server <jenk...@builds.apache.org>
Subject Build failed in Jenkins: Synapse - Trunk #4812
Date Thu, 13 Mar 2014 13:01:51 GMT
See <https://builds.apache.org/job/Synapse%20-%20Trunk/4812/>

------------------------------------------
[...truncated 823 lines...]
[INFO] Deleting <https://builds.apache.org/job/Synapse%20-%20Trunk/ws/java/modules/tasks/target>
[INFO] [remote-resources:process {execution: default}]
[WARNING] org.apache.velocity.runtime.exception.ReferenceException: reference : template =
META-INF/DEPENDENCIES.vm [line 40,column 14] : $license.name is not a valid reference.
[debug] execute contextualize
[INFO] [resources:resources {execution: default-resources}]
[INFO] Using 'UTF-8' encoding to copy filtered resources.
[INFO] Copying 0 resource
[INFO] Copying 3 resources
[INFO] [compiler:compile {execution: default-compile}]
[INFO] Compiling 16 source files to <https://builds.apache.org/job/Synapse%20-%20Trunk/ws/java/modules/tasks/target/classes>
[debug] execute contextualize
[INFO] [resources:testResources {execution: default-testResources}]
[INFO] Using 'UTF-8' encoding to copy filtered resources.
[INFO] skip non existing resourceDirectory <https://builds.apache.org/job/Synapse%20-%20Trunk/ws/java/modules/tasks/src/test/resources>
[INFO] Copying 3 resources
[INFO] [compiler:testCompile {execution: default-testCompile}]
[INFO] No sources to compile
[INFO] [surefire:test {execution: default-test}]
[INFO] Surefire report directory: <https://builds.apache.org/job/Synapse%20-%20Trunk/ws/java/modules/tasks/target/surefire-reports>

-------------------------------------------------------
 T E S T S
-------------------------------------------------------

[JENKINS] Recording test resultsResults :

Tests run: 0, Failures: 0, Errors: 0, Skipped: 0

[INFO] [bundle:bundle {execution: default-bundle}]

[INFO] [install:install {execution: default-install}]
[INFO] Installing <https://builds.apache.org/job/Synapse%20-%20Trunk/ws/java/modules/tasks/target/synapse-tasks-2.2.0-SNAPSHOT.jar>
to <https://builds.apache.org/job/Synapse%20-%20Trunk/ws/.repository/org/apache/synapse/synapse-tasks/2.2.0-SNAPSHOT/synapse-tasks-2.2.0-SNAPSHOT.jar>
[INFO] [bundle:install {execution: default-install}]
[INFO] Installing org/apache/synapse/synapse-tasks/2.2.0-SNAPSHOT/synapse-tasks-2.2.0-SNAPSHOT.jar
[INFO] Writing OBR metadata
[INFO] [site:site {execution: default-site}]
[INFO] Parent project loaded from repository: org.apache:apache:pom:9
[INFO] Relativizing decoration links with respect to project URL: http://synapse.apache.org/modules/synapse-tasks
[INFO] Rendering site with org.apache.maven.skins:maven-default-skin:jar:1.0 skin.
[INFO] Generating "About" report.
[INFO] Generating "Source Repository" report.
[INFO] Generating "Plugin Management" report.
[INFO] Generating "Mailing Lists" report.
[INFO] Generating "Issue Tracking" report.
[INFO] Generating "Project Plugins" report.
[INFO] Generating "Dependency Convergence" report.
[INFO] Generating "Project Summary" report.
[INFO] Generating "Dependency Management" report.
[INFO] Generating "Dependencies" report.
[INFO] Generating "Project License" report.
[INFO] Generating "Project Team" report.
[INFO] Generating "Continuous Integration" report.
[FINDBUGS] No report found for mojo site
[JENKINS] Archiving site from <https://builds.apache.org/job/Synapse%20-%20Trunk/ws/java/modules/tasks/target/site>
to /x1/jenkins/jenkins-home/jobs/Synapse - Trunk/site/synapse-tasks
[INFO] ------------------------------------------------------------------------
[INFO] Building Apache Synapse - Core
[INFO]    task-segment: [clean, install, site]
[INFO] ------------------------------------------------------------------------
[INFO] [clean:clean {execution: default-clean}]
[INFO] Deleting <https://builds.apache.org/job/Synapse%20-%20Trunk/ws/java/modules/core/target>
[INFO] [remote-resources:process {execution: default}]
[INFO] snapshot org.apache.synapse:synapse-tasks:2.2.0-SNAPSHOT: checking for updates from
wso2-m2-snapshots
Downloading: http://repository.apache.org/snapshots/org/apache/ws/commons/axiom/axiom-dom/1.2.15-SNAPSHOT/axiom-dom-1.2.15-20140312.215909-458.jar
Downloading: http://repository.apache.org/snapshots/org/apache/axis2/axis2-saaj/1.7.0-SNAPSHOT/axis2-saaj-1.7.0-20140313.120823-1744.jar
[INFO] snapshot org.apache.synapse:synapse-tasks:2.2.0-SNAPSHOT: checking for updates from
apache.snapshots
89K downloaded  (axis2-saaj-1.7.0-20140313.120823-1744.jar)
Downloading: http://repository.apache.org/snapshots/org/apache/axis2/axis2-clustering/1.7.0-SNAPSHOT/axis2-clustering-1.7.0-20140313.120744-1762.jar
237K downloaded  (axiom-dom-1.2.15-20140312.215909-458.jar)
[INFO] snapshot org.apache.synapse:synapse-nhttp-transport:2.2.0-SNAPSHOT: checking for updates
from wso2-m2-snapshots
105K downloaded  (axis2-clustering-1.7.0-20140313.120744-1762.jar)
Downloading: http://repository.apache.org/snapshots/org/apache/axis2/axis2-transport-jms/1.7.0-SNAPSHOT/axis2-transport-jms-1.7.0-20140313.123847-1189.jar
[INFO] snapshot org.apache.synapse:synapse-nhttp-transport:2.2.0-SNAPSHOT: checking for updates
from apache.snapshots
78K downloaded  (axis2-transport-jms-1.7.0-20140313.123847-1189.jar)
Downloading: http://repository.apache.org/snapshots/org/apache/axis2/axis2-transport-mail/1.7.0-SNAPSHOT/axis2-transport-mail-1.7.0-20140313.124003-1190.jar
Downloading: http://repository.apache.org/snapshots/org/apache/synapse/synapse-nhttp-transport/2.2.0-SNAPSHOT/synapse-nhttp-transport-2.2.0-20130401.112136-422.jar
40K downloaded  (axis2-transport-mail-1.7.0-20140313.124003-1190.jar)
Downloading: http://repository.apache.org/snapshots/org/apache/axis2/axis2-transport-local/1.7.0-SNAPSHOT/axis2-transport-local-1.7.0-20140313.120325-1795.jar
19K downloaded  (axis2-transport-local-1.7.0-20140313.120325-1795.jar)
Downloading: http://repository.apache.org/snapshots/org/apache/axis2/axis2-adb/1.7.0-SNAPSHOT/axis2-adb-1.7.0-20140313.120312-1802.jar
211K downloaded  (synapse-nhttp-transport-2.2.0-20130401.112136-422.jar)
[INFO] snapshot org.apache.synapse:synapse-vfs-transport:2.2.0-SNAPSHOT: checking for updates
from wso2-m2-snapshots
[INFO] snapshot org.apache.synapse:synapse-vfs-transport:2.2.0-SNAPSHOT: checking for updates
from apache.snapshots
660K downloaded  (axis2-adb-1.7.0-20140313.120312-1802.jar)
[WARNING] org.apache.velocity.runtime.exception.ReferenceException: reference : template =
META-INF/DEPENDENCIES.vm [line 40,column 14] : $license.name is not a valid reference.
[debug] execute contextualize
[INFO] [resources:resources {execution: default-resources}]
[INFO] Using 'UTF-8' encoding to copy filtered resources.
[INFO] Copying 1 resource
[INFO] Copying 3 resources
[INFO] [compiler:compile {execution: default-compile}]
[INFO] Compiling 509 source files to <https://builds.apache.org/job/Synapse%20-%20Trunk/ws/java/modules/core/target/classes>
[INFO] -------------------------------------------------------------
[WARNING] COMPILATION WARNING : 
[INFO] -------------------------------------------------------------
[WARNING] <https://builds.apache.org/job/Synapse%20-%20Trunk/ws/java/modules/core/src/main/java/org/apache/synapse/config/xml/MediatorFactoryFinder.java>:[31,15]
sun.misc.Service is Sun proprietary API and may be removed in a future release
[WARNING] <https://builds.apache.org/job/Synapse%20-%20Trunk/ws/java/modules/core/src/main/java/org/apache/synapse/config/xml/StartupFinder.java>:[37,15]
sun.misc.Service is Sun proprietary API and may be removed in a future release
[WARNING] <https://builds.apache.org/job/Synapse%20-%20Trunk/ws/java/modules/core/src/main/java/org/apache/synapse/config/xml/ConfigurationFactoryAndSerializerFinder.java>:[29,15]
sun.misc.Service is Sun proprietary API and may be removed in a future release
[WARNING] <https://builds.apache.org/job/Synapse%20-%20Trunk/ws/java/modules/core/src/main/java/org/apache/synapse/config/xml/MediatorSerializerFinder.java>:[27,15]
sun.misc.Service is Sun proprietary API and may be removed in a future release
[WARNING] <https://builds.apache.org/job/Synapse%20-%20Trunk/ws/java/modules/core/src/main/java/org/apache/synapse/config/xml/MediatorFactoryFinder.java>:[140,22]
sun.misc.Service is Sun proprietary API and may be removed in a future release
[WARNING] <https://builds.apache.org/job/Synapse%20-%20Trunk/ws/java/modules/core/src/main/java/org/apache/synapse/config/xml/StartupFinder.java>:[115,25]
sun.misc.Service is Sun proprietary API and may be removed in a future release
[WARNING] <https://builds.apache.org/job/Synapse%20-%20Trunk/ws/java/modules/core/src/main/java/org/apache/synapse/config/xml/ConfigurationFactoryAndSerializerFinder.java>:[117,22]
sun.misc.Service is Sun proprietary API and may be removed in a future release
[WARNING] <https://builds.apache.org/job/Synapse%20-%20Trunk/ws/java/modules/core/src/main/java/org/apache/synapse/config/xml/MediatorSerializerFinder.java>:[116,22]
sun.misc.Service is Sun proprietary API and may be removed in a future release
[INFO] 8 warnings 
[INFO] -------------------------------------------------------------
[INFO] -------------------------------------------------------------
[ERROR] COMPILATION ERROR : 
[INFO] -------------------------------------------------------------
[ERROR] <https://builds.apache.org/job/Synapse%20-%20Trunk/ws/java/modules/core/src/main/java/org/apache/synapse/mediators/AbstractListMediator.java>:[28,49]
package org.apache.synapse.transport.passthru.util does not exist
[ERROR] <https://builds.apache.org/job/Synapse%20-%20Trunk/ws/java/modules/core/src/main/java/org/apache/synapse/endpoints/AbstractEndpoint.java>:[39,49]
package org.apache.synapse.transport.passthru.util does not exist
[ERROR] <https://builds.apache.org/job/Synapse%20-%20Trunk/ws/java/modules/core/src/main/java/org/apache/synapse/endpoints/AbstractEndpoint.java>:[40,49]
package org.apache.synapse.transport.passthru.util does not exist
[ERROR] <https://builds.apache.org/job/Synapse%20-%20Trunk/ws/java/modules/core/src/main/java/org/apache/synapse/core/relay/ServiceRequestEarlyBuilder.java>:[32,49]
package org.apache.synapse.transport.passthru.util does not exist
[ERROR] <https://builds.apache.org/job/Synapse%20-%20Trunk/ws/java/modules/core/src/main/java/org/apache/synapse/core/relay/ServiceRequestEarlyBuilder.java>:[33,49]
package org.apache.synapse.transport.passthru.util does not exist
[ERROR] <https://builds.apache.org/job/Synapse%20-%20Trunk/ws/java/modules/core/src/main/java/org/apache/synapse/endpoints/SALoadbalanceEndpoint.java>:[33,49]
package org.apache.synapse.transport.passthru.util does not exist
[ERROR] <https://builds.apache.org/job/Synapse%20-%20Trunk/ws/java/modules/core/src/main/java/org/apache/synapse/util/MessageHelper.java>:[24,44]
package org.apache.synapse.transport.passthru does not exist
[ERROR] <https://builds.apache.org/job/Synapse%20-%20Trunk/ws/java/modules/core/src/main/java/org/apache/synapse/util/MessageHelper.java>:[25,44]
package org.apache.synapse.transport.passthru does not exist
[ERROR] <https://builds.apache.org/job/Synapse%20-%20Trunk/ws/java/modules/core/src/main/java/org/apache/synapse/util/MessageHelper.java>:[26,44]
package org.apache.synapse.transport.passthru does not exist
[ERROR] <https://builds.apache.org/job/Synapse%20-%20Trunk/ws/java/modules/core/src/main/java/org/apache/synapse/util/MessageHelper.java>:[27,51]
package org.apache.synapse.transport.passthru.config does not exist
[ERROR] <https://builds.apache.org/job/Synapse%20-%20Trunk/ws/java/modules/core/src/main/java/org/apache/synapse/core/axis2/Axis2SynapseEnvironment.java>:[46,49]
package org.apache.synapse.transport.passthru.util does not exist
[ERROR] <https://builds.apache.org/job/Synapse%20-%20Trunk/ws/java/modules/core/src/main/java/org/apache/synapse/mediators/AbstractListMediator.java>:[62,20]
cannot find symbol
symbol  : variable RelayUtils
location: class org.apache.synapse.mediators.AbstractListMediator
[ERROR] <https://builds.apache.org/job/Synapse%20-%20Trunk/ws/java/modules/core/src/main/java/org/apache/synapse/endpoints/AbstractEndpoint.java>:[292,13]
cannot find symbol
symbol  : variable RelayUtils
location: class org.apache.synapse.endpoints.AbstractEndpoint
[ERROR] <https://builds.apache.org/job/Synapse%20-%20Trunk/ws/java/modules/core/src/main/java/org/apache/synapse/endpoints/AbstractEndpoint.java>:[293,37]
cannot find symbol
symbol  : variable RelayConstants
location: class org.apache.synapse.endpoints.AbstractEndpoint
[ERROR] <https://builds.apache.org/job/Synapse%20-%20Trunk/ws/java/modules/core/src/main/java/org/apache/synapse/core/relay/ServiceRequestEarlyBuilder.java>:[83,43]
cannot find symbol
symbol  : variable RelayConstants
location: class org.apache.synapse.core.relay.ServiceRequestEarlyBuilder
[ERROR] <https://builds.apache.org/job/Synapse%20-%20Trunk/ws/java/modules/core/src/main/java/org/apache/synapse/core/relay/ServiceRequestEarlyBuilder.java>:[104,12]
cannot find symbol
symbol  : variable RelayUtils
location: class org.apache.synapse.core.relay.ServiceRequestEarlyBuilder
[ERROR] <https://builds.apache.org/job/Synapse%20-%20Trunk/ws/java/modules/core/src/main/java/org/apache/synapse/endpoints/SALoadbalanceEndpoint.java>:[112,13]
cannot find symbol
symbol  : variable RelayUtils
location: class org.apache.synapse.endpoints.SALoadbalanceEndpoint
[ERROR] <https://builds.apache.org/job/Synapse%20-%20Trunk/ws/java/modules/core/src/main/java/org/apache/synapse/util/MessageHelper.java>:[148,29]
cannot find symbol
symbol  : variable PassThroughConstants
location: class org.apache.synapse.util.MessageHelper
[ERROR] <https://builds.apache.org/job/Synapse%20-%20Trunk/ws/java/modules/core/src/main/java/org/apache/synapse/util/MessageHelper.java>:[152,12]
cannot find symbol
symbol  : class SourceConfiguration
location: class org.apache.synapse.util.MessageHelper
[ERROR] <https://builds.apache.org/job/Synapse%20-%20Trunk/ws/java/modules/core/src/main/java/org/apache/synapse/util/MessageHelper.java>:[152,55]
cannot find symbol
symbol  : class SourceConfiguration
location: class org.apache.synapse.util.MessageHelper
[ERROR] <https://builds.apache.org/job/Synapse%20-%20Trunk/ws/java/modules/core/src/main/java/org/apache/synapse/util/MessageHelper.java>:[154,12]
cannot find symbol
symbol  : class Pipe
location: class org.apache.synapse.util.MessageHelper
[ERROR] <https://builds.apache.org/job/Synapse%20-%20Trunk/ws/java/modules/core/src/main/java/org/apache/synapse/util/MessageHelper.java>:[154,28]
cannot find symbol
symbol  : class Pipe
location: class org.apache.synapse.util.MessageHelper
[ERROR] <https://builds.apache.org/job/Synapse%20-%20Trunk/ws/java/modules/core/src/main/java/org/apache/synapse/util/MessageHelper.java>:[155,30]
cannot find symbol
symbol  : variable PassThroughConstants
location: class org.apache.synapse.util.MessageHelper
[ERROR] <https://builds.apache.org/job/Synapse%20-%20Trunk/ws/java/modules/core/src/main/java/org/apache/synapse/core/axis2/Axis2SynapseEnvironment.java>:[314,12]
cannot find symbol
symbol  : variable RelayUtils
location: class org.apache.synapse.core.axis2.Axis2SynapseEnvironment
[INFO] 24 errors 
[INFO] -------------------------------------------------------------
[INFO] ------------------------------------------------------------------------
[ERROR] BUILD FAILURE
[INFO] ------------------------------------------------------------------------
[INFO] Compilation failure

<https://builds.apache.org/job/Synapse%20-%20Trunk/ws/java/modules/core/src/main/java/org/apache/synapse/mediators/AbstractListMediator.java>:[28,49]
package org.apache.synapse.transport.passthru.util does not exist
<https://builds.apache.org/job/Synapse%20-%20Trunk/ws/java/modules/core/src/main/java/org/apache/synapse/endpoints/AbstractEndpoint.java>:[39,49]
package org.apache.synapse.transport.passthru.util does not exist
<https://builds.apache.org/job/Synapse%20-%20Trunk/ws/java/modules/core/src/main/java/org/apache/synapse/endpoints/AbstractEndpoint.java>:[40,49]
package org.apache.synapse.transport.passthru.util does not exist
<https://builds.apache.org/job/Synapse%20-%20Trunk/ws/java/modules/core/src/main/java/org/apache/synapse/core/relay/ServiceRequestEarlyBuilder.java>:[32,49]
package org.apache.synapse.transport.passthru.util does not exist
<https://builds.apache.org/job/Synapse%20-%20Trunk/ws/java/modules/core/src/main/java/org/apache/synapse/core/relay/ServiceRequestEarlyBuilder.java>:[33,49]
package org.apache.synapse.transport.passthru.util does not exist
<https://builds.apache.org/job/Synapse%20-%20Trunk/ws/java/modules/core/src/main/java/org/apache/synapse/endpoints/SALoadbalanceEndpoint.java>:[33,49]
package org.apache.synapse.transport.passthru.util does not exist
<https://builds.apache.org/job/Synapse%20-%20Trunk/ws/java/modules/core/src/main/java/org/apache/synapse/util/MessageHelper.java>:[24,44]
package org.apache.synapse.transport.passthru does not exist
<https://builds.apache.org/job/Synapse%20-%20Trunk/ws/java/modules/core/src/main/java/org/apache/synapse/util/MessageHelper.java>:[25,44]
package org.apache.synapse.transport.passthru does not exist
<https://builds.apache.org/job/Synapse%20-%20Trunk/ws/java/modules/core/src/main/java/org/apache/synapse/util/MessageHelper.java>:[26,44]
package org.apache.synapse.transport.passthru does not exist
<https://builds.apache.org/job/Synapse%20-%20Trunk/ws/java/modules/core/src/main/java/org/apache/synapse/util/MessageHelper.java>:[27,51]
package org.apache.synapse.transport.passthru.config does not exist
<https://builds.apache.org/job/Synapse%20-%20Trunk/ws/java/modules/core/src/main/java/org/apache/synapse/core/axis2/Axis2SynapseEnvironment.java>:[46,49]
package org.apache.synapse.transport.passthru.util does not exist
<https://builds.apache.org/job/Synapse%20-%20Trunk/ws/java/modules/core/src/main/java/org/apache/synapse/mediators/AbstractListMediator.java>:[62,20]
cannot find symbol
symbol  : variable RelayUtils
location: class org.apache.synapse.mediators.AbstractListMediator
<https://builds.apache.org/job/Synapse%20-%20Trunk/ws/java/modules/core/src/main/java/org/apache/synapse/endpoints/AbstractEndpoint.java>:[292,13]
cannot find symbol
symbol  : variable RelayUtils
location: class org.apache.synapse.endpoints.AbstractEndpoint
<https://builds.apache.org/job/Synapse%20-%20Trunk/ws/java/modules/core/src/main/java/org/apache/synapse/endpoints/AbstractEndpoint.java>:[293,37]
cannot find symbol
symbol  : variable RelayConstants
location: class org.apache.synapse.endpoints.AbstractEndpoint
<https://builds.apache.org/job/Synapse%20-%20Trunk/ws/java/modules/core/src/main/java/org/apache/synapse/core/relay/ServiceRequestEarlyBuilder.java>:[83,43]
cannot find symbol
symbol  : variable RelayConstants
location: class org.apache.synapse.core.relay.ServiceRequestEarlyBuilder
<https://builds.apache.org/job/Synapse%20-%20Trunk/ws/java/modules/core/src/main/java/org/apache/synapse/core/relay/ServiceRequestEarlyBuilder.java>:[104,12]
cannot find symbol
symbol  : variable RelayUtils
location: class org.apache.synapse.core.relay.ServiceRequestEarlyBuilder
<https://builds.apache.org/job/Synapse%20-%20Trunk/ws/java/modules/core/src/main/java/org/apache/synapse/endpoints/SALoadbalanceEndpoint.java>:[112,13]
cannot find symbol
symbol  : variable RelayUtils
location: class org.apache.synapse.endpoints.SALoadbalanceEndpoint
<https://builds.apache.org/job/Synapse%20-%20Trunk/ws/java/modules/core/src/main/java/org/apache/synapse/util/MessageHelper.java>:[148,29]
cannot find symbol
symbol  : variable PassThroughConstants
location: class org.apache.synapse.util.MessageHelper
<https://builds.apache.org/job/Synapse%20-%20Trunk/ws/java/modules/core/src/main/java/org/apache/synapse/util/MessageHelper.java>:[152,12]
cannot find symbol
symbol  : class SourceConfiguration
location: class org.apache.synapse.util.MessageHelper
<https://builds.apache.org/job/Synapse%20-%20Trunk/ws/java/modules/core/src/main/java/org/apache/synapse/util/MessageHelper.java>:[152,55]
cannot find symbol
symbol  : class SourceConfiguration
location: class org.apache.synapse.util.MessageHelper
<https://builds.apache.org/job/Synapse%20-%20Trunk/ws/java/modules/core/src/main/java/org/apache/synapse/util/MessageHelper.java>:[154,12]
cannot find symbol
symbol  : class Pipe
location: class org.apache.synapse.util.MessageHelper
<https://builds.apache.org/job/Synapse%20-%20Trunk/ws/java/modules/core/src/main/java/org/apache/synapse/util/MessageHelper.java>:[154,28]
cannot find symbol
symbol  : class Pipe
location: class org.apache.synapse.util.MessageHelper
<https://builds.apache.org/job/Synapse%20-%20Trunk/ws/java/modules/core/src/main/java/org/apache/synapse/util/MessageHelper.java>:[155,30]
cannot find symbol
symbol  : variable PassThroughConstants
location: class org.apache.synapse.util.MessageHelper
<https://builds.apache.org/job/Synapse%20-%20Trunk/ws/java/modules/core/src/main/java/org/apache/synapse/core/axis2/Axis2SynapseEnvironment.java>:[314,12]
cannot find symbol
symbol  : variable RelayUtils
location: class org.apache.synapse.core.axis2.Axis2SynapseEnvironment

[INFO] ------------------------------------------------------------------------
[INFO] For more information, run Maven with the -e switch
[INFO] ------------------------------------------------------------------------
[INFO] Total time: 3 minutes 53 seconds
[INFO] Finished at: Thu Mar 13 13:01:32 UTC 2014
[INFO] Final Memory: 165M/495M
[INFO] ------------------------------------------------------------------------
[JENKINS] Archiving <https://builds.apache.org/job/Synapse%20-%20Trunk/ws/java/modules/tasks/pom.xml>
to org.apache.synapse/synapse-tasks/2.2.0-SNAPSHOT/synapse-tasks-2.2.0-SNAPSHOT.pom
[JENKINS] Archiving <https://builds.apache.org/job/Synapse%20-%20Trunk/ws/java/modules/tasks/target/synapse-tasks-2.2.0-SNAPSHOT.jar>
to org.apache.synapse/synapse-tasks/2.2.0-SNAPSHOT/synapse-tasks-2.2.0-SNAPSHOT.jar
[JENKINS] Archiving <https://builds.apache.org/job/Synapse%20-%20Trunk/ws/.repository/org/apache/synapse/Apache-Synapse/2.2.0-SNAPSHOT/Apache-Synapse-2.2.0-SNAPSHOT.pom>
to org.apache.synapse/Apache-Synapse/2.2.0-SNAPSHOT/Apache-Synapse-2.2.0-SNAPSHOT.pom
<https://builds.apache.org/job/Synapse%20-%20Trunk/ws/.repository/org/apache/synapse/Apache-Synapse/2.2.0-SNAPSHOT/Apache-Synapse-2.2.0-SNAPSHOT.pom>
is not inside <https://builds.apache.org/job/Synapse%20-%20Trunk/ws/java/;> will archive
in a separate pass
[JENKINS] Archiving <https://builds.apache.org/job/Synapse%20-%20Trunk/ws/java/modules/commons/pom.xml>
to org.apache.synapse/synapse-commons/2.2.0-SNAPSHOT/synapse-commons-2.2.0-SNAPSHOT.pom
[JENKINS] Archiving <https://builds.apache.org/job/Synapse%20-%20Trunk/ws/java/modules/commons/target/synapse-commons-2.2.0-SNAPSHOT.jar>
to org.apache.synapse/synapse-commons/2.2.0-SNAPSHOT/synapse-commons-2.2.0-SNAPSHOT.jar
[JENKINS] Archiving <https://builds.apache.org/job/Synapse%20-%20Trunk/ws/java/modules/transports/core/nhttp/pom.xml>
to org.apache.synapse/synapse-nhttp-transport/2.2.0-SNAPSHOT/synapse-nhttp-transport-2.2.0-SNAPSHOT.pom
[JENKINS] Archiving <https://builds.apache.org/job/Synapse%20-%20Trunk/ws/java/modules/transports/core/nhttp/target/synapse-nhttp-transport-2.2.0-SNAPSHOT.jar>
to org.apache.synapse/synapse-nhttp-transport/2.2.0-SNAPSHOT/synapse-nhttp-transport-2.2.0-SNAPSHOT.jar
[JENKINS] Archiving <https://builds.apache.org/job/Synapse%20-%20Trunk/ws/java/modules/transports/core/nhttp/target/synapse-nhttp-transport-2.2.0-SNAPSHOT-testkit-logs.zip>
to org.apache.synapse/synapse-nhttp-transport/2.2.0-SNAPSHOT/synapse-nhttp-transport-2.2.0-SNAPSHOT-testkit-logs.zip
[JENKINS] Archiving <https://builds.apache.org/job/Synapse%20-%20Trunk/ws/java/modules/transports/optional/fix/pom.xml>
to org.apache.synapse/synapse-fix-transport/2.2.0-SNAPSHOT/synapse-fix-transport-2.2.0-SNAPSHOT.pom
[JENKINS] Archiving <https://builds.apache.org/job/Synapse%20-%20Trunk/ws/java/modules/transports/optional/fix/target/synapse-fix-transport-2.2.0-SNAPSHOT.jar>
to org.apache.synapse/synapse-fix-transport/2.2.0-SNAPSHOT/synapse-fix-transport-2.2.0-SNAPSHOT.jar
[JENKINS] Archiving <https://builds.apache.org/job/Synapse%20-%20Trunk/ws/.repository/org/apache/synapse/synapse-transports/2.2.0-SNAPSHOT/synapse-transports-2.2.0-SNAPSHOT.pom>
to org.apache.synapse/synapse-transports/2.2.0-SNAPSHOT/synapse-transports-2.2.0-SNAPSHOT.pom
<https://builds.apache.org/job/Synapse%20-%20Trunk/ws/.repository/org/apache/synapse/synapse-transports/2.2.0-SNAPSHOT/synapse-transports-2.2.0-SNAPSHOT.pom>
is not inside <https://builds.apache.org/job/Synapse%20-%20Trunk/ws/java/modules/transports/;>
will archive in a separate pass
[JENKINS] Archiving <https://builds.apache.org/job/Synapse%20-%20Trunk/ws/java/modules/securevault/pom.xml>
to org.apache.synapse/synapse-securevault/2.2.0-SNAPSHOT/synapse-securevault-2.2.0-SNAPSHOT.pom
[JENKINS] Archiving <https://builds.apache.org/job/Synapse%20-%20Trunk/ws/java/modules/securevault/target/synapse-securevault-2.2.0-SNAPSHOT.jar>
to org.apache.synapse/synapse-securevault/2.2.0-SNAPSHOT/synapse-securevault-2.2.0-SNAPSHOT.jar
[JENKINS] Archiving <https://builds.apache.org/job/Synapse%20-%20Trunk/ws/java/modules/transports/core/pipe/pom.xml>
to org.apache.synapse/synapse-pipe-transport/2.2.0-SNAPSHOT/synapse-pipe-transport-2.2.0-SNAPSHOT.pom
[JENKINS] Archiving <https://builds.apache.org/job/Synapse%20-%20Trunk/ws/java/modules/transports/core/pipe/target/synapse-pipe-transport-2.2.0-SNAPSHOT.jar>
to org.apache.synapse/synapse-pipe-transport/2.2.0-SNAPSHOT/synapse-pipe-transport-2.2.0-SNAPSHOT.jar
[JENKINS] Archiving <https://builds.apache.org/job/Synapse%20-%20Trunk/ws/java/modules/transports/optional/amqp/pom.xml>
to org.apache.synapse/synapse-amqp-transport/2.2.0-SNAPSHOT/synapse-amqp-transport-2.2.0-SNAPSHOT.pom
[JENKINS] Archiving <https://builds.apache.org/job/Synapse%20-%20Trunk/ws/java/modules/transports/optional/amqp/target/synapse-amqp-transport-2.2.0-SNAPSHOT.jar>
to org.apache.synapse/synapse-amqp-transport/2.2.0-SNAPSHOT/synapse-amqp-transport-2.2.0-SNAPSHOT.jar
[JENKINS] Archiving <https://builds.apache.org/job/Synapse%20-%20Trunk/ws/java/modules/core/pom.xml>
to org.apache.synapse/synapse-core/2.2.0-SNAPSHOT/synapse-core-2.2.0-SNAPSHOT.pom
[JENKINS] Archiving <https://builds.apache.org/job/Synapse%20-%20Trunk/ws/java/modules/transports/core/vfs/pom.xml>
to org.apache.synapse/synapse-vfs-transport/2.2.0-SNAPSHOT/synapse-vfs-transport-2.2.0-SNAPSHOT.pom
[JENKINS] Archiving <https://builds.apache.org/job/Synapse%20-%20Trunk/ws/java/modules/transports/core/vfs/target/synapse-vfs-transport-2.2.0-SNAPSHOT.jar>
to org.apache.synapse/synapse-vfs-transport/2.2.0-SNAPSHOT/synapse-vfs-transport-2.2.0-SNAPSHOT.jar
[JENKINS] Archiving <https://builds.apache.org/job/Synapse%20-%20Trunk/ws/java/modules/transports/core/vfs/target/synapse-vfs-transport-2.2.0-SNAPSHOT-testkit-logs.zip>
to org.apache.synapse/synapse-vfs-transport/2.2.0-SNAPSHOT/synapse-vfs-transport-2.2.0-SNAPSHOT-testkit-logs.zip
Sending e-mails to: dev@synapse.apache.org
channel stopped
[locks-and-latches] Releasing all the locks
[locks-and-latches] All the locks released

---------------------------------------------------------------------
To unsubscribe, e-mail: dev-unsubscribe@synapse.apache.org
For additional commands, e-mail: dev-help@synapse.apache.org


Mime
View raw message