synapse-dev mailing list archives

Site index · List index
Message view « Date » · « Thread »
Top « Date » · « Thread »
From Apache Jenkins Server <jenk...@builds.apache.org>
Subject Build failed in Jenkins: Synapse - Trunk #4550
Date Sun, 16 Dec 2012 22:59:02 GMT
See <https://builds.apache.org/job/Synapse%20-%20Trunk/4550/>

------------------------------------------
[...truncated 137 lines...]
Downloading: http://dist.wso2.org/snapshots/maven2/org/apache/axis2/axis2-saaj/1.7.0-SNAPSHOT/maven-metadata.xml
Downloading: http://repository.apache.org/snapshots/org/apache/axis2/axis2-saaj/1.7.0-SNAPSHOT/maven-metadata.xml
Downloaded: http://repository.apache.org/snapshots/org/apache/axis2/axis2-saaj/1.7.0-SNAPSHOT/maven-metadata.xml
(365 B at 9.4 KB/sec)
Downloading: http://repository.apache.org/snapshots/org/apache/axis2/axis2-saaj/1.7.0-SNAPSHOT/axis2-saaj-1.7.0-20121216.195152-1234.pom
Downloaded: http://repository.apache.org/snapshots/org/apache/axis2/axis2-saaj/1.7.0-SNAPSHOT/axis2-saaj-1.7.0-20121216.195152-1234.pom
(8 KB at 121.7 KB/sec)
Downloading: http://dist.wso2.org/snapshots/maven2/org/apache/axis2/axis2-transport-base/1.7.0-SNAPSHOT/maven-metadata.xml
Downloading: http://repository.apache.org/snapshots/org/apache/axis2/axis2-transport-base/1.7.0-SNAPSHOT/maven-metadata.xml
Downloaded: http://repository.apache.org/snapshots/org/apache/axis2/axis2-transport-base/1.7.0-SNAPSHOT/maven-metadata.xml
(374 B at 17.4 KB/sec)
Downloading: http://repository.apache.org/snapshots/org/apache/axis2/axis2-transport-base/1.7.0-SNAPSHOT/axis2-transport-base-1.7.0-20121216.195152-729.pom
Downloaded: http://repository.apache.org/snapshots/org/apache/axis2/axis2-transport-base/1.7.0-SNAPSHOT/axis2-transport-base-1.7.0-20121216.195152-729.pom
(4 KB at 216.9 KB/sec)
Downloading: http://dist.wso2.org/snapshots/maven2/org/apache/axis2/axis2-transport-http/1.7.0-SNAPSHOT/maven-metadata.xml
Downloading: http://repository.apache.org/snapshots/org/apache/axis2/axis2-transport-http/1.7.0-SNAPSHOT/maven-metadata.xml
Downloaded: http://repository.apache.org/snapshots/org/apache/axis2/axis2-transport-http/1.7.0-SNAPSHOT/maven-metadata.xml
(375 B at 18.3 KB/sec)
Downloading: http://repository.apache.org/snapshots/org/apache/axis2/axis2-transport-http/1.7.0-SNAPSHOT/axis2-transport-http-1.7.0-20121216.195152-1266.pom
Downloaded: http://repository.apache.org/snapshots/org/apache/axis2/axis2-transport-http/1.7.0-SNAPSHOT/axis2-transport-http-1.7.0-20121216.195152-1266.pom
(6 KB at 323.6 KB/sec)
Downloading: http://dist.wso2.org/snapshots/maven2/org/apache/axis2/axis2-transport-jms/1.7.0-SNAPSHOT/maven-metadata.xml
Downloading: http://repository.apache.org/snapshots/org/apache/axis2/axis2-transport-jms/1.7.0-SNAPSHOT/maven-metadata.xml
Downloaded: http://repository.apache.org/snapshots/org/apache/axis2/axis2-transport-jms/1.7.0-SNAPSHOT/maven-metadata.xml
(373 B at 19.2 KB/sec)
Downloading: http://repository.apache.org/snapshots/org/apache/axis2/axis2-transport-jms/1.7.0-SNAPSHOT/axis2-transport-jms-1.7.0-20121216.195152-708.pom
Downloaded: http://repository.apache.org/snapshots/org/apache/axis2/axis2-transport-jms/1.7.0-SNAPSHOT/axis2-transport-jms-1.7.0-20121216.195152-708.pom
(8 KB at 393.9 KB/sec)
Downloading: http://dist.wso2.org/snapshots/maven2/org/apache/axis2/axis2-transport-local/1.7.0-SNAPSHOT/maven-metadata.xml
Downloading: http://repository.apache.org/snapshots/org/apache/axis2/axis2-transport-local/1.7.0-SNAPSHOT/maven-metadata.xml
Downloaded: http://repository.apache.org/snapshots/org/apache/axis2/axis2-transport-local/1.7.0-SNAPSHOT/maven-metadata.xml
(376 B at 19.3 KB/sec)
Downloading: http://repository.apache.org/snapshots/org/apache/axis2/axis2-transport-local/1.7.0-SNAPSHOT/axis2-transport-local-1.7.0-20121216.195152-1269.pom
Downloaded: http://repository.apache.org/snapshots/org/apache/axis2/axis2-transport-local/1.7.0-SNAPSHOT/axis2-transport-local-1.7.0-20121216.195152-1269.pom
(5 KB at 262.2 KB/sec)
Downloading: http://dist.wso2.org/snapshots/maven2/org/apache/axis2/axis2-transport-mail/1.7.0-SNAPSHOT/maven-metadata.xml
Downloading: http://repository.apache.org/snapshots/org/apache/axis2/axis2-transport-mail/1.7.0-SNAPSHOT/maven-metadata.xml
Downloaded: http://repository.apache.org/snapshots/org/apache/axis2/axis2-transport-mail/1.7.0-SNAPSHOT/maven-metadata.xml
(374 B at 18.3 KB/sec)
Downloading: http://repository.apache.org/snapshots/org/apache/axis2/axis2-transport-mail/1.7.0-SNAPSHOT/axis2-transport-mail-1.7.0-20121216.195152-709.pom
Downloaded: http://repository.apache.org/snapshots/org/apache/axis2/axis2-transport-mail/1.7.0-SNAPSHOT/axis2-transport-mail-1.7.0-20121216.195152-709.pom
(6 KB at 300.0 KB/sec)
Downloading: http://dist.wso2.org/snapshots/maven2/org/apache/axis2/mex/1.7.0-SNAPSHOT/maven-metadata.xml
Downloading: http://repository.apache.org/snapshots/org/apache/axis2/mex/1.7.0-SNAPSHOT/maven-metadata.xml
Downloaded: http://repository.apache.org/snapshots/org/apache/axis2/mex/1.7.0-SNAPSHOT/maven-metadata.xml
(358 B at 15.9 KB/sec)
Downloading: http://repository.apache.org/snapshots/org/apache/axis2/mex/1.7.0-SNAPSHOT/mex-1.7.0-20121216.195152-1163.pom
Downloaded: http://repository.apache.org/snapshots/org/apache/axis2/mex/1.7.0-SNAPSHOT/mex-1.7.0-20121216.195152-1163.pom
(6 KB at 298.6 KB/sec)
Downloading: http://dist.wso2.org/maven2/org/apache/bsf/bsf-all/3.0/bsf-all-3.0.pom
Downloading: https://server.oosnmp.net/dist/release/org/apache/bsf/bsf-all/3.0/bsf-all-3.0.pom
Downloading: http://repo1.maven.org/maven2/org/apache/bsf/bsf-all/3.0/bsf-all-3.0.pom
Downloading: http://dist.wso2.org/snapshots/maven2/org/apache/rampart/rampart/1.7.0-SNAPSHOT/maven-metadata.xml
Downloading: http://repository.apache.org/snapshots/org/apache/rampart/rampart/1.7.0-SNAPSHOT/maven-metadata.xml
Downloaded: http://repository.apache.org/snapshots/org/apache/rampart/rampart/1.7.0-SNAPSHOT/maven-metadata.xml
(956 B at 44.5 KB/sec)
Downloading: http://repository.apache.org/snapshots/org/apache/rampart/rampart/1.7.0-SNAPSHOT/rampart-1.7.0-20121216.220145-888.pom
Downloaded: http://repository.apache.org/snapshots/org/apache/rampart/rampart/1.7.0-SNAPSHOT/rampart-1.7.0-20121216.220145-888.pom
(5 KB at 238.3 KB/sec)
Downloading: http://dist.wso2.org/snapshots/maven2/org/apache/rampart/rampart-project/1.7.0-SNAPSHOT/maven-metadata.xml
Downloading: http://repository.apache.org/snapshots/org/apache/rampart/rampart-project/1.7.0-SNAPSHOT/maven-metadata.xml
Downloaded: http://repository.apache.org/snapshots/org/apache/rampart/rampart-project/1.7.0-SNAPSHOT/maven-metadata.xml
(614 B at 30.0 KB/sec)
Downloading: http://repository.apache.org/snapshots/org/apache/rampart/rampart-project/1.7.0-SNAPSHOT/rampart-project-1.7.0-20121216.220149-888.pom
Downloaded: http://repository.apache.org/snapshots/org/apache/rampart/rampart-project/1.7.0-SNAPSHOT/rampart-project-1.7.0-20121216.220149-888.pom
(15 KB at 733.5 KB/sec)
Downloading: http://dist.wso2.org/snapshots/maven2/org/apache/rampart/rampart-core/1.7.0-SNAPSHOT/maven-metadata.xml
Downloading: http://repository.apache.org/snapshots/org/apache/rampart/rampart-core/1.7.0-SNAPSHOT/maven-metadata.xml
Downloaded: http://repository.apache.org/snapshots/org/apache/rampart/rampart-core/1.7.0-SNAPSHOT/maven-metadata.xml
(786 B at 38.4 KB/sec)
Downloading: http://repository.apache.org/snapshots/org/apache/rampart/rampart-core/1.7.0-SNAPSHOT/rampart-core-1.7.0-20121216.220146-888.pom
Downloaded: http://repository.apache.org/snapshots/org/apache/rampart/rampart-core/1.7.0-SNAPSHOT/rampart-core-1.7.0-20121216.220146-888.pom
(4 KB at 184.2 KB/sec)
Downloading: http://dist.wso2.org/snapshots/maven2/org/apache/rampart/rampart-policy/1.7.0-SNAPSHOT/maven-metadata.xml
Downloading: http://repository.apache.org/snapshots/org/apache/rampart/rampart-policy/1.7.0-SNAPSHOT/maven-metadata.xml
Downloaded: http://repository.apache.org/snapshots/org/apache/rampart/rampart-policy/1.7.0-SNAPSHOT/maven-metadata.xml
(788 B at 40.5 KB/sec)
Downloading: http://repository.apache.org/snapshots/org/apache/rampart/rampart-policy/1.7.0-SNAPSHOT/rampart-policy-1.7.0-20121216.220149-888.pom
Downloaded: http://repository.apache.org/snapshots/org/apache/rampart/rampart-policy/1.7.0-SNAPSHOT/rampart-policy-1.7.0-20121216.220149-888.pom
(3 KB at 133.6 KB/sec)
Downloading: http://dist.wso2.org/snapshots/maven2/org/apache/rampart/rampart-trust/1.7.0-SNAPSHOT/maven-metadata.xml
Downloading: http://repository.apache.org/snapshots/org/apache/rampart/rampart-trust/1.7.0-SNAPSHOT/maven-metadata.xml
Downloaded: http://repository.apache.org/snapshots/org/apache/rampart/rampart-trust/1.7.0-SNAPSHOT/maven-metadata.xml
(787 B at 38.4 KB/sec)
Downloading: http://repository.apache.org/snapshots/org/apache/rampart/rampart-trust/1.7.0-SNAPSHOT/rampart-trust-1.7.0-20121216.220150-888.pom
Downloaded: http://repository.apache.org/snapshots/org/apache/rampart/rampart-trust/1.7.0-SNAPSHOT/rampart-trust-1.7.0-20121216.220150-888.pom
(4 KB at 197.2 KB/sec)
Downloading: http://dist.wso2.org/snapshots/maven2/org/apache/sandesha2/sandesha2/1.7.0-SNAPSHOT/maven-metadata.xml
Downloading: http://repository.apache.org/snapshots/org/apache/sandesha2/sandesha2/1.7.0-SNAPSHOT/maven-metadata.xml
Downloaded: http://repository.apache.org/snapshots/org/apache/sandesha2/sandesha2/1.7.0-SNAPSHOT/maven-metadata.xml
(1001 B at 6.5 KB/sec)
Downloading: http://repository.apache.org/snapshots/org/apache/sandesha2/sandesha2/1.7.0-SNAPSHOT/sandesha2-1.7.0-20121216.223610-430.pom
Downloaded: http://repository.apache.org/snapshots/org/apache/sandesha2/sandesha2/1.7.0-SNAPSHOT/sandesha2-1.7.0-20121216.223610-430.pom
(6 KB at 350.8 KB/sec)
Downloading: http://dist.wso2.org/snapshots/maven2/org/apache/sandesha2/sandesha2-parent/1.7.0-SNAPSHOT/maven-metadata.xml
Downloading: http://repository.apache.org/snapshots/org/apache/sandesha2/sandesha2-parent/1.7.0-SNAPSHOT/maven-metadata.xml
Downloaded: http://repository.apache.org/snapshots/org/apache/sandesha2/sandesha2-parent/1.7.0-SNAPSHOT/maven-metadata.xml
(617 B at 5.1 KB/sec)
Downloading: http://repository.apache.org/snapshots/org/apache/sandesha2/sandesha2-parent/1.7.0-SNAPSHOT/sandesha2-parent-1.7.0-20121216.223554-431.pom
Downloaded: http://repository.apache.org/snapshots/org/apache/sandesha2/sandesha2-parent/1.7.0-SNAPSHOT/sandesha2-parent-1.7.0-20121216.223554-431.pom
(19 KB at 1016.7 KB/sec)
Downloading: http://dist.wso2.org/snapshots/maven2/org/apache/sandesha2/sandesha2-core/1.7.0-SNAPSHOT/maven-metadata.xml
Downloading: http://repository.apache.org/snapshots/org/apache/sandesha2/sandesha2-core/1.7.0-SNAPSHOT/maven-metadata.xml
Downloaded: http://repository.apache.org/snapshots/org/apache/sandesha2/sandesha2-core/1.7.0-SNAPSHOT/maven-metadata.xml
(2 KB at 16.3 KB/sec)
Downloading: http://repository.apache.org/snapshots/org/apache/sandesha2/sandesha2-core/1.7.0-SNAPSHOT/sandesha2-core-1.7.0-20121216.223606-431.pom
Downloaded: http://repository.apache.org/snapshots/org/apache/sandesha2/sandesha2-core/1.7.0-SNAPSHOT/sandesha2-core-1.7.0-20121216.223606-431.pom
(4 KB at 211.7 KB/sec)
Downloading: http://dist.wso2.org/snapshots/maven2/org/apache/sandesha2/sandesha2-policy/1.7.0-SNAPSHOT/maven-metadata.xml
Downloading: http://repository.apache.org/snapshots/org/apache/sandesha2/sandesha2-policy/1.7.0-SNAPSHOT/maven-metadata.xml
Downloaded: http://repository.apache.org/snapshots/org/apache/sandesha2/sandesha2-policy/1.7.0-SNAPSHOT/maven-metadata.xml
(792 B at 7.0 KB/sec)
Downloading: http://repository.apache.org/snapshots/org/apache/sandesha2/sandesha2-policy/1.7.0-SNAPSHOT/sandesha2-policy-1.7.0-20121216.223614-430.pom
Downloaded: http://repository.apache.org/snapshots/org/apache/sandesha2/sandesha2-policy/1.7.0-SNAPSHOT/sandesha2-policy-1.7.0-20121216.223614-430.pom
(5 KB at 281.4 KB/sec)
Downloading: http://dist.wso2.org/snapshots/maven2/org/apache/ws/commons/axiom/axiom-api/1.2.14-SNAPSHOT/maven-metadata.xml
Downloading: http://repository.apache.org/snapshots/org/apache/ws/commons/axiom/axiom-api/1.2.14-SNAPSHOT/maven-metadata.xml
Downloading: http://dist.wso2.org/snapshots/maven2/org/apache/ws/commons/axiom/axiom-api/1.2.14-SNAPSHOT/axiom-api-1.2.14-SNAPSHOT.pom
Downloading: http://repository.apache.org/snapshots/org/apache/ws/commons/axiom/axiom-api/1.2.14-SNAPSHOT/axiom-api-1.2.14-SNAPSHOT.pom
Downloading: http://dist.wso2.org/snapshots/maven2/org/apache/ws/commons/axiom/axiom-dom/1.2.14-SNAPSHOT/maven-metadata.xml
Downloading: http://repository.apache.org/snapshots/org/apache/ws/commons/axiom/axiom-dom/1.2.14-SNAPSHOT/maven-metadata.xml
Downloading: http://dist.wso2.org/snapshots/maven2/org/apache/ws/commons/axiom/axiom-dom/1.2.14-SNAPSHOT/axiom-dom-1.2.14-SNAPSHOT.pom
Downloading: http://repository.apache.org/snapshots/org/apache/ws/commons/axiom/axiom-dom/1.2.14-SNAPSHOT/axiom-dom-1.2.14-SNAPSHOT.pom
Downloading: http://dist.wso2.org/snapshots/maven2/org/apache/ws/commons/axiom/axiom-impl/1.2.14-SNAPSHOT/maven-metadata.xml
Downloading: http://repository.apache.org/snapshots/org/apache/ws/commons/axiom/axiom-impl/1.2.14-SNAPSHOT/maven-metadata.xml
Downloading: http://dist.wso2.org/snapshots/maven2/org/apache/ws/commons/axiom/axiom-impl/1.2.14-SNAPSHOT/axiom-impl-1.2.14-SNAPSHOT.pom
Downloading: http://repository.apache.org/snapshots/org/apache/ws/commons/axiom/axiom-impl/1.2.14-SNAPSHOT/axiom-impl-1.2.14-SNAPSHOT.pom
Downloading: http://dist.wso2.org/maven2/quickfixj/quickfixj-all/1.4.0/quickfixj-all-1.4.0.pom
Downloading: https://server.oosnmp.net/dist/release/quickfixj/quickfixj-all/1.4.0/quickfixj-all-1.4.0.pom
Downloading: http://repo1.maven.org/maven2/quickfixj/quickfixj-all/1.4.0/quickfixj-all-1.4.0.pom
Downloading: http://dist.wso2.org/snapshots/maven2/org/apache/axis2/axis2-transport-testkit/1.7.0-SNAPSHOT/maven-metadata.xml
Downloading: http://repository.apache.org/snapshots/org/apache/axis2/axis2-transport-testkit/1.7.0-SNAPSHOT/maven-metadata.xml
Downloaded: http://repository.apache.org/snapshots/org/apache/axis2/axis2-transport-testkit/1.7.0-SNAPSHOT/maven-metadata.xml
(377 B at 1.4 KB/sec)
Downloading: http://repository.apache.org/snapshots/org/apache/axis2/axis2-transport-testkit/1.7.0-SNAPSHOT/axis2-transport-testkit-1.7.0-20121216.195152-727.pom
Downloaded: http://repository.apache.org/snapshots/org/apache/axis2/axis2-transport-testkit/1.7.0-SNAPSHOT/axis2-transport-testkit-1.7.0-20121216.195152-727.pom
(10 KB at 117.6 KB/sec)
[INFO] Generating "Dependencies" report    --- maven-project-info-reports-plugin:2.2
[INFO] Generating "Project License" report    --- maven-project-info-reports-plugin:2.2
[INFO] Generating "Project Modules" report    --- maven-project-info-reports-plugin:2.2
[INFO] Generating "Project Team" report    --- maven-project-info-reports-plugin:2.2
[INFO] Generating "Continuous Integration" report    --- maven-project-info-reports-plugin:2.2
mojoSucceeded org.apache.maven.plugins:maven-site-plugin:3.0(default-site)
[FINDBUGS] No report found for mojo site
[JENKINS] Archiving site from <https://builds.apache.org/job/Synapse%20-%20Trunk/ws/java/target/site>
to /home/hudson/hudson/jobs/Synapse - Trunk/site
Successfully loaded native POSIX impl.
projectSucceeded org.apache.synapse:Apache-Synapse:2.2.0-SNAPSHOT
projectStarted org.apache.synapse:synapse-securevault:2.2.0-SNAPSHOT
[INFO]                                                                         
[INFO] ------------------------------------------------------------------------
[INFO] Building Apache Synapse - Secure Vault 2.2.0-SNAPSHOT
[INFO] ------------------------------------------------------------------------
Downloading: http://dist.wso2.org/snapshots/maven2/org/apache/ws/commons/axiom/axiom-api/1.2.14-SNAPSHOT/axiom-api-1.2.14-SNAPSHOT.pom
Downloading: http://repository.apache.org/snapshots/org/apache/ws/commons/axiom/axiom-api/1.2.14-SNAPSHOT/axiom-api-1.2.14-SNAPSHOT.pom
[WARNING] The POM for org.apache.ws.commons.axiom:axiom-api:jar:1.2.14-SNAPSHOT is missing,
no dependency information available
Downloading: http://dist.wso2.org/snapshots/maven2/org/apache/ws/commons/axiom/axiom-impl/1.2.14-SNAPSHOT/axiom-impl-1.2.14-SNAPSHOT.pom
Downloading: http://repository.apache.org/snapshots/org/apache/ws/commons/axiom/axiom-impl/1.2.14-SNAPSHOT/axiom-impl-1.2.14-SNAPSHOT.pom
[WARNING] The POM for org.apache.ws.commons.axiom:axiom-impl:jar:1.2.14-SNAPSHOT is missing,
no dependency information available
Downloading: http://dist.wso2.org/snapshots/maven2/org/apache/ws/commons/axiom/axiom-api/1.2.14-SNAPSHOT/axiom-api-1.2.14-SNAPSHOT.jar
Downloading: http://dist.wso2.org/snapshots/maven2/org/apache/ws/commons/axiom/axiom-impl/1.2.14-SNAPSHOT/axiom-impl-1.2.14-SNAPSHOT.jar
Downloading: http://repository.apache.org/snapshots/org/apache/ws/commons/axiom/axiom-api/1.2.14-SNAPSHOT/axiom-api-1.2.14-SNAPSHOT.jar
Downloading: http://repository.apache.org/snapshots/org/apache/ws/commons/axiom/axiom-impl/1.2.14-SNAPSHOT/axiom-impl-1.2.14-SNAPSHOT.jar
projectFailed org.apache.synapse:synapse-securevault:2.2.0-SNAPSHOT
sessionEnded
[INFO] ------------------------------------------------------------------------
[INFO] Reactor Summary:
[INFO] 
[INFO] Apache Synapse .................................... SUCCESS [20.538s]
[INFO] Apache Synapse - Secure Vault ..................... FAILURE [0.467s]
[INFO] Apache Synapse - Commons .......................... SKIPPED
[INFO] Apache Synapse - Transports ....................... SKIPPED
[INFO] Apache Synapse - Non-blocking HTTP/s Transport .... SKIPPED
[INFO] Apache Synapse - PIPE Transport ................... SKIPPED
[INFO] Apache Synapse - VFS Transport .................... SKIPPED
[INFO] Apache Synapse - FIX Transport .................... SKIPPED
[INFO] Apache Synapse - Tasks ............................ SKIPPED
[INFO] Apache Synapse - Core ............................. SKIPPED
[INFO] Apache Synapse - Extensions ....................... SKIPPED
[INFO] Apache Synapse - Samples .......................... SKIPPED
[INFO] Apache Synapse - Patches .......................... SKIPPED
[INFO] Apache Synapse - Experimental code ................ SKIPPED
[INFO] Apache Synapse - Documentation .................... SKIPPED
[INFO] Apache Synapse - Web Application .................. SKIPPED
[INFO] Apache Synapse - Handler Module ................... SKIPPED
[INFO] Apache Synapse - XAR Maven Plugin ................. SKIPPED
[INFO] Apache Synapse - Configuration Migrator ........... SKIPPED
[INFO] Apache Synapse - Distribution ..................... SKIPPED
[INFO] Apache Synapse - Package skeleton ZIP ............. SKIPPED
[INFO] Apache Synapse - Package archetype ................ SKIPPED
[INFO] Apache Synapse - Integration ...................... SKIPPED
[INFO] ------------------------------------------------------------------------
[INFO] BUILD FAILURE
[INFO] ------------------------------------------------------------------------
[INFO] Total time: 22.938s
[INFO] Finished at: Sun Dec 16 22:58:56 UTC 2012
[INFO] Final Memory: 26M/226M
[INFO] ------------------------------------------------------------------------
Projects to build: [MavenProject: org.apache.synapse:Apache-Synapse:2.2.0-SNAPSHOT @ <https://builds.apache.org/job/Synapse%20-%20Trunk/ws/java/pom.xml,>
MavenProject: org.apache.synapse:synapse-securevault:2.2.0-SNAPSHOT @ <https://builds.apache.org/job/Synapse%20-%20Trunk/ws/java/modules/securevault/pom.xml,>
MavenProject: org.apache.synapse:synapse-commons:2.2.0-SNAPSHOT @ <https://builds.apache.org/job/Synapse%20-%20Trunk/ws/java/modules/commons/pom.xml,>
MavenProject: org.apache.synapse:synapse-transports:2.2.0-SNAPSHOT @ <https://builds.apache.org/job/Synapse%20-%20Trunk/ws/java/modules/transports/pom.xml,>
MavenProject: org.apache.synapse:synapse-nhttp-transport:2.2.0-SNAPSHOT @ <https://builds.apache.org/job/Synapse%20-%20Trunk/ws/java/modules/transports/core/nhttp/pom.xml,>
MavenProject: org.apache.synapse:synapse-pipe-transport:2.2.0-SNAPSHOT @ <https://builds.apache.org/job/Synapse%20-%20Trunk/ws/java/modules/transports/core/pipe/pom.xml,>
MavenProject: org.apache.synapse:synapse-vfs-transport:2.2.0-SNAPSHOT @ <https://builds.apache.org/job/Synapse%20-%20Trunk/ws/java/modules/transports/core/vfs/pom.xml,>
MavenProject: org.apache.synapse:synapse-fix-transport:2.2.0-SNAPSHOT @ <https://builds.apache.org/job/Synapse%20-%20Trunk/ws/java/modules/transports/optional/fix/pom.xml,>
MavenProject: org.apache.synapse:synapse-tasks:2.2.0-SNAPSHOT @ <https://builds.apache.org/job/Synapse%20-%20Trunk/ws/java/modules/tasks/pom.xml,>
MavenProject: org.apache.synapse:synapse-core:2.2.0-SNAPSHOT @ <https://builds.apache.org/job/Synapse%20-%20Trunk/ws/java/modules/core/pom.xml,>
MavenProject: org.apache.synapse:synapse-extensions:2.2.0-SNAPSHOT @ <https://builds.apache.org/job/Synapse%20-%20Trunk/ws/java/modules/extensions/pom.xml,>
MavenProject: org.apache.synapse:synapse-samples:2.2.0-SNAPSHOT @ <https://builds.apache.org/job/Synapse%20-%20Trunk/ws/java/modules/samples/pom.xml,>
MavenProject: org.apache.synapse:synapse-patches:2.2.0-SNAPSHOT @ <https://builds.apache.org/job/Synapse%20-%20Trunk/ws/java/modules/patches/pom.xml,>
MavenProject: org.apache.synapse:synapse-experimental:2.2.0-SNAPSHOT @ <https://builds.apache.org/job/Synapse%20-%20Trunk/ws/java/modules/experimental/pom.xml,>
MavenProject: org.apache.synapse:synapse-documentation:2.2.0-SNAPSHOT @ <https://builds.apache.org/job/Synapse%20-%20Trunk/ws/java/modules/documentation/pom.xml,>
MavenProject: org.apache.synapse:synapse-war:2.2.0-SNAPSHOT @ <https://builds.apache.org/job/Synapse%20-%20Trunk/ws/java/modules/war/pom.xml,>
MavenProject: org.apache.synapse:synapse-handler:2.2.0-SNAPSHOT @ <https://builds.apache.org/job/Synapse%20-%20Trunk/ws/java/modules/handler/pom.xml,>
MavenProject: org.apache.synapse:synapse-xar-maven-plugin:2.2.0-SNAPSHOT @ <https://builds.apache.org/job/Synapse%20-%20Trunk/ws/java/modules/xar-maven-plugin/pom.xml,>
MavenProject: org.apache.synapse:synapse-config-migrator:2.2.0-SNAPSHOT @ <https://builds.apache.org/job/Synapse%20-%20Trunk/ws/java/modules/migrator/pom.xml,>
MavenProject: org.apache.synapse:synapse-distribution:2.2.0-SNAPSHOT @ <https://builds.apache.org/job/Synapse%20-%20Trunk/ws/java/modules/distribution/pom.xml,>
MavenProject: org.apache.synapse:synapse-package-skeleton:2.2.0-SNAPSHOT @ <https://builds.apache.org/job/Synapse%20-%20Trunk/ws/java/modules/packaging/package-skeleton/pom.xml,>
MavenProject: org.apache.synapse:synapse-package-archetype:2.2.0-SNAPSHOT @ <https://builds.apache.org/job/Synapse%20-%20Trunk/ws/java/modules/packaging/package-archetype/pom.xml,>
MavenProject: org.apache.synapse:synapse-integration:2.2.0-SNAPSHOT @ <https://builds.apache.org/job/Synapse%20-%20Trunk/ws/java/modules/integration/pom.xml]>
[JENKINS] Archiving <https://builds.apache.org/job/Synapse%20-%20Trunk/ws/java/modules/migrator/pom.xml>
to /home/hudson/hudson/jobs/Synapse - Trunk/modules/org.apache.synapse$synapse-config-migrator/builds/2012-12-16_22-58-19/archive/org.apache.synapse/synapse-config-migrator/2.2.0-SNAPSHOT/synapse-config-migrator-2.2.0-SNAPSHOT.pom
[JENKINS] Archiving <https://builds.apache.org/job/Synapse%20-%20Trunk/ws/java/modules/core/pom.xml>
to /home/hudson/hudson/jobs/Synapse - Trunk/modules/org.apache.synapse$synapse-core/builds/2012-12-16_22-58-19/archive/org.apache.synapse/synapse-core/2.2.0-SNAPSHOT/synapse-core-2.2.0-SNAPSHOT.pom
[JENKINS] Archiving <https://builds.apache.org/job/Synapse%20-%20Trunk/ws/java/modules/integration/pom.xml>
to /home/hudson/hudson/jobs/Synapse - Trunk/modules/org.apache.synapse$synapse-integration/builds/2012-12-16_22-58-19/archive/org.apache.synapse/synapse-integration/2.2.0-SNAPSHOT/synapse-integration-2.2.0-SNAPSHOT.pom
[JENKINS] Archiving <https://builds.apache.org/job/Synapse%20-%20Trunk/ws/java/modules/packaging/package-skeleton/pom.xml>
to /home/hudson/hudson/jobs/Synapse - Trunk/modules/org.apache.synapse$synapse-package-skeleton/builds/2012-12-16_22-58-19/archive/org.apache.synapse/synapse-package-skeleton/2.2.0-SNAPSHOT/synapse-package-skeleton-2.2.0-SNAPSHOT.pom
[JENKINS] Archiving <https://builds.apache.org/job/Synapse%20-%20Trunk/ws/java/modules/securevault/pom.xml>
to /home/hudson/hudson/jobs/Synapse - Trunk/modules/org.apache.synapse$synapse-securevault/builds/2012-12-16_22-58-19/archive/org.apache.synapse/synapse-securevault/2.2.0-SNAPSHOT/synapse-securevault-2.2.0-SNAPSHOT.pom
[JENKINS] Archiving <https://builds.apache.org/job/Synapse%20-%20Trunk/ws/java/modules/packaging/package-archetype/pom.xml>
to /home/hudson/hudson/jobs/Synapse - Trunk/modules/org.apache.synapse$synapse-package-archetype/builds/2012-12-16_22-58-19/archive/org.apache.synapse/synapse-package-archetype/2.2.0-SNAPSHOT/synapse-package-archetype-2.2.0-SNAPSHOT.pom
[JENKINS] Archiving <https://builds.apache.org/job/Synapse%20-%20Trunk/ws/java/modules/commons/pom.xml>
to /home/hudson/hudson/jobs/Synapse - Trunk/modules/org.apache.synapse$synapse-commons/builds/2012-12-16_22-58-19/archive/org.apache.synapse/synapse-commons/2.2.0-SNAPSHOT/synapse-commons-2.2.0-SNAPSHOT.pom
[JENKINS] Archiving <https://builds.apache.org/job/Synapse%20-%20Trunk/ws/java/modules/extensions/pom.xml>
to /home/hudson/hudson/jobs/Synapse - Trunk/modules/org.apache.synapse$synapse-extensions/builds/2012-12-16_22-58-19/archive/org.apache.synapse/synapse-extensions/2.2.0-SNAPSHOT/synapse-extensions-2.2.0-SNAPSHOT.pom
[JENKINS] Archiving <https://builds.apache.org/job/Synapse%20-%20Trunk/ws/java/modules/samples/pom.xml>
to /home/hudson/hudson/jobs/Synapse - Trunk/modules/org.apache.synapse$synapse-samples/builds/2012-12-16_22-58-19/archive/org.apache.synapse/synapse-samples/2.2.0-SNAPSHOT/synapse-samples-2.2.0-SNAPSHOT.pom
[JENKINS] Archiving <https://builds.apache.org/job/Synapse%20-%20Trunk/ws/java/modules/xar-maven-plugin/pom.xml>
to /home/hudson/hudson/jobs/Synapse - Trunk/modules/org.apache.synapse$synapse-xar-maven-plugin/builds/2012-12-16_22-58-19/archive/org.apache.synapse/synapse-xar-maven-plugin/2.2.0-SNAPSHOT/synapse-xar-maven-plugin-2.2.0-SNAPSHOT.pom
[JENKINS] Archiving <https://builds.apache.org/job/Synapse%20-%20Trunk/ws/java/modules/documentation/pom.xml>
to /home/hudson/hudson/jobs/Synapse - Trunk/modules/org.apache.synapse$synapse-documentation/builds/2012-12-16_22-58-19/archive/org.apache.synapse/synapse-documentation/2.2.0-SNAPSHOT/synapse-documentation-2.2.0-SNAPSHOT.pom
[JENKINS] Archiving <https://builds.apache.org/job/Synapse%20-%20Trunk/ws/java/modules/transports/core/nhttp/pom.xml>
to /home/hudson/hudson/jobs/Synapse - Trunk/modules/org.apache.synapse$synapse-nhttp-transport/builds/2012-12-16_22-58-19/archive/org.apache.synapse/synapse-nhttp-transport/2.2.0-SNAPSHOT/synapse-nhttp-transport-2.2.0-SNAPSHOT.pom
[JENKINS] Archiving <https://builds.apache.org/job/Synapse%20-%20Trunk/ws/java/modules/transports/core/pipe/pom.xml>
to /home/hudson/hudson/jobs/Synapse - Trunk/modules/org.apache.synapse$synapse-pipe-transport/builds/2012-12-16_22-58-19/archive/org.apache.synapse/synapse-pipe-transport/2.2.0-SNAPSHOT/synapse-pipe-transport-2.2.0-SNAPSHOT.pom
[JENKINS] Archiving <https://builds.apache.org/job/Synapse%20-%20Trunk/ws/java/modules/transports/optional/fix/pom.xml>
to /home/hudson/hudson/jobs/Synapse - Trunk/modules/org.apache.synapse$synapse-fix-transport/builds/2012-12-16_22-58-19/archive/org.apache.synapse/synapse-fix-transport/2.2.0-SNAPSHOT/synapse-fix-transport-2.2.0-SNAPSHOT.pom
[JENKINS] Archiving <https://builds.apache.org/job/Synapse%20-%20Trunk/ws/java/modules/transports/pom.xml>
to /home/hudson/hudson/jobs/Synapse - Trunk/modules/org.apache.synapse$synapse-transports/builds/2012-12-16_22-58-19/archive/org.apache.synapse/synapse-transports/2.2.0-SNAPSHOT/synapse-transports-2.2.0-SNAPSHOT.pom
[JENKINS] Archiving <https://builds.apache.org/job/Synapse%20-%20Trunk/ws/java/modules/war/pom.xml>
to /home/hudson/hudson/jobs/Synapse - Trunk/modules/org.apache.synapse$synapse-war/builds/2012-12-16_22-58-19/archive/org.apache.synapse/synapse-war/2.2.0-SNAPSHOT/synapse-war-2.2.0-SNAPSHOT.pom
[JENKINS] Archiving <https://builds.apache.org/job/Synapse%20-%20Trunk/ws/java/pom.xml>
to /home/hudson/hudson/jobs/Synapse - Trunk/modules/org.apache.synapse$Apache-Synapse/builds/2012-12-16_22-58-19/archive/org.apache.synapse/Apache-Synapse/2.2.0-SNAPSHOT/Apache-Synapse-2.2.0-SNAPSHOT.pom
[JENKINS] Archiving <https://builds.apache.org/job/Synapse%20-%20Trunk/ws/java/modules/transports/core/vfs/pom.xml>
to /home/hudson/hudson/jobs/Synapse - Trunk/modules/org.apache.synapse$synapse-vfs-transport/builds/2012-12-16_22-58-19/archive/org.apache.synapse/synapse-vfs-transport/2.2.0-SNAPSHOT/synapse-vfs-transport-2.2.0-SNAPSHOT.pom
[JENKINS] Archiving <https://builds.apache.org/job/Synapse%20-%20Trunk/ws/java/modules/patches/pom.xml>
to /home/hudson/hudson/jobs/Synapse - Trunk/modules/org.apache.synapse$synapse-patches/builds/2012-12-16_22-58-19/archive/org.apache.synapse/synapse-patches/2.2.0-SNAPSHOT/synapse-patches-2.2.0-SNAPSHOT.pom
[JENKINS] Archiving <https://builds.apache.org/job/Synapse%20-%20Trunk/ws/java/modules/experimental/pom.xml>
to /home/hudson/hudson/jobs/Synapse - Trunk/modules/org.apache.synapse$synapse-experimental/builds/2012-12-16_22-58-19/archive/org.apache.synapse/synapse-experimental/2.2.0-SNAPSHOT/synapse-experimental-2.2.0-SNAPSHOT.pom
[JENKINS] Archiving <https://builds.apache.org/job/Synapse%20-%20Trunk/ws/java/modules/tasks/pom.xml>
to /home/hudson/hudson/jobs/Synapse - Trunk/modules/org.apache.synapse$synapse-tasks/builds/2012-12-16_22-58-19/archive/org.apache.synapse/synapse-tasks/2.2.0-SNAPSHOT/synapse-tasks-2.2.0-SNAPSHOT.pom
[JENKINS] Archiving <https://builds.apache.org/job/Synapse%20-%20Trunk/ws/java/modules/handler/pom.xml>
to /home/hudson/hudson/jobs/Synapse - Trunk/modules/org.apache.synapse$synapse-handler/builds/2012-12-16_22-58-19/archive/org.apache.synapse/synapse-handler/2.2.0-SNAPSHOT/synapse-handler-2.2.0-SNAPSHOT.pom
[JENKINS] Archiving <https://builds.apache.org/job/Synapse%20-%20Trunk/ws/java/modules/distribution/pom.xml>
to /home/hudson/hudson/jobs/Synapse - Trunk/modules/org.apache.synapse$synapse-distribution/builds/2012-12-16_22-58-19/archive/org.apache.synapse/synapse-distribution/2.2.0-SNAPSHOT/synapse-distribution-2.2.0-SNAPSHOT.pom
Waiting for Jenkins to finish collecting data
mavenExecutionResult exceptions not empty
message : Failed to execute goal on project synapse-securevault: Could not resolve dependencies
for project org.apache.synapse:synapse-securevault:bundle:2.2.0-SNAPSHOT: The following artifacts
could not be resolved: org.apache.ws.commons.axiom:axiom-api:jar:1.2.14-SNAPSHOT, org.apache.ws.commons.axiom:axiom-impl:jar:1.2.14-SNAPSHOT:
Could not find artifact org.apache.ws.commons.axiom:axiom-api:jar:1.2.14-SNAPSHOT in wso2-m2-snapshots
(http://dist.wso2.org/snapshots/maven2/)
cause : Could not resolve dependencies for project org.apache.synapse:synapse-securevault:bundle:2.2.0-SNAPSHOT:
The following artifacts could not be resolved: org.apache.ws.commons.axiom:axiom-api:jar:1.2.14-SNAPSHOT,
org.apache.ws.commons.axiom:axiom-impl:jar:1.2.14-SNAPSHOT: Could not find artifact org.apache.ws.commons.axiom:axiom-api:jar:1.2.14-SNAPSHOT
in wso2-m2-snapshots (http://dist.wso2.org/snapshots/maven2/)
Stack trace : 
org.apache.maven.lifecycle.LifecycleExecutionException: Failed to execute goal on project
synapse-securevault: Could not resolve dependencies for project org.apache.synapse:synapse-securevault:bundle:2.2.0-SNAPSHOT:
The following artifacts could not be resolved: org.apache.ws.commons.axiom:axiom-api:jar:1.2.14-SNAPSHOT,
org.apache.ws.commons.axiom:axiom-impl:jar:1.2.14-SNAPSHOT: Could not find artifact org.apache.ws.commons.axiom:axiom-api:jar:1.2.14-SNAPSHOT
in wso2-m2-snapshots (http://dist.wso2.org/snapshots/maven2/)
	at org.apache.maven.lifecycle.internal.LifecycleDependencyResolver.getDependencies(LifecycleDependencyResolver.java:196)
	at org.apache.maven.lifecycle.internal.LifecycleDependencyResolver.resolveProjectDependencies(LifecycleDependencyResolver.java:108)
	at org.apache.maven.lifecycle.internal.MojoExecutor.ensureDependenciesAreResolved(MojoExecutor.java:258)
	at org.apache.maven.lifecycle.internal.MojoExecutor.execute(MojoExecutor.java:201)
	at org.apache.maven.lifecycle.internal.MojoExecutor.execute(MojoExecutor.java:153)
	at org.apache.maven.lifecycle.internal.MojoExecutor.execute(MojoExecutor.java:145)
	at org.apache.maven.lifecycle.internal.LifecycleModuleBuilder.buildProject(LifecycleModuleBuilder.java:84)
	at org.apache.maven.lifecycle.internal.LifecycleModuleBuilder.buildProject(LifecycleModuleBuilder.java:59)
	at org.apache.maven.lifecycle.internal.LifecycleStarter.singleThreadedBuild(LifecycleStarter.java:183)
	at org.apache.maven.lifecycle.internal.LifecycleStarter.execute(LifecycleStarter.java:161)
	at org.apache.maven.DefaultMaven.doExecute(DefaultMaven.java:319)
	at org.apache.maven.DefaultMaven.execute(DefaultMaven.java:156)
	at org.jvnet.hudson.maven3.launcher.Maven3Launcher.main(Maven3Launcher.java:79)
	at sun.reflect.NativeMethodAccessorImpl.invoke0(Native Method)
	at sun.reflect.NativeMethodAccessorImpl.invoke(NativeMethodAccessorImpl.java:39)
	at sun.reflect.DelegatingMethodAccessorImpl.invoke(DelegatingMethodAccessorImpl.java:25)
	at java.lang.reflect.Method.invoke(Method.java:597)
	at org.codehaus.plexus.classworlds.launcher.Launcher.launchStandard(Launcher.java:329)
	at org.codehaus.plexus.classworlds.launcher.Launcher.launch(Launcher.java:239)
	at org.jvnet.hudson.maven3.agent.Maven3Main.launch(Maven3Main.java:158)
	at hudson.maven.Maven3Builder.call(Maven3Builder.java:98)
	at hudson.maven.Maven3Builder.call(Maven3Builder.java:64)
	at hudson.remoting.UserRequest.perform(UserRequest.java:118)
	at hudson.remoting.UserRequest.perform(UserRequest.java:48)
	at hudson.remoting.Request$2.run(Request.java:326)
	at hudson.remoting.InterceptingExecutorService$1.call(InterceptingExecutorService.java:72)
	at java.util.concurrent.FutureTask$Sync.innerRun(FutureTask.java:303)
	at java.util.concurrent.FutureTask.run(FutureTask.java:138)
	at java.util.concurrent.ThreadPoolExecutor$Worker.runTask(ThreadPoolExecutor.java:886)
	at java.util.concurrent.ThreadPoolExecutor$Worker.run(ThreadPoolExecutor.java:908)
	at java.lang.Thread.run(Thread.java:619)
Caused by: org.apache.maven.project.DependencyResolutionException: Could not resolve dependencies
for project org.apache.synapse:synapse-securevault:bundle:2.2.0-SNAPSHOT: The following artifacts
could not be resolved: org.apache.ws.commons.axiom:axiom-api:jar:1.2.14-SNAPSHOT, org.apache.ws.commons.axiom:axiom-impl:jar:1.2.14-SNAPSHOT:
Could not find artifact org.apache.ws.commons.axiom:axiom-api:jar:1.2.14-SNAPSHOT in wso2-m2-snapshots
(http://dist.wso2.org/snapshots/maven2/)
	at org.apache.maven.project.DefaultProjectDependenciesResolver.resolve(DefaultProjectDependenciesResolver.java:170)
	at org.apache.maven.lifecycle.internal.LifecycleDependencyResolver.getDependencies(LifecycleDependencyResolver.java:171)
	... 30 more
Caused by: org.sonatype.aether.resolution.DependencyResolutionException: The following artifacts
could not be resolved: org.apache.ws.commons.axiom:axiom-api:jar:1.2.14-SNAPSHOT, org.apache.ws.commons.axiom:axiom-impl:jar:1.2.14-SNAPSHOT:
Could not find artifact org.apache.ws.commons.axiom:axiom-api:jar:1.2.14-SNAPSHOT in wso2-m2-snapshots
(http://dist.wso2.org/snapshots/maven2/)
	at org.sonatype.aether.impl.internal.DefaultRepositorySystem.resolveDependencies(DefaultRepositorySystem.java:412)
	at org.apache.maven.project.DefaultProjectDependenciesResolver.resolve(DefaultProjectDependenciesResolver.java:164)
	... 31 more
Caused by: org.sonatype.aether.resolution.ArtifactResolutionException: The following artifacts
could not be resolved: org.apache.ws.commons.axiom:axiom-api:jar:1.2.14-SNAPSHOT, org.apache.ws.commons.axiom:axiom-impl:jar:1.2.14-SNAPSHOT:
Could not find artifact org.apache.ws.commons.axiom:axiom-api:jar:1.2.14-SNAPSHOT in wso2-m2-snapshots
(http://dist.wso2.org/snapshots/maven2/)
	at org.sonatype.aether.impl.internal.DefaultArtifactResolver.resolve(DefaultArtifactResolver.java:541)
	at org.sonatype.aether.impl.internal.DefaultArtifactResolver.resolveArtifacts(DefaultArtifactResolver.java:220)
	at org.sonatype.aether.impl.internal.DefaultRepositorySystem.resolveDependencies(DefaultRepositorySystem.java:395)
	... 32 more
Caused by: org.sonatype.aether.transfer.ArtifactNotFoundException: Could not find artifact
org.apache.ws.commons.axiom:axiom-api:jar:1.2.14-SNAPSHOT in wso2-m2-snapshots (http://dist.wso2.org/snapshots/maven2/)
	at org.sonatype.aether.connector.wagon.WagonRepositoryConnector$4.wrap(WagonRepositoryConnector.java:945)
	at org.sonatype.aether.connector.wagon.WagonRepositoryConnector$4.wrap(WagonRepositoryConnector.java:940)
	at org.sonatype.aether.connector.wagon.WagonRepositoryConnector$GetTask.flush(WagonRepositoryConnector.java:695)
	at org.sonatype.aether.connector.wagon.WagonRepositoryConnector$GetTask.flush(WagonRepositoryConnector.java:689)
	at org.sonatype.aether.connector.wagon.WagonRepositoryConnector.get(WagonRepositoryConnector.java:445)
	at org.sonatype.aether.impl.internal.DefaultArtifactResolver.resolve(DefaultArtifactResolver.java:460)
	... 34 more
Sending e-mails to: dev@synapse.apache.org
channel stopped
[locks-and-latches] Releasing all the locks
[locks-and-latches] All the locks released

---------------------------------------------------------------------
To unsubscribe, e-mail: dev-unsubscribe@synapse.apache.org
For additional commands, e-mail: dev-help@synapse.apache.org


Mime
View raw message