synapse-dev mailing list archives

Site index · List index
Message view « Date » · « Thread »
Top « Date » · « Thread »
From Hiranya Jayathilaka <hiranya...@gmail.com>
Subject Re: Build failed in Jenkins: Synapse - Trunk #4444
Date Fri, 21 Sep 2012 22:30:18 GMT
Did some API change in Synapse or Axis2?

On Fri, Sep 21, 2012 at 1:30 AM, Apache Jenkins Server <
jenkins@builds.apache.org> wrote:

> See <https://builds.apache.org/job/Synapse%20-%20Trunk/4444/>
>
> ------------------------------------------
> [...truncated 510 lines...]
> [INFO] Installing
> org/apache/synapse/synapse-commons/2.2.0-SNAPSHOT/synapse-commons-2.2.0-SNAPSHOT.jar
> [INFO] Writing OBR metadata
> [INFO] configuring report plugin
> org.apache.maven.plugins:maven-project-info-reports-plugin:2.2
> [INFO] Parent project loaded from repository: org.apache:apache:pom:9
> [INFO] Relativizing decoration links with respect to project URL:
> http://synapse.apache.org/modules/synapse-commons/
> [INFO] Rendering site with
> org.apache.maven.skins:maven-default-skin:jar:1.0 skin.
> [INFO] Generating "About" report    ---
> maven-project-info-reports-plugin:2.2
> [INFO] Generating "Source Repository" report    ---
> maven-project-info-reports-plugin:2.2
> [INFO] Generating "Plugin Management" report    ---
> maven-project-info-reports-plugin:2.2
> [INFO] Generating "Mailing Lists" report    ---
> maven-project-info-reports-plugin:2.2
> [INFO] Generating "Issue Tracking" report    ---
> maven-project-info-reports-plugin:2.2
> [INFO] Generating "Project Plugins" report    ---
> maven-project-info-reports-plugin:2.2
> [INFO] Generating "Dependency Convergence" report    ---
> maven-project-info-reports-plugin:2.2
> [INFO] Generating "Project Summary" report    ---
> maven-project-info-reports-plugin:2.2
> [INFO] Generating "Dependency Management" report    ---
> maven-project-info-reports-plugin:2.2
> Downloading:
> http://dist.wso2.org/maven2/net/sf/saxon/saxon/8.9/saxon-8.9.pom
> Downloading:
> https://server.oosnmp.net/dist/release/net/sf/saxon/saxon/8.9/saxon-8.9.pom
> Downloading:
> http://repo1.maven.org/maven2/net/sf/saxon/saxon/8.9/saxon-8.9.pom
> Downloading:
> http://dist.wso2.org/maven2/net/sf/saxon/saxon-xqj/8.9/saxon-xqj-8.9.pom
> Downloading:
> https://server.oosnmp.net/dist/release/net/sf/saxon/saxon-xqj/8.9/saxon-xqj-8.9.pom
> Downloading:
> http://repo1.maven.org/maven2/net/sf/saxon/saxon-xqj/8.9/saxon-xqj-8.9.pom
> Downloading:
> http://dist.wso2.org/maven2/org/apache/bsf/bsf-all/3.0/bsf-all-3.0.pom
> Downloading:
> https://server.oosnmp.net/dist/release/org/apache/bsf/bsf-all/3.0/bsf-all-3.0.pom
> Downloading:
> http://repo1.maven.org/maven2/org/apache/bsf/bsf-all/3.0/bsf-all-3.0.pom
> Downloading:
> http://dist.wso2.org/maven2/quickfixj/quickfixj-all/1.4.0/quickfixj-all-1.4.0.pom
> Downloading:
> https://server.oosnmp.net/dist/release/quickfixj/quickfixj-all/1.4.0/quickfixj-all-1.4.0.pom
> Downloading:
> http://repo1.maven.org/maven2/quickfixj/quickfixj-all/1.4.0/quickfixj-all-1.4.0.pom
> [INFO] Generating "Dependencies" report    ---
> maven-project-info-reports-plugin:2.2
> [INFO] Generating "Project License" report    ---
> maven-project-info-reports-plugin:2.2
> [INFO] Generating "Project Team" report    ---
> maven-project-info-reports-plugin:2.2
> [INFO] Generating "Continuous Integration" report    ---
> maven-project-info-reports-plugin:2.2
> projectStarted org.apache.synapse:synapse-transports:2.2.0-SNAPSHOT
> [INFO]
> [INFO]
> ------------------------------------------------------------------------
> [INFO] Building Apache Synapse - Transports 2.2.0-SNAPSHOT
> [INFO]
> ------------------------------------------------------------------------
> mojoStarted
> org.apache.maven.plugins:maven-clean-plugin:2.4.1(default-clean)
> [INFO]
> [INFO] --- maven-clean-plugin:2.4.1:clean (default-clean) @
> synapse-transports ---
> mojoSucceeded
> org.apache.maven.plugins:maven-clean-plugin:2.4.1(default-clean)
> mojoStarted
> org.apache.maven.plugins:maven-remote-resources-plugin:1.1(default)
> [INFO]
> [INFO] --- maven-remote-resources-plugin:1.1:process (default) @
> synapse-transports ---
> mojoSucceeded
> org.apache.maven.plugins:maven-remote-resources-plugin:1.1(default)
> mojoStarted
> org.apache.maven.plugins:maven-install-plugin:2.3.1(default-install)
> [INFO]
> [INFO] --- maven-install-plugin:2.3.1:install (default-install) @
> synapse-transports ---
> mojoSucceeded
> org.apache.maven.plugins:maven-install-plugin:2.3.1(default-install)
> mojoStarted org.apache.maven.plugins:maven-site-plugin:3.0(default-site)
> [INFO]
> [INFO] --- maven-site-plugin:3.0:site (default-site) @ synapse-transports
> ---
> mojoSucceeded org.apache.maven.plugins:maven-site-plugin:3.0(default-site)
> [FINDBUGS] No report found for mojo site
> [JENKINS] Archiving site from <
> https://builds.apache.org/job/Synapse%20-%20Trunk/ws/java/modules/transports/target/site>
> to /home/hudson/hudson/jobs/Synapse - Trunk/site/synapse-transports
> projectSucceeded org.apache.synapse:synapse-transports:2.2.0-SNAPSHOT
> Downloading:
> http://repository.apache.org/snapshots/org/apache/axis2/axis2-transport-testkit/1.7.0-SNAPSHOT/axis2-transport-testkit-1.7.0-20120921.080729-572.jar
> Downloading:
> http://repository.apache.org/snapshots/org/apache/axis2/addressing/1.7.0-SNAPSHOT/addressing-1.7.0-20120921.072217-1038.mar
> Downloaded:
> http://repository.apache.org/snapshots/org/apache/axis2/addressing/1.7.0-SNAPSHOT/addressing-1.7.0-20120921.072217-1038.mar(31
KB at 1394.7 KB/sec)
> Downloaded:
> http://repository.apache.org/snapshots/org/apache/axis2/axis2-transport-testkit/1.7.0-SNAPSHOT/axis2-transport-testkit-1.7.0-20120921.080729-572.jar(204
KB at 6357.0 KB/sec)
> [INFO] Deleting <
> https://builds.apache.org/job/Synapse%20-%20Trunk/ws/java/modules/transports/target
> >
> [INFO] Installing <
> https://builds.apache.org/job/Synapse%20-%20Trunk/ws/java/modules/transports/pom.xml>
> to <
> https://builds.apache.org/job/Synapse%20-%20Trunk/ws/.repository/org/apache/synapse/synapse-transports/2.2.0-SNAPSHOT/synapse-transports-2.2.0-SNAPSHOT.pom
> >
> [INFO] configuring report plugin
> org.apache.maven.plugins:maven-project-info-reports-plugin:2.2
> [INFO] Parent project loaded from repository: org.apache:apache:pom:9
> [INFO] Relativizing decoration links with respect to project URL:
> http://synapse.apache.org/modules/synapse-transports/
> [INFO] Rendering site with
> org.apache.maven.skins:maven-default-skin:jar:1.0 skin.
> [INFO] Generating "About" report    ---
> maven-project-info-reports-plugin:2.2
> [INFO] Generating "Source Repository" report    ---
> maven-project-info-reports-plugin:2.2
> [INFO] Generating "Plugin Management" report    ---
> maven-project-info-reports-plugin:2.2
> [INFO] Generating "Mailing Lists" report    ---
> maven-project-info-reports-plugin:2.2
> [INFO] Generating "Issue Tracking" report    ---
> maven-project-info-reports-plugin:2.2
> [INFO] Generating "Project Plugins" report    ---
> maven-project-info-reports-plugin:2.2
> [INFO] Generating "Dependency Convergence" report    ---
> maven-project-info-reports-plugin:2.2
> [INFO] Generating "Project Summary" report    ---
> maven-project-info-reports-plugin:2.2
> [INFO] Generating "Dependency Management" report    ---
> maven-project-info-reports-plugin:2.2
> Downloading:
> http://dist.wso2.org/maven2/net/sf/saxon/saxon/8.9/saxon-8.9.pom
> Downloading:
> https://server.oosnmp.net/dist/release/net/sf/saxon/saxon/8.9/saxon-8.9.pom
> Downloading:
> http://repo1.maven.org/maven2/net/sf/saxon/saxon/8.9/saxon-8.9.pom
> Downloading:
> http://dist.wso2.org/maven2/net/sf/saxon/saxon-xqj/8.9/saxon-xqj-8.9.pom
> Downloading:
> https://server.oosnmp.net/dist/release/net/sf/saxon/saxon-xqj/8.9/saxon-xqj-8.9.pom
> Downloading:
> http://repo1.maven.org/maven2/net/sf/saxon/saxon-xqj/8.9/saxon-xqj-8.9.pom
> Downloading:
> http://dist.wso2.org/maven2/org/apache/bsf/bsf-all/3.0/bsf-all-3.0.pom
> Downloading:
> https://server.oosnmp.net/dist/release/org/apache/bsf/bsf-all/3.0/bsf-all-3.0.pom
> Downloading:
> http://repo1.maven.org/maven2/org/apache/bsf/bsf-all/3.0/bsf-all-3.0.pom
> Downloading:
> http://dist.wso2.org/maven2/quickfixj/quickfixj-all/1.4.0/quickfixj-all-1.4.0.pom
> Downloading:
> https://server.oosnmp.net/dist/release/quickfixj/quickfixj-all/1.4.0/quickfixj-all-1.4.0.pom
> Downloading:
> http://repo1.maven.org/maven2/quickfixj/quickfixj-all/1.4.0/quickfixj-all-1.4.0.pom
> [INFO] Generating "Dependencies" report    ---
> maven-project-info-reports-plugin:2.2
> [INFO] Generating "Project License" report    ---
> maven-project-info-reports-plugin:2.2
> [INFO] Generating "Project Modules" report    ---
> maven-project-info-reports-plugin:2.2
> [INFO] Generating "Project Team" report    ---
> maven-project-info-reports-plugin:2.2
> [INFO] Generating "Continuous Integration" report    ---
> maven-project-info-reports-plugin:2.2
> projectStarted org.apache.synapse:synapse-nhttp-transport:2.2.0-SNAPSHOT
> [INFO]
> [INFO]
> ------------------------------------------------------------------------
> [INFO] Building Apache Synapse - Non-blocking HTTP/s Transport
> 2.2.0-SNAPSHOT
> [INFO]
> ------------------------------------------------------------------------
> mojoStarted
> org.apache.maven.plugins:maven-clean-plugin:2.4.1(default-clean)
> [INFO]
> [INFO] --- maven-clean-plugin:2.4.1:clean (default-clean) @
> synapse-nhttp-transport ---
> mojoSucceeded
> org.apache.maven.plugins:maven-clean-plugin:2.4.1(default-clean)
> mojoStarted
> org.apache.maven.plugins:maven-remote-resources-plugin:1.1(default)
> [INFO]
> [INFO] --- maven-remote-resources-plugin:1.1:process (default) @
> synapse-nhttp-transport ---
> mojoSucceeded
> org.apache.maven.plugins:maven-remote-resources-plugin:1.1(default)
> mojoStarted
> org.apache.maven.plugins:maven-resources-plugin:2.5(default-resources)
> [INFO]
> [INFO] --- maven-resources-plugin:2.5:resources (default-resources) @
> synapse-nhttp-transport ---
> mojoSucceeded
> org.apache.maven.plugins:maven-resources-plugin:2.5(default-resources)
> mojoStarted
> org.apache.maven.plugins:maven-compiler-plugin:2.3.2(default-compile)
> [INFO]
> [INFO] --- maven-compiler-plugin:2.3.2:compile (default-compile) @
> synapse-nhttp-transport ---
> mojoFailed
> org.apache.maven.plugins:maven-compiler-plugin:2.3.2(default-compile)
> projectFailed org.apache.synapse:synapse-nhttp-transport:2.2.0-SNAPSHOT
> Downloading:
> http://repository.apache.org/snapshots/org/apache/axis2/axis2-transport-http/1.7.0-SNAPSHOT/axis2-transport-http-1.7.0-20120921.072217-1049.jar
> Downloaded:
> http://repository.apache.org/snapshots/org/apache/axis2/axis2-transport-http/1.7.0-SNAPSHOT/axis2-transport-http-1.7.0-20120921.072217-1049.jar(194
KB at 8078.8 KB/sec)
> [INFO] Deleting <
> https://builds.apache.org/job/Synapse%20-%20Trunk/ws/java/modules/transports/core/nhttp/target
> >
> [debug] execute contextualize
> [INFO] Using 'UTF-8' encoding to copy filtered resources.
> [INFO] Copying 0 resource
> [INFO] Copying 3 resources
> [INFO] Compiling 47 source files to <
> https://builds.apache.org/job/Synapse%20-%20Trunk/ws/java/modules/transports/core/nhttp/target/classes
> >
> [INFO] -------------------------------------------------------------
> [ERROR] COMPILATION ERROR :
> [INFO] -------------------------------------------------------------
> [ERROR] <
> https://builds.apache.org/job/Synapse%20-%20Trunk/ws/java/modules/transports/core/nhttp/src/main/java/org/apache/synapse/transport/nhttp/util/MessageFormatterDecoratorFactory.java>:[49,55]
> cannot find symbol
> symbol  : method
> getMessageFormatter(org.apache.axis2.context.MessageContext)
> location: class org.apache.axis2.transport.TransportUtils
> [INFO] 1 error
> [INFO] -------------------------------------------------------------
> sessionEnded
> [INFO]
> ------------------------------------------------------------------------
> [INFO] Reactor Summary:
> [INFO]
> [INFO] Apache Synapse .................................... SUCCESS
> [39.942s]
> [INFO] Apache Synapse - Secure Vault ..................... SUCCESS
> [36.231s]
> [INFO] Apache Synapse - Commons .......................... SUCCESS
> [32.410s]
> [INFO] Apache Synapse - Transports ....................... SUCCESS
> [15.428s]
> [INFO] Apache Synapse - Non-blocking HTTP/s Transport .... FAILURE [8.943s]
> [INFO] Apache Synapse - PIPE Transport ................... SKIPPED
> [INFO] Apache Synapse - VFS Transport .................... SKIPPED
> [INFO] Apache Synapse - FIX Transport .................... SKIPPED
> [INFO] Apache Synapse - Tasks ............................ SKIPPED
> [INFO] Apache Synapse - Core ............................. SKIPPED
> [INFO] Apache Synapse - Extensions ....................... SKIPPED
> [INFO] Apache Synapse - Samples .......................... SKIPPED
> [INFO] Apache Synapse - Patches .......................... SKIPPED
> [INFO] Apache Synapse - Experimental code ................ SKIPPED
> [INFO] Apache Synapse - Documentation .................... SKIPPED
> [INFO] Apache Synapse - Web Application .................. SKIPPED
> [INFO] Apache Synapse - Handler Module ................... SKIPPED
> [INFO] Apache Synapse - XAR Maven Plugin ................. SKIPPED
> [INFO] Apache Synapse - Configuration Migrator ........... SKIPPED
> [INFO] Apache Synapse - Distribution ..................... SKIPPED
> [INFO] Apache Synapse - Package skeleton ZIP ............. SKIPPED
> [INFO] Apache Synapse - Package archetype ................ SKIPPED
> [INFO] Apache Synapse - Integration ...................... SKIPPED
> [INFO]
> ------------------------------------------------------------------------
> [INFO] BUILD FAILURE
> [INFO]
> ------------------------------------------------------------------------
> [INFO] Total time: 3:01.028s
> [INFO] Finished at: Fri Sep 21 08:29:16 UTC 2012
> [INFO] Final Memory: 52M/176M
> [INFO]
> ------------------------------------------------------------------------
> Projects to build: [MavenProject:
> org.apache.synapse:Apache-Synapse:2.2.0-SNAPSHOT @ <
> https://builds.apache.org/job/Synapse%20-%20Trunk/ws/java/pom.xml,>
> MavenProject: org.apache.synapse:synapse-securevault:2.2.0-SNAPSHOT @ <
> https://builds.apache.org/job/Synapse%20-%20Trunk/ws/java/modules/securevault/pom.xml,>
> MavenProject: org.apache.synapse:synapse-commons:2.2.0-SNAPSHOT @ <
> https://builds.apache.org/job/Synapse%20-%20Trunk/ws/java/modules/commons/pom.xml,>
> MavenProject: org.apache.synapse:synapse-transports:2.2.0-SNAPSHOT @ <
> https://builds.apache.org/job/Synapse%20-%20Trunk/ws/java/modules/transports/pom.xml,>
> MavenProject: org.apache.synapse:synapse-nhttp-transport:2.2.0-SNAPSHOT @ <
> https://builds.apache.org/job/Synapse%20-%20Trunk/ws/java/modules/transports/core/nhttp/pom.xml,>
> MavenProject: org.apache.synapse:synapse-pipe-transport:2.2.0-SNAPSHOT @ <
> https://builds.apache.org/job/Synapse%20-%20Trunk/ws/java/modules/transports/core/pipe/pom.xml,>
> MavenProject: org.apache.synapse:synapse-vfs-transport:2.2.0-SNAPSHOT @ <
> https://builds.apache.org/job/Synapse%20-%20Trunk/ws/java/modules/transports/core/vfs/pom.xml,>
> MavenProject: org.apache.synapse:synapse-fix-transport:2.2.0-SNAPSHOT @ <
> https://builds.apache.org/job/Synapse%20-%20Trunk/ws/java/modules/transports/optional/fix/pom.xml,>
> MavenProject: org.apache.synapse:synapse-tasks:2.2.0-SNAPSHOT @ <
> https://builds.apache.org/job/Synapse%20-%20Trunk/ws/java/modules/tasks/pom.xml,>
> MavenProject: org.apache.synapse:synapse-core:2.2.0-SNAPSHOT @ <
> https://builds.apache.org/job/Synapse%20-%20Trunk/ws/java/modules/core/pom.xml,>
> MavenProject: org.apache.synapse:synapse-extensions:2.2.0-SNAPSHOT @ <
> https://builds.apache.org/job/Synapse%20-%20Trunk/ws/java/modules/extensions/pom.xml,>
> MavenProject: org.apache.synapse:synapse-samples:2.2.0-SNAPSHOT @ <
> https://builds.apache.org/job/Synapse%20-%20Trunk/ws/java/modules/samples/pom.xml,>
> MavenProject: org.apache.synapse:synapse-patches:2.2.0-SNAPSHOT @ <
> https://builds.apache.org/job/Synapse%20-%20Trunk/ws/java/modules/patches/pom.xml,>
> MavenProject: org.apache.synapse:synapse-experimental:2.2.0-SNAPSHOT @ <
> https://builds.apache.org/job/Synapse%20-%20Trunk/ws/java/modules/experimental/pom.xml,>
> MavenProject: org.apache.synapse:synapse-documentation:2.2.0-SNAPSHOT @ <
> https://builds.apache.org/job/Synapse%20-%20Trunk/ws/java/modules/documentation/pom.xml,>
> MavenProject: org.apache.synapse:synapse-war:2.2.0-SNAPSHOT @ <
> https://builds.apache.org/job/Synapse%20-%20Trunk/ws/java/modules/war/pom.xml,>
> MavenProject: org.apache.synapse:synapse-handler:2.2.0-SNAPSHOT @ <
> https://builds.apache.org/job/Synapse%20-%20Trunk/ws/java/modules/handler/pom.xml,>
> MavenProject: org.apache.synapse:synapse-xar-maven-plugin:2.2.0-SNAPSHOT @ <
> https://builds.apache.org/job/Synapse%20-%20Trunk/ws/java/modules/xar-maven-plugin/pom.xml,>
> MavenProject: org.apache.synapse:synapse-config-migrator:2.2.0-SNAPSHOT @ <
> https://builds.apache.org/job/Synapse%20-%20Trunk/ws/java/modules/migrator/pom.xml,>
> MavenProject: org.apache.synapse:synapse-distribution:2.2.0-SNAPSHOT @ <
> https://builds.apache.org/job/Synapse%20-%20Trunk/ws/java/modules/distribution/pom.xml,>
> MavenProject: org.apache.synapse:synapse-package-skeleton:2.2.0-SNAPSHOT @ <
> https://builds.apache.org/job/Synapse%20-%20Trunk/ws/java/modules/packaging/package-skeleton/pom.xml,>
> MavenProject: org.apache.synapse:synapse-package-archetype:2.2.0-SNAPSHOT @
> <
> https://builds.apache.org/job/Synapse%20-%20Trunk/ws/java/modules/packaging/package-archetype/pom.xml,>
> MavenProject: org.apache.synapse:synapse-integration:2.2.0-SNAPSHOT @ <
> https://builds.apache.org/job/Synapse%20-%20Trunk/ws/java/modules/integration/pom.xml
> ]>
> [JENKINS] Archiving <
> https://builds.apache.org/job/Synapse%20-%20Trunk/ws/java/modules/migrator/pom.xml>
> to /home/hudson/hudson/jobs/Synapse -
> Trunk/modules/org.apache.synapse$synapse-config-migrator/builds/2012-09-21_08-26-02/archive/org.apache.synapse/synapse-config-migrator/2.2.0-SNAPSHOT/synapse-config-migrator-2.2.0-SNAPSHOT.pom
> [JENKINS] Archiving <
> https://builds.apache.org/job/Synapse%20-%20Trunk/ws/java/modules/core/pom.xml>
> to /home/hudson/hudson/jobs/Synapse -
> Trunk/modules/org.apache.synapse$synapse-core/builds/2012-09-21_08-26-02/archive/org.apache.synapse/synapse-core/2.2.0-SNAPSHOT/synapse-core-2.2.0-SNAPSHOT.pom
> [JENKINS] Archiving <
> https://builds.apache.org/job/Synapse%20-%20Trunk/ws/java/modules/integration/pom.xml>
> to /home/hudson/hudson/jobs/Synapse -
> Trunk/modules/org.apache.synapse$synapse-integration/builds/2012-09-21_08-26-02/archive/org.apache.synapse/synapse-integration/2.2.0-SNAPSHOT/synapse-integration-2.2.0-SNAPSHOT.pom
> [JENKINS] Archiving <
> https://builds.apache.org/job/Synapse%20-%20Trunk/ws/java/modules/packaging/package-skeleton/pom.xml>
> to /home/hudson/hudson/jobs/Synapse -
> Trunk/modules/org.apache.synapse$synapse-package-skeleton/builds/2012-09-21_08-26-02/archive/org.apache.synapse/synapse-package-skeleton/2.2.0-SNAPSHOT/synapse-package-skeleton-2.2.0-SNAPSHOT.pom
> [JENKINS] Archiving <
> https://builds.apache.org/job/Synapse%20-%20Trunk/ws/java/modules/securevault/pom.xml>
> to /home/hudson/hudson/jobs/Synapse -
> Trunk/modules/org.apache.synapse$synapse-securevault/builds/2012-09-21_08-26-02/archive/org.apache.synapse/synapse-securevault/2.2.0-SNAPSHOT/synapse-securevault-2.2.0-SNAPSHOT.pom
> [JENKINS] Archiving <
> https://builds.apache.org/job/Synapse%20-%20Trunk/ws/java/modules/securevault/target/synapse-securevault-2.2.0-SNAPSHOT.jar>
> to /home/hudson/hudson/jobs/Synapse -
> Trunk/modules/org.apache.synapse$synapse-securevault/builds/2012-09-21_08-26-02/archive/org.apache.synapse/synapse-securevault/2.2.0-SNAPSHOT/synapse-securevault-2.2.0-SNAPSHOT.jar
> [JENKINS] Archiving <
> https://builds.apache.org/job/Synapse%20-%20Trunk/ws/java/modules/packaging/package-archetype/pom.xml>
> to /home/hudson/hudson/jobs/Synapse -
> Trunk/modules/org.apache.synapse$synapse-package-archetype/builds/2012-09-21_08-26-02/archive/org.apache.synapse/synapse-package-archetype/2.2.0-SNAPSHOT/synapse-package-archetype-2.2.0-SNAPSHOT.pom
> [JENKINS] Archiving <
> https://builds.apache.org/job/Synapse%20-%20Trunk/ws/java/modules/commons/pom.xml>
> to /home/hudson/hudson/jobs/Synapse -
> Trunk/modules/org.apache.synapse$synapse-commons/builds/2012-09-21_08-26-02/archive/org.apache.synapse/synapse-commons/2.2.0-SNAPSHOT/synapse-commons-2.2.0-SNAPSHOT.pom
> [JENKINS] Archiving <
> https://builds.apache.org/job/Synapse%20-%20Trunk/ws/java/modules/commons/target/synapse-commons-2.2.0-SNAPSHOT.jar>
> to /home/hudson/hudson/jobs/Synapse -
> Trunk/modules/org.apache.synapse$synapse-commons/builds/2012-09-21_08-26-02/archive/org.apache.synapse/synapse-commons/2.2.0-SNAPSHOT/synapse-commons-2.2.0-SNAPSHOT.jar
> [JENKINS] Archiving <
> https://builds.apache.org/job/Synapse%20-%20Trunk/ws/java/modules/extensions/pom.xml>
> to /home/hudson/hudson/jobs/Synapse -
> Trunk/modules/org.apache.synapse$synapse-extensions/builds/2012-09-21_08-26-02/archive/org.apache.synapse/synapse-extensions/2.2.0-SNAPSHOT/synapse-extensions-2.2.0-SNAPSHOT.pom
> [JENKINS] Archiving <
> https://builds.apache.org/job/Synapse%20-%20Trunk/ws/java/modules/samples/pom.xml>
> to /home/hudson/hudson/jobs/Synapse -
> Trunk/modules/org.apache.synapse$synapse-samples/builds/2012-09-21_08-26-02/archive/org.apache.synapse/synapse-samples/2.2.0-SNAPSHOT/synapse-samples-2.2.0-SNAPSHOT.pom
> [JENKINS] Archiving <
> https://builds.apache.org/job/Synapse%20-%20Trunk/ws/java/modules/xar-maven-plugin/pom.xml>
> to /home/hudson/hudson/jobs/Synapse -
> Trunk/modules/org.apache.synapse$synapse-xar-maven-plugin/builds/2012-09-21_08-26-02/archive/org.apache.synapse/synapse-xar-maven-plugin/2.2.0-SNAPSHOT/synapse-xar-maven-plugin-2.2.0-SNAPSHOT.pom
> [JENKINS] Archiving <
> https://builds.apache.org/job/Synapse%20-%20Trunk/ws/java/modules/documentation/pom.xml>
> to /home/hudson/hudson/jobs/Synapse -
> Trunk/modules/org.apache.synapse$synapse-documentation/builds/2012-09-21_08-26-02/archive/org.apache.synapse/synapse-documentation/2.2.0-SNAPSHOT/synapse-documentation-2.2.0-SNAPSHOT.pom
> [JENKINS] Archiving <
> https://builds.apache.org/job/Synapse%20-%20Trunk/ws/java/modules/transports/core/nhttp/pom.xml>
> to /home/hudson/hudson/jobs/Synapse -
> Trunk/modules/org.apache.synapse$synapse-nhttp-transport/builds/2012-09-21_08-26-02/archive/org.apache.synapse/synapse-nhttp-transport/2.2.0-SNAPSHOT/synapse-nhttp-transport-2.2.0-SNAPSHOT.pom
> [JENKINS] Archiving <
> https://builds.apache.org/job/Synapse%20-%20Trunk/ws/java/modules/transports/core/pipe/pom.xml>
> to /home/hudson/hudson/jobs/Synapse -
> Trunk/modules/org.apache.synapse$synapse-pipe-transport/builds/2012-09-21_08-26-02/archive/org.apache.synapse/synapse-pipe-transport/2.2.0-SNAPSHOT/synapse-pipe-transport-2.2.0-SNAPSHOT.pom
> [JENKINS] Archiving <
> https://builds.apache.org/job/Synapse%20-%20Trunk/ws/java/modules/transports/optional/fix/pom.xml>
> to /home/hudson/hudson/jobs/Synapse -
> Trunk/modules/org.apache.synapse$synapse-fix-transport/builds/2012-09-21_08-26-02/archive/org.apache.synapse/synapse-fix-transport/2.2.0-SNAPSHOT/synapse-fix-transport-2.2.0-SNAPSHOT.pom
> [JENKINS] Archiving <
> https://builds.apache.org/job/Synapse%20-%20Trunk/ws/java/modules/transports/pom.xml>
> to /home/hudson/hudson/jobs/Synapse -
> Trunk/modules/org.apache.synapse$synapse-transports/builds/2012-09-21_08-26-02/archive/org.apache.synapse/synapse-transports/2.2.0-SNAPSHOT/synapse-transports-2.2.0-SNAPSHOT.pom
> [JENKINS] Archiving <
> https://builds.apache.org/job/Synapse%20-%20Trunk/ws/java/modules/war/pom.xml>
> to /home/hudson/hudson/jobs/Synapse -
> Trunk/modules/org.apache.synapse$synapse-war/builds/2012-09-21_08-26-02/archive/org.apache.synapse/synapse-war/2.2.0-SNAPSHOT/synapse-war-2.2.0-SNAPSHOT.pom
> [JENKINS] Archiving <
> https://builds.apache.org/job/Synapse%20-%20Trunk/ws/java/pom.xml> to
> /home/hudson/hudson/jobs/Synapse -
> Trunk/modules/org.apache.synapse$Apache-Synapse/builds/2012-09-21_08-26-02/archive/org.apache.synapse/Apache-Synapse/2.2.0-SNAPSHOT/Apache-Synapse-2.2.0-SNAPSHOT.pom
> [JENKINS] Archiving <
> https://builds.apache.org/job/Synapse%20-%20Trunk/ws/java/modules/transports/core/vfs/pom.xml>
> to /home/hudson/hudson/jobs/Synapse -
> Trunk/modules/org.apache.synapse$synapse-vfs-transport/builds/2012-09-21_08-26-02/archive/org.apache.synapse/synapse-vfs-transport/2.2.0-SNAPSHOT/synapse-vfs-transport-2.2.0-SNAPSHOT.pom
> [JENKINS] Archiving <
> https://builds.apache.org/job/Synapse%20-%20Trunk/ws/java/modules/patches/pom.xml>
> to /home/hudson/hudson/jobs/Synapse -
> Trunk/modules/org.apache.synapse$synapse-patches/builds/2012-09-21_08-26-02/archive/org.apache.synapse/synapse-patches/2.2.0-SNAPSHOT/synapse-patches-2.2.0-SNAPSHOT.pom
> [JENKINS] Archiving <
> https://builds.apache.org/job/Synapse%20-%20Trunk/ws/java/modules/experimental/pom.xml>
> to /home/hudson/hudson/jobs/Synapse -
> Trunk/modules/org.apache.synapse$synapse-experimental/builds/2012-09-21_08-26-02/archive/org.apache.synapse/synapse-experimental/2.2.0-SNAPSHOT/synapse-experimental-2.2.0-SNAPSHOT.pom
> [JENKINS] Archiving <
> https://builds.apache.org/job/Synapse%20-%20Trunk/ws/java/modules/tasks/pom.xml>
> to /home/hudson/hudson/jobs/Synapse -
> Trunk/modules/org.apache.synapse$synapse-tasks/builds/2012-09-21_08-26-02/archive/org.apache.synapse/synapse-tasks/2.2.0-SNAPSHOT/synapse-tasks-2.2.0-SNAPSHOT.pom
> [JENKINS] Archiving <
> https://builds.apache.org/job/Synapse%20-%20Trunk/ws/java/modules/handler/pom.xml>
> to /home/hudson/hudson/jobs/Synapse -
> Trunk/modules/org.apache.synapse$synapse-handler/builds/2012-09-21_08-26-02/archive/org.apache.synapse/synapse-handler/2.2.0-SNAPSHOT/synapse-handler-2.2.0-SNAPSHOT.pom
> [JENKINS] Archiving <
> https://builds.apache.org/job/Synapse%20-%20Trunk/ws/java/modules/distribution/pom.xml>
> to /home/hudson/hudson/jobs/Synapse -
> Trunk/modules/org.apache.synapse$synapse-distribution/builds/2012-09-21_08-26-02/archive/org.apache.synapse/synapse-distribution/2.2.0-SNAPSHOT/synapse-distribution-2.2.0-SNAPSHOT.pom
> Waiting for Jenkins to finish collecting data
> mavenExecutionResult exceptions not empty
> message : Failed to execute goal
> org.apache.maven.plugins:maven-compiler-plugin:2.3.2:compile
> (default-compile) on project synapse-nhttp-transport: Compilation failure
> <
> https://builds.apache.org/job/Synapse%20-%20Trunk/ws/java/modules/transports/core/nhttp/src/main/java/org/apache/synapse/transport/nhttp/util/MessageFormatterDecoratorFactory.java>:[49,55]
> cannot find symbol
> symbol  : method
> getMessageFormatter(org.apache.axis2.context.MessageContext)
> location: class org.apache.axis2.transport.TransportUtils
>
> cause : Compilation failure
> <
> https://builds.apache.org/job/Synapse%20-%20Trunk/ws/java/modules/transports/core/nhttp/src/main/java/org/apache/synapse/transport/nhttp/util/MessageFormatterDecoratorFactory.java>:[49,55]
> cannot find symbol
> symbol  : method
> getMessageFormatter(org.apache.axis2.context.MessageContext)
> location: class org.apache.axis2.transport.TransportUtils
>
> Stack trace :
> org.apache.maven.lifecycle.LifecycleExecutionException: Failed to execute
> goal org.apache.maven.plugins:maven-compiler-plugin:2.3.2:compile
> (default-compile) on project synapse-nhttp-transport: Compilation failure
> <
> https://builds.apache.org/job/Synapse%20-%20Trunk/ws/java/modules/transports/core/nhttp/src/main/java/org/apache/synapse/transport/nhttp/util/MessageFormatterDecoratorFactory.java>:[49,55]
> cannot find symbol
> symbol  : method
> getMessageFormatter(org.apache.axis2.context.MessageContext)
> location: class org.apache.axis2.transport.TransportUtils
>
>         at
> org.apache.maven.lifecycle.internal.MojoExecutor.execute(MojoExecutor.java:213)
>         at
> org.apache.maven.lifecycle.internal.MojoExecutor.execute(MojoExecutor.java:153)
>         at
> org.apache.maven.lifecycle.internal.MojoExecutor.execute(MojoExecutor.java:145)
>         at
> org.apache.maven.lifecycle.internal.LifecycleModuleBuilder.buildProject(LifecycleModuleBuilder.java:84)
>         at
> org.apache.maven.lifecycle.internal.LifecycleModuleBuilder.buildProject(LifecycleModuleBuilder.java:59)
>         at
> org.apache.maven.lifecycle.internal.LifecycleStarter.singleThreadedBuild(LifecycleStarter.java:183)
>         at
> org.apache.maven.lifecycle.internal.LifecycleStarter.execute(LifecycleStarter.java:161)
>         at org.apache.maven.DefaultMaven.doExecute(DefaultMaven.java:319)
>         at org.apache.maven.DefaultMaven.execute(DefaultMaven.java:156)
>         at
> org.jvnet.hudson.maven3.launcher.Maven3Launcher.main(Maven3Launcher.java:79)
>         at sun.reflect.NativeMethodAccessorImpl.invoke0(Native Method)
>         at
> sun.reflect.NativeMethodAccessorImpl.invoke(NativeMethodAccessorImpl.java:39)
>         at
> sun.reflect.DelegatingMethodAccessorImpl.invoke(DelegatingMethodAccessorImpl.java:25)
>         at java.lang.reflect.Method.invoke(Method.java:597)
>         at
> org.codehaus.plexus.classworlds.launcher.Launcher.launchStandard(Launcher.java:329)
>         at
> org.codehaus.plexus.classworlds.launcher.Launcher.launch(Launcher.java:239)
>         at
> org.jvnet.hudson.maven3.agent.Maven3Main.launch(Maven3Main.java:158)
>         at hudson.maven.Maven3Builder.call(Maven3Builder.java:98)
>         at hudson.maven.Maven3Builder.call(Maven3Builder.java:64)
>         at hudson.remoting.UserRequest.perform(UserRequest.java:118)
>         at hudson.remoting.UserRequest.perform(UserRequest.java:48)
>         at hudson.remoting.Request$2.run(Request.java:326)
>         at
> hudson.remoting.InterceptingExecutorService$1.call(InterceptingExecutorService.java:72)
>         at
> java.util.concurrent.FutureTask$Sync.innerRun(FutureTask.java:303)
>         at java.util.concurrent.FutureTask.run(FutureTask.java:138)
>         at
> java.util.concurrent.ThreadPoolExecutor$Worker.runTask(ThreadPoolExecutor.java:886)
>         at
> java.util.concurrent.ThreadPoolExecutor$Worker.run(ThreadPoolExecutor.java:908)
>         at java.lang.Thread.run(Thread.java:619)
> Caused by: org.apache.maven.plugin.CompilationFailureException:
> Compilation failure
> <
> https://builds.apache.org/job/Synapse%20-%20Trunk/ws/java/modules/transports/core/nhttp/src/main/java/org/apache/synapse/transport/nhttp/util/MessageFormatterDecoratorFactory.java>:[49,55]
> cannot find symbol
> symbol  : method
> getMessageFormatter(org.apache.axis2.context.MessageContext)
> location: class org.apache.axis2.transport.TransportUtils
>
>         at
> org.apache.maven.plugin.AbstractCompilerMojo.execute(AbstractCompilerMojo.java:656)
>         at
> org.apache.maven.plugin.CompilerMojo.execute(CompilerMojo.java:128)
>         at
> org.apache.maven.plugin.DefaultBuildPluginManager.executeMojo(DefaultBuildPluginManager.java:101)
>         at
> org.apache.maven.lifecycle.internal.MojoExecutor.execute(MojoExecutor.java:209)
>         ... 27 more
> Sending e-mails to: dev@synapse.apache.org
> channel stopped
> [locks-and-latches] Releasing all the locks
> [locks-and-latches] All the locks released
>
> ---------------------------------------------------------------------
> To unsubscribe, e-mail: dev-unsubscribe@synapse.apache.org
> For additional commands, e-mail: dev-help@synapse.apache.org
>
>


-- 
Hiranya Jayathilaka
Mayhem Lab/RACE Lab;
Dept. of Computer Science, UCSB;  http://cs.ucsb.edu
E-mail: hiranya@cs.ucsb.edu <hiranya@wso2.com>;  Mobile: +1 (805) 895-7443
Blog: http://techfeast-hiranya.blogspot.com

Mime
View raw message