synapse-dev mailing list archives

Site index · List index
Message view « Date » · « Thread »
Top « Date » · « Thread »
From Apache Jenkins Server <jenk...@builds.apache.org>
Subject Build failed in Jenkins: Synapse - Trunk #4160
Date Tue, 10 Apr 2012 11:35:17 GMT
See <https://builds.apache.org/job/Synapse%20-%20Trunk/4160/>

------------------------------------------
[...truncated 143 lines...]
Downloading: http://dist.wso2.org/snapshots/maven2/org/apache/axis2/axis2-transports/1.7.0-SNAPSHOT/maven-metadata.xml
Downloading: http://repository.apache.org/snapshots/org/apache/axis2/axis2-transports/1.7.0-SNAPSHOT/maven-metadata.xml
Downloaded: http://repository.apache.org/snapshots/org/apache/axis2/axis2-transports/1.7.0-SNAPSHOT/maven-metadata.xml
(370 B at 1.1 KB/sec)
Downloading: http://repository.apache.org/snapshots/org/apache/axis2/axis2-transports/1.7.0-SNAPSHOT/axis2-transports-1.7.0-20120410.110017-298.pom
Downloaded: http://repository.apache.org/snapshots/org/apache/axis2/axis2-transports/1.7.0-SNAPSHOT/axis2-transports-1.7.0-20120410.110017-298.pom
(18 KB at 65.0 KB/sec)
Downloading: http://people.apache.org/repo/m2-snapshot-repository/org/apache/axis2/axis2-transport-http/1.7.0-SNAPSHOT/maven-metadata.xml
Downloading: http://dist.wso2.org/snapshots/maven2/org/apache/axis2/axis2-transport-http/1.7.0-SNAPSHOT/maven-metadata.xml
Downloading: http://repository.apache.org/snapshots/org/apache/axis2/axis2-transport-http/1.7.0-SNAPSHOT/maven-metadata.xml
Downloaded: http://repository.apache.org/snapshots/org/apache/axis2/axis2-transport-http/1.7.0-SNAPSHOT/maven-metadata.xml
(374 B at 16.6 KB/sec)
Downloading: http://repository.apache.org/snapshots/org/apache/axis2/axis2-transport-http/1.7.0-SNAPSHOT/axis2-transport-http-1.7.0-20120410.093230-619.pom
Downloaded: http://repository.apache.org/snapshots/org/apache/axis2/axis2-transport-http/1.7.0-SNAPSHOT/axis2-transport-http-1.7.0-20120410.093230-619.pom
(5 KB at 161.9 KB/sec)
Downloading: http://people.apache.org/repo/m2-snapshot-repository/org/apache/axis2/axis2-transport-jms/1.7.0-SNAPSHOT/maven-metadata.xml
Downloading: http://dist.wso2.org/snapshots/maven2/org/apache/axis2/axis2-transport-jms/1.7.0-SNAPSHOT/maven-metadata.xml
Downloading: http://repository.apache.org/snapshots/org/apache/axis2/axis2-transport-jms/1.7.0-SNAPSHOT/maven-metadata.xml
Downloaded: http://repository.apache.org/snapshots/org/apache/axis2/axis2-transport-jms/1.7.0-SNAPSHOT/maven-metadata.xml
(373 B at 4.7 KB/sec)
Downloading: http://repository.apache.org/snapshots/org/apache/axis2/axis2-transport-jms/1.7.0-SNAPSHOT/axis2-transport-jms-1.7.0-20120410.110017-289.pom
Downloaded: http://repository.apache.org/snapshots/org/apache/axis2/axis2-transport-jms/1.7.0-SNAPSHOT/axis2-transport-jms-1.7.0-20120410.110017-289.pom
(8 KB at 24.7 KB/sec)
Downloading: http://people.apache.org/repo/m2-incubating-repository/org/apache/axis2/axis2-transports/1.7.0-SNAPSHOT/maven-metadata.xml
Downloading: http://people.apache.org/repo/m2-snapshot-repository/org/apache/axis2/axis2-transport-local/1.7.0-SNAPSHOT/maven-metadata.xml
Downloading: http://dist.wso2.org/snapshots/maven2/org/apache/axis2/axis2-transport-local/1.7.0-SNAPSHOT/maven-metadata.xml
Downloading: http://repository.apache.org/snapshots/org/apache/axis2/axis2-transport-local/1.7.0-SNAPSHOT/maven-metadata.xml
Downloaded: http://repository.apache.org/snapshots/org/apache/axis2/axis2-transport-local/1.7.0-SNAPSHOT/maven-metadata.xml
(375 B at 17.4 KB/sec)
Downloading: http://repository.apache.org/snapshots/org/apache/axis2/axis2-transport-local/1.7.0-SNAPSHOT/axis2-transport-local-1.7.0-20120410.093230-619.pom
Downloaded: http://repository.apache.org/snapshots/org/apache/axis2/axis2-transport-local/1.7.0-SNAPSHOT/axis2-transport-local-1.7.0-20120410.093230-619.pom
(5 KB at 207.7 KB/sec)
Downloading: http://people.apache.org/repo/m2-snapshot-repository/org/apache/axis2/axis2-transport-mail/1.7.0-SNAPSHOT/maven-metadata.xml
Downloading: http://dist.wso2.org/snapshots/maven2/org/apache/axis2/axis2-transport-mail/1.7.0-SNAPSHOT/maven-metadata.xml
Downloading: http://repository.apache.org/snapshots/org/apache/axis2/axis2-transport-mail/1.7.0-SNAPSHOT/maven-metadata.xml
Downloaded: http://repository.apache.org/snapshots/org/apache/axis2/axis2-transport-mail/1.7.0-SNAPSHOT/maven-metadata.xml
(374 B at 0.6 KB/sec)
Downloading: http://repository.apache.org/snapshots/org/apache/axis2/axis2-transport-mail/1.7.0-SNAPSHOT/axis2-transport-mail-1.7.0-20120410.110017-289.pom
Downloaded: http://repository.apache.org/snapshots/org/apache/axis2/axis2-transport-mail/1.7.0-SNAPSHOT/axis2-transport-mail-1.7.0-20120410.110017-289.pom
(6 KB at 53.3 KB/sec)
Downloading: http://people.apache.org/repo/m2-snapshot-repository/org/apache/axis2/mex/1.7.0-SNAPSHOT/maven-metadata.xml
Downloading: http://repository.apache.org/snapshots/org/apache/axis2/mex/1.7.0-SNAPSHOT/maven-metadata.xml
Downloading: http://dist.wso2.org/snapshots/maven2/org/apache/axis2/mex/1.7.0-SNAPSHOT/maven-metadata.xml
Downloaded: http://repository.apache.org/snapshots/org/apache/axis2/mex/1.7.0-SNAPSHOT/maven-metadata.xml
(357 B at 15.8 KB/sec)
Downloading: http://repository.apache.org/snapshots/org/apache/axis2/mex/1.7.0-SNAPSHOT/mex-1.7.0-20120410.093230-563.pom
Downloaded: http://repository.apache.org/snapshots/org/apache/axis2/mex/1.7.0-SNAPSHOT/mex-1.7.0-20120410.093230-563.pom
(6 KB at 282.0 KB/sec)
Downloading: http://people.apache.org/repo/m2-snapshot-repository/org/apache/bsf/bsf-all/3.0/bsf-all-3.0.pom
Downloading: http://dist.wso2.org/maven2/org/apache/bsf/bsf-all/3.0/bsf-all-3.0.pom
Downloading: https://server.oosnmp.net/dist/release/org/apache/bsf/bsf-all/3.0/bsf-all-3.0.pom
Downloading: http://repo1.maven.org/maven2/org/apache/bsf/bsf-all/3.0/bsf-all-3.0.pom
Downloading: http://people.apache.org/repo/m2-snapshot-repository/org/apache/rampart/rampart/1.7.0-SNAPSHOT/maven-metadata.xml
Downloading: http://dist.wso2.org/snapshots/maven2/org/apache/rampart/rampart/1.7.0-SNAPSHOT/maven-metadata.xml
Downloading: http://repository.apache.org/snapshots/org/apache/rampart/rampart/1.7.0-SNAPSHOT/maven-metadata.xml
Downloaded: http://repository.apache.org/snapshots/org/apache/rampart/rampart/1.7.0-SNAPSHOT/maven-metadata.xml
(956 B at 35.9 KB/sec)
Downloading: http://repository.apache.org/snapshots/org/apache/rampart/rampart/1.7.0-SNAPSHOT/rampart-1.7.0-20120410.111742-419.pom
Downloaded: http://repository.apache.org/snapshots/org/apache/rampart/rampart/1.7.0-SNAPSHOT/rampart-1.7.0-20120410.111742-419.pom
(5 KB at 225.0 KB/sec)
Downloading: http://people.apache.org/repo/m2-snapshot-repository/org/apache/rampart/rampart-project/1.7.0-SNAPSHOT/maven-metadata.xml
Downloading: http://dist.wso2.org/snapshots/maven2/org/apache/rampart/rampart-project/1.7.0-SNAPSHOT/maven-metadata.xml
Downloading: http://repository.apache.org/snapshots/org/apache/rampart/rampart-project/1.7.0-SNAPSHOT/maven-metadata.xml
Downloaded: http://repository.apache.org/snapshots/org/apache/rampart/rampart-project/1.7.0-SNAPSHOT/maven-metadata.xml
(614 B at 26.1 KB/sec)
Downloading: http://repository.apache.org/snapshots/org/apache/rampart/rampart-project/1.7.0-SNAPSHOT/rampart-project-1.7.0-20120410.111749-419.pom
Downloaded: http://repository.apache.org/snapshots/org/apache/rampart/rampart-project/1.7.0-SNAPSHOT/rampart-project-1.7.0-20120410.111749-419.pom
(15 KB at 658.4 KB/sec)
Downloading: http://people.apache.org/repo/m2-snapshot-repository/org/apache/rampart/rampart-core/1.7.0-SNAPSHOT/maven-metadata.xml
Downloading: http://dist.wso2.org/snapshots/maven2/org/apache/rampart/rampart-core/1.7.0-SNAPSHOT/maven-metadata.xml
Downloading: http://repository.apache.org/snapshots/org/apache/rampart/rampart-core/1.7.0-SNAPSHOT/maven-metadata.xml
Downloaded: http://repository.apache.org/snapshots/org/apache/rampart/rampart-core/1.7.0-SNAPSHOT/maven-metadata.xml
(786 B at 38.4 KB/sec)
Downloading: http://repository.apache.org/snapshots/org/apache/rampart/rampart-core/1.7.0-SNAPSHOT/rampart-core-1.7.0-20120410.111743-419.pom
Downloaded: http://repository.apache.org/snapshots/org/apache/rampart/rampart-core/1.7.0-SNAPSHOT/rampart-core-1.7.0-20120410.111743-419.pom
(4 KB at 149.1 KB/sec)
Downloading: http://people.apache.org/repo/m2-snapshot-repository/org/apache/rampart/rampart-policy/1.7.0-SNAPSHOT/maven-metadata.xml
Downloading: http://repository.apache.org/snapshots/org/apache/rampart/rampart-policy/1.7.0-SNAPSHOT/maven-metadata.xml
Downloading: http://dist.wso2.org/snapshots/maven2/org/apache/rampart/rampart-policy/1.7.0-SNAPSHOT/maven-metadata.xml
Downloaded: http://repository.apache.org/snapshots/org/apache/rampart/rampart-policy/1.7.0-SNAPSHOT/maven-metadata.xml
(788 B at 5.1 KB/sec)
Downloading: http://repository.apache.org/snapshots/org/apache/rampart/rampart-policy/1.7.0-SNAPSHOT/rampart-policy-1.7.0-20120410.111748-419.pom
Downloaded: http://repository.apache.org/snapshots/org/apache/rampart/rampart-policy/1.7.0-SNAPSHOT/rampart-policy-1.7.0-20120410.111748-419.pom
(3 KB at 141.0 KB/sec)
Downloading: http://people.apache.org/repo/m2-snapshot-repository/org/apache/rampart/rampart-trust/1.7.0-SNAPSHOT/maven-metadata.xml
Downloading: http://dist.wso2.org/snapshots/maven2/org/apache/rampart/rampart-trust/1.7.0-SNAPSHOT/maven-metadata.xml
Downloading: http://repository.apache.org/snapshots/org/apache/rampart/rampart-trust/1.7.0-SNAPSHOT/maven-metadata.xml
Downloaded: http://repository.apache.org/snapshots/org/apache/rampart/rampart-trust/1.7.0-SNAPSHOT/maven-metadata.xml
(787 B at 38.4 KB/sec)
Downloading: http://repository.apache.org/snapshots/org/apache/rampart/rampart-trust/1.7.0-SNAPSHOT/rampart-trust-1.7.0-20120410.111750-419.pom
Downloaded: http://repository.apache.org/snapshots/org/apache/rampart/rampart-trust/1.7.0-SNAPSHOT/rampart-trust-1.7.0-20120410.111750-419.pom
(4 KB at 208.2 KB/sec)
Downloading: http://people.apache.org/repo/m2-snapshot-repository/org/apache/sandesha2/sandesha2/1.7.0-SNAPSHOT/maven-metadata.xml
Downloading: http://dist.wso2.org/snapshots/maven2/org/apache/sandesha2/sandesha2/1.7.0-SNAPSHOT/maven-metadata.xml
Downloading: http://repository.apache.org/snapshots/org/apache/sandesha2/sandesha2/1.7.0-SNAPSHOT/maven-metadata.xml
Downloaded: http://repository.apache.org/snapshots/org/apache/sandesha2/sandesha2/1.7.0-SNAPSHOT/maven-metadata.xml
(737 B at 15.0 KB/sec)
Downloading: http://repository.apache.org/snapshots/org/apache/sandesha2/sandesha2/1.7.0-SNAPSHOT/sandesha2-1.7.0-20111229.100338-53.pom
Downloaded: http://repository.apache.org/snapshots/org/apache/sandesha2/sandesha2/1.7.0-SNAPSHOT/sandesha2-1.7.0-20111229.100338-53.pom
(6 KB at 47.4 KB/sec)
Downloading: http://people.apache.org/repo/m2-snapshot-repository/org/apache/sandesha2/sandesha2-parent/1.7.0-SNAPSHOT/maven-metadata.xml
Downloading: http://dist.wso2.org/snapshots/maven2/org/apache/sandesha2/sandesha2-parent/1.7.0-SNAPSHOT/maven-metadata.xml
Downloading: http://repository.apache.org/snapshots/org/apache/sandesha2/sandesha2-parent/1.7.0-SNAPSHOT/maven-metadata.xml
Downloaded: http://repository.apache.org/snapshots/org/apache/sandesha2/sandesha2-parent/1.7.0-SNAPSHOT/maven-metadata.xml
(570 B at 0.8 KB/sec)
Downloading: http://repository.apache.org/snapshots/org/apache/sandesha2/sandesha2-parent/1.7.0-SNAPSHOT/sandesha2-parent-1.7.0-20111229.100345-53.pom
Downloaded: http://repository.apache.org/snapshots/org/apache/sandesha2/sandesha2-parent/1.7.0-SNAPSHOT/sandesha2-parent-1.7.0-20111229.100345-53.pom
(18 KB at 120.2 KB/sec)
Downloading: http://people.apache.org/repo/m2-snapshot-repository/org/apache/sandesha2/sandesha2-core/1.7.0-SNAPSHOT/maven-metadata.xml
Downloading: http://dist.wso2.org/snapshots/maven2/org/apache/sandesha2/sandesha2-core/1.7.0-SNAPSHOT/maven-metadata.xml
Downloading: http://repository.apache.org/snapshots/org/apache/sandesha2/sandesha2-core/1.7.0-SNAPSHOT/maven-metadata.xml
Downloaded: http://repository.apache.org/snapshots/org/apache/sandesha2/sandesha2-core/1.7.0-SNAPSHOT/maven-metadata.xml
(957 B at 11.0 KB/sec)
Downloading: http://repository.apache.org/snapshots/org/apache/sandesha2/sandesha2-core/1.7.0-SNAPSHOT/sandesha2-core-1.7.0-20111229.100343-53.pom
Downloaded: http://repository.apache.org/snapshots/org/apache/sandesha2/sandesha2-core/1.7.0-SNAPSHOT/sandesha2-core-1.7.0-20111229.100343-53.pom
(4 KB at 33.6 KB/sec)
Downloading: http://people.apache.org/repo/m2-snapshot-repository/org/apache/sandesha2/sandesha2-policy/1.7.0-SNAPSHOT/maven-metadata.xml
Downloading: http://dist.wso2.org/snapshots/maven2/org/apache/sandesha2/sandesha2-policy/1.7.0-SNAPSHOT/maven-metadata.xml
Downloading: http://repository.apache.org/snapshots/org/apache/sandesha2/sandesha2-policy/1.7.0-SNAPSHOT/maven-metadata.xml
Downloaded: http://repository.apache.org/snapshots/org/apache/sandesha2/sandesha2-policy/1.7.0-SNAPSHOT/maven-metadata.xml
(744 B at 3.2 KB/sec)
Downloading: http://repository.apache.org/snapshots/org/apache/sandesha2/sandesha2-policy/1.7.0-SNAPSHOT/sandesha2-policy-1.7.0-20111229.100348-53.pom
Downloaded: http://repository.apache.org/snapshots/org/apache/sandesha2/sandesha2-policy/1.7.0-SNAPSHOT/sandesha2-policy-1.7.0-20111229.100348-53.pom
(5 KB at 39.8 KB/sec)
Downloading: http://people.apache.org/repo/m2-snapshot-repository/org/apache/ws/commons/axiom/axiom-api/1.2.13-SNAPSHOT/maven-metadata.xml
Downloading: http://repository.apache.org/snapshots/org/apache/ws/commons/axiom/axiom-api/1.2.13-SNAPSHOT/maven-metadata.xml
Downloading: http://dist.wso2.org/snapshots/maven2/org/apache/ws/commons/axiom/axiom-api/1.2.13-SNAPSHOT/maven-metadata.xml
Downloading: http://people.apache.org/repo/m2-snapshot-repository/org/apache/ws/commons/axiom/axiom-api/1.2.13-SNAPSHOT/axiom-api-1.2.13-SNAPSHOT.pom
Downloading: http://dist.wso2.org/snapshots/maven2/org/apache/ws/commons/axiom/axiom-api/1.2.13-SNAPSHOT/axiom-api-1.2.13-SNAPSHOT.pom
Downloading: http://repository.apache.org/snapshots/org/apache/ws/commons/axiom/axiom-api/1.2.13-SNAPSHOT/axiom-api-1.2.13-SNAPSHOT.pom
Downloading: http://people.apache.org/repo/m2-snapshot-repository/org/apache/ws/commons/axiom/axiom-dom/1.2.13-SNAPSHOT/maven-metadata.xml
Downloading: http://dist.wso2.org/snapshots/maven2/org/apache/ws/commons/axiom/axiom-dom/1.2.13-SNAPSHOT/maven-metadata.xml
Downloading: http://repository.apache.org/snapshots/org/apache/ws/commons/axiom/axiom-dom/1.2.13-SNAPSHOT/maven-metadata.xml
Downloading: http://people.apache.org/repo/m2-snapshot-repository/org/apache/ws/commons/axiom/axiom-dom/1.2.13-SNAPSHOT/axiom-dom-1.2.13-SNAPSHOT.pom
Downloading: http://dist.wso2.org/snapshots/maven2/org/apache/ws/commons/axiom/axiom-dom/1.2.13-SNAPSHOT/axiom-dom-1.2.13-SNAPSHOT.pom
Downloading: http://repository.apache.org/snapshots/org/apache/ws/commons/axiom/axiom-dom/1.2.13-SNAPSHOT/axiom-dom-1.2.13-SNAPSHOT.pom
Downloading: http://people.apache.org/repo/m2-snapshot-repository/org/apache/ws/commons/axiom/axiom-impl/1.2.13-SNAPSHOT/maven-metadata.xml
Downloading: http://dist.wso2.org/snapshots/maven2/org/apache/ws/commons/axiom/axiom-impl/1.2.13-SNAPSHOT/maven-metadata.xml
Downloading: http://repository.apache.org/snapshots/org/apache/ws/commons/axiom/axiom-impl/1.2.13-SNAPSHOT/maven-metadata.xml
Downloading: http://people.apache.org/repo/m2-snapshot-repository/org/apache/ws/commons/axiom/axiom-impl/1.2.13-SNAPSHOT/axiom-impl-1.2.13-SNAPSHOT.pom
Downloading: http://dist.wso2.org/snapshots/maven2/org/apache/ws/commons/axiom/axiom-impl/1.2.13-SNAPSHOT/axiom-impl-1.2.13-SNAPSHOT.pom
Downloading: http://repository.apache.org/snapshots/org/apache/ws/commons/axiom/axiom-impl/1.2.13-SNAPSHOT/axiom-impl-1.2.13-SNAPSHOT.pom
Downloading: http://people.apache.org/repo/m2-snapshot-repository/org/wso2/eventing/wso2eventing-api/SNAPSHOT/maven-metadata.xml
Downloading: http://dist.wso2.org/snapshots/maven2/org/wso2/eventing/wso2eventing-api/SNAPSHOT/maven-metadata.xml
Downloaded: http://dist.wso2.org/snapshots/maven2/org/wso2/eventing/wso2eventing-api/SNAPSHOT/maven-metadata.xml
(576 B at 0.9 KB/sec)
Downloading: http://people.apache.org/repo/m2-snapshot-repository/org/wso2/eventing/wso2eventing-parent/SNAPSHOT/maven-metadata.xml
Downloading: http://dist.wso2.org/snapshots/maven2/org/wso2/eventing/wso2eventing-parent/SNAPSHOT/maven-metadata.xml
Downloaded: http://dist.wso2.org/snapshots/maven2/org/wso2/eventing/wso2eventing-parent/SNAPSHOT/maven-metadata.xml
(579 B at 1.0 KB/sec)
Downloading: http://people.apache.org/repo/m2-snapshot-repository/quickfixj/quickfixj-all/1.4.0/quickfixj-all-1.4.0.pom
Downloading: http://dist.wso2.org/maven2/quickfixj/quickfixj-all/1.4.0/quickfixj-all-1.4.0.pom
Downloading: https://server.oosnmp.net/dist/release/quickfixj/quickfixj-all/1.4.0/quickfixj-all-1.4.0.pom
Downloading: http://repo1.maven.org/maven2/quickfixj/quickfixj-all/1.4.0/quickfixj-all-1.4.0.pom
Downloading: http://people.apache.org/repo/m2-snapshot-repository/org/apache/axis2/axis2-transport-testkit/1.7.0-SNAPSHOT/maven-metadata.xml
Downloading: http://dist.wso2.org/snapshots/maven2/org/apache/axis2/axis2-transport-testkit/1.7.0-SNAPSHOT/maven-metadata.xml
Downloading: http://repository.apache.org/snapshots/org/apache/axis2/axis2-transport-testkit/1.7.0-SNAPSHOT/maven-metadata.xml
Downloaded: http://repository.apache.org/snapshots/org/apache/axis2/axis2-transport-testkit/1.7.0-SNAPSHOT/maven-metadata.xml
(377 B at 1.6 KB/sec)
Downloading: http://repository.apache.org/snapshots/org/apache/axis2/axis2-transport-testkit/1.7.0-SNAPSHOT/axis2-transport-testkit-1.7.0-20120410.110017-293.pom
Downloaded: http://repository.apache.org/snapshots/org/apache/axis2/axis2-transport-testkit/1.7.0-SNAPSHOT/axis2-transport-testkit-1.7.0-20120410.110017-293.pom
(10 KB at 114.7 KB/sec)
[INFO] Generating "Dependencies" report    --- maven-project-info-reports-plugin:2.2
[INFO] Generating "Project License" report    --- maven-project-info-reports-plugin:2.2
[INFO] Generating "Project Modules" report    --- maven-project-info-reports-plugin:2.2
[INFO] Generating "Project Team" report    --- maven-project-info-reports-plugin:2.2
[INFO] Generating "Continuous Integration" report    --- maven-project-info-reports-plugin:2.2
[FINDBUGS] No report found for mojo site
[JENKINS] Archiving site from <https://builds.apache.org/job/Synapse%20-%20Trunk/ws/java/target/site>
to /home/hudson/hudson/jobs/Synapse - Trunk/site
Successfully loaded native POSIX impl.
[JENKINS] Archiving <https://builds.apache.org/job/Synapse%20-%20Trunk/ws/java/pom.xml>
to /home/hudson/hudson/jobs/Synapse - Trunk/modules/org.apache.synapse$Apache-Synapse/builds/2012-04-10_11-33-50/archive/org.apache.synapse/Apache-Synapse/2.2.0-SNAPSHOT/Apache-Synapse-2.2.0-SNAPSHOT.pom
[INFO]                                                                         
[INFO] ------------------------------------------------------------------------
[INFO] Building Apache Synapse - Secure Vault 2.2.0-SNAPSHOT
[INFO] ------------------------------------------------------------------------
Downloading: http://people.apache.org/repo/m2-snapshot-repository/org/apache/ws/commons/axiom/axiom-api/1.2.13-SNAPSHOT/axiom-api-1.2.13-SNAPSHOT.pom
Downloading: http://dist.wso2.org/snapshots/maven2/org/apache/ws/commons/axiom/axiom-api/1.2.13-SNAPSHOT/axiom-api-1.2.13-SNAPSHOT.pom
Downloading: http://repository.apache.org/snapshots/org/apache/ws/commons/axiom/axiom-api/1.2.13-SNAPSHOT/axiom-api-1.2.13-SNAPSHOT.pom
[WARNING] The POM for org.apache.ws.commons.axiom:axiom-api:jar:1.2.13-SNAPSHOT is missing,
no dependency information available
Downloading: http://people.apache.org/repo/m2-snapshot-repository/org/apache/ws/commons/axiom/axiom-impl/1.2.13-SNAPSHOT/axiom-impl-1.2.13-SNAPSHOT.pom
Downloading: http://dist.wso2.org/snapshots/maven2/org/apache/ws/commons/axiom/axiom-impl/1.2.13-SNAPSHOT/axiom-impl-1.2.13-SNAPSHOT.pom
Downloading: http://repository.apache.org/snapshots/org/apache/ws/commons/axiom/axiom-impl/1.2.13-SNAPSHOT/axiom-impl-1.2.13-SNAPSHOT.pom
[WARNING] The POM for org.apache.ws.commons.axiom:axiom-impl:jar:1.2.13-SNAPSHOT is missing,
no dependency information available
Downloading: http://people.apache.org/repo/m2-snapshot-repository/org/apache/ws/commons/axiom/axiom-api/1.2.13-SNAPSHOT/axiom-api-1.2.13-SNAPSHOT.jar
Downloading: http://people.apache.org/repo/m2-snapshot-repository/org/apache/ws/commons/axiom/axiom-impl/1.2.13-SNAPSHOT/axiom-impl-1.2.13-SNAPSHOT.jar
Downloading: http://dist.wso2.org/snapshots/maven2/org/apache/ws/commons/axiom/axiom-api/1.2.13-SNAPSHOT/axiom-api-1.2.13-SNAPSHOT.jar
Downloading: http://dist.wso2.org/snapshots/maven2/org/apache/ws/commons/axiom/axiom-impl/1.2.13-SNAPSHOT/axiom-impl-1.2.13-SNAPSHOT.jar
Downloading: http://repository.apache.org/snapshots/org/apache/ws/commons/axiom/axiom-api/1.2.13-SNAPSHOT/axiom-api-1.2.13-SNAPSHOT.jar
Downloading: http://repository.apache.org/snapshots/org/apache/ws/commons/axiom/axiom-impl/1.2.13-SNAPSHOT/axiom-impl-1.2.13-SNAPSHOT.jar
[JENKINS] Archiving <https://builds.apache.org/job/Synapse%20-%20Trunk/ws/java/modules/securevault/pom.xml>
to /home/hudson/hudson/jobs/Synapse - Trunk/modules/org.apache.synapse$synapse-securevault/builds/2012-04-10_11-33-50/archive/org.apache.synapse/synapse-securevault/2.2.0-SNAPSHOT/synapse-securevault-2.2.0-SNAPSHOT.pom
[INFO] ------------------------------------------------------------------------
[INFO] Reactor Summary:
[INFO] 
[INFO] Apache Synapse .................................... SUCCESS [1:12.097s]
[INFO] Apache Synapse - Secure Vault ..................... FAILURE [4.181s]
[INFO] Apache Synapse - Commons .......................... SKIPPED
[INFO] Apache Synapse - Transports ....................... SKIPPED
[INFO] Apache Synapse - Non-blocking HTTP/s Transport .... SKIPPED
[INFO] Apache Synapse - PIPE Transport ................... SKIPPED
[INFO] Apache Synapse - VFS Transport .................... SKIPPED
[INFO] Apache Synapse - FIX Transport .................... SKIPPED
[INFO] Apache Synapse - Tasks ............................ SKIPPED
[INFO] Apache Synapse - Core ............................. SKIPPED
[INFO] Apache Synapse - Extensions ....................... SKIPPED
[INFO] Apache Synapse - Samples .......................... SKIPPED
[INFO] Apache Synapse - Patches .......................... SKIPPED
[INFO] Apache Synapse - Experimental code ................ SKIPPED
[INFO] Apache Synapse - Documentation .................... SKIPPED
[INFO] Apache Synapse - Web Application .................. SKIPPED
[INFO] Apache Synapse - Handler Module ................... SKIPPED
[INFO] Apache Synapse - XAR Maven Plugin ................. SKIPPED
[INFO] Apache Synapse - Configuration Migrator ........... SKIPPED
[INFO] Apache Synapse - Distribution ..................... SKIPPED
[INFO] Apache Synapse - Package skeleton ZIP ............. SKIPPED
[INFO] Apache Synapse - Package archetype ................ SKIPPED
[INFO] Apache Synapse - Integration ...................... SKIPPED
[INFO] ------------------------------------------------------------------------
[INFO] BUILD FAILURE
[INFO] ------------------------------------------------------------------------
[INFO] Total time: 1:19.214s
[INFO] Finished at: Tue Apr 10 11:35:16 UTC 2012
[INFO] Final Memory: 25M/175M
[INFO] ------------------------------------------------------------------------
mavenExecutionResult exceptions not empty
message : Failed to execute goal on project synapse-securevault: Could not resolve dependencies
for project org.apache.synapse:synapse-securevault:bundle:2.2.0-SNAPSHOT: The following artifacts
could not be resolved: org.apache.ws.commons.axiom:axiom-api:jar:1.2.13-SNAPSHOT, org.apache.ws.commons.axiom:axiom-impl:jar:1.2.13-SNAPSHOT:
Could not find artifact org.apache.ws.commons.axiom:axiom-api:jar:1.2.13-SNAPSHOT in apache-snapshots
(http://people.apache.org/repo/m2-snapshot-repository/)
cause : Could not resolve dependencies for project org.apache.synapse:synapse-securevault:bundle:2.2.0-SNAPSHOT:
The following artifacts could not be resolved: org.apache.ws.commons.axiom:axiom-api:jar:1.2.13-SNAPSHOT,
org.apache.ws.commons.axiom:axiom-impl:jar:1.2.13-SNAPSHOT: Could not find artifact org.apache.ws.commons.axiom:axiom-api:jar:1.2.13-SNAPSHOT
in apache-snapshots (http://people.apache.org/repo/m2-snapshot-repository/)
Stack trace : 
org.apache.maven.lifecycle.LifecycleExecutionException: Failed to execute goal on project
synapse-securevault: Could not resolve dependencies for project org.apache.synapse:synapse-securevault:bundle:2.2.0-SNAPSHOT:
The following artifacts could not be resolved: org.apache.ws.commons.axiom:axiom-api:jar:1.2.13-SNAPSHOT,
org.apache.ws.commons.axiom:axiom-impl:jar:1.2.13-SNAPSHOT: Could not find artifact org.apache.ws.commons.axiom:axiom-api:jar:1.2.13-SNAPSHOT
in apache-snapshots (http://people.apache.org/repo/m2-snapshot-repository/)
	at org.apache.maven.lifecycle.internal.LifecycleDependencyResolver.getDependencies(LifecycleDependencyResolver.java:196)
	at org.apache.maven.lifecycle.internal.LifecycleDependencyResolver.resolveProjectDependencies(LifecycleDependencyResolver.java:108)
	at org.apache.maven.lifecycle.internal.MojoExecutor.ensureDependenciesAreResolved(MojoExecutor.java:258)
	at org.apache.maven.lifecycle.internal.MojoExecutor.execute(MojoExecutor.java:201)
	at org.apache.maven.lifecycle.internal.MojoExecutor.execute(MojoExecutor.java:153)
	at org.apache.maven.lifecycle.internal.MojoExecutor.execute(MojoExecutor.java:145)
	at org.apache.maven.lifecycle.internal.LifecycleModuleBuilder.buildProject(LifecycleModuleBuilder.java:84)
	at org.apache.maven.lifecycle.internal.LifecycleModuleBuilder.buildProject(LifecycleModuleBuilder.java:59)
	at org.apache.maven.lifecycle.internal.LifecycleStarter.singleThreadedBuild(LifecycleStarter.java:183)
	at org.apache.maven.lifecycle.internal.LifecycleStarter.execute(LifecycleStarter.java:161)
	at org.apache.maven.DefaultMaven.doExecute(DefaultMaven.java:319)
	at org.apache.maven.DefaultMaven.execute(DefaultMaven.java:156)
	at org.jvnet.hudson.maven3.launcher.Maven3Launcher.main(Maven3Launcher.java:79)
	at sun.reflect.NativeMethodAccessorImpl.invoke0(Native Method)
	at sun.reflect.NativeMethodAccessorImpl.invoke(NativeMethodAccessorImpl.java:39)
	at sun.reflect.DelegatingMethodAccessorImpl.invoke(DelegatingMethodAccessorImpl.java:25)
	at java.lang.reflect.Method.invoke(Method.java:597)
	at org.codehaus.plexus.classworlds.launcher.Launcher.launchStandard(Launcher.java:329)
	at org.codehaus.plexus.classworlds.launcher.Launcher.launch(Launcher.java:239)
	at org.jvnet.hudson.maven3.agent.Maven3Main.launch(Maven3Main.java:158)
	at hudson.maven.Maven3Builder.call(Maven3Builder.java:104)
	at hudson.maven.Maven3Builder.call(Maven3Builder.java:70)
	at hudson.remoting.UserRequest.perform(UserRequest.java:118)
	at hudson.remoting.UserRequest.perform(UserRequest.java:48)
	at hudson.remoting.Request$2.run(Request.java:287)
	at hudson.remoting.InterceptingExecutorService$1.call(InterceptingExecutorService.java:72)
	at java.util.concurrent.FutureTask$Sync.innerRun(FutureTask.java:303)
	at java.util.concurrent.FutureTask.run(FutureTask.java:138)
	at java.util.concurrent.ThreadPoolExecutor$Worker.runTask(ThreadPoolExecutor.java:886)
	at java.util.concurrent.ThreadPoolExecutor$Worker.run(ThreadPoolExecutor.java:908)
	at java.lang.Thread.run(Thread.java:619)
Caused by: org.apache.maven.project.DependencyResolutionException: Could not resolve dependencies
for project org.apache.synapse:synapse-securevault:bundle:2.2.0-SNAPSHOT: The following artifacts
could not be resolved: org.apache.ws.commons.axiom:axiom-api:jar:1.2.13-SNAPSHOT, org.apache.ws.commons.axiom:axiom-impl:jar:1.2.13-SNAPSHOT:
Could not find artifact org.apache.ws.commons.axiom:axiom-api:jar:1.2.13-SNAPSHOT in apache-snapshots
(http://people.apache.org/repo/m2-snapshot-repository/)
	at org.apache.maven.project.DefaultProjectDependenciesResolver.resolve(DefaultProjectDependenciesResolver.java:170)
	at org.apache.maven.lifecycle.internal.LifecycleDependencyResolver.getDependencies(LifecycleDependencyResolver.java:171)
	... 30 more
Caused by: org.sonatype.aether.resolution.DependencyResolutionException: The following artifacts
could not be resolved: org.apache.ws.commons.axiom:axiom-api:jar:1.2.13-SNAPSHOT, org.apache.ws.commons.axiom:axiom-impl:jar:1.2.13-SNAPSHOT:
Could not find artifact org.apache.ws.commons.axiom:axiom-api:jar:1.2.13-SNAPSHOT in apache-snapshots
(http://people.apache.org/repo/m2-snapshot-repository/)
	at org.sonatype.aether.impl.internal.DefaultRepositorySystem.resolveDependencies(DefaultRepositorySystem.java:412)
	at org.apache.maven.project.DefaultProjectDependenciesResolver.resolve(DefaultProjectDependenciesResolver.java:164)
	... 31 more
Caused by: org.sonatype.aether.resolution.ArtifactResolutionException: The following artifacts
could not be resolved: org.apache.ws.commons.axiom:axiom-api:jar:1.2.13-SNAPSHOT, org.apache.ws.commons.axiom:axiom-impl:jar:1.2.13-SNAPSHOT:
Could not find artifact org.apache.ws.commons.axiom:axiom-api:jar:1.2.13-SNAPSHOT in apache-snapshots
(http://people.apache.org/repo/m2-snapshot-repository/)
	at org.sonatype.aether.impl.internal.DefaultArtifactResolver.resolve(DefaultArtifactResolver.java:541)
	at org.sonatype.aether.impl.internal.DefaultArtifactResolver.resolveArtifacts(DefaultArtifactResolver.java:220)
	at org.sonatype.aether.impl.internal.DefaultRepositorySystem.resolveDependencies(DefaultRepositorySystem.java:395)
	... 32 more
Caused by: org.sonatype.aether.transfer.ArtifactNotFoundException: Could not find artifact
org.apache.ws.commons.axiom:axiom-api:jar:1.2.13-SNAPSHOT in apache-snapshots (http://people.apache.org/repo/m2-snapshot-repository/)
	at org.sonatype.aether.connector.wagon.WagonRepositoryConnector$4.wrap(WagonRepositoryConnector.java:945)
	at org.sonatype.aether.connector.wagon.WagonRepositoryConnector$4.wrap(WagonRepositoryConnector.java:940)
	at org.sonatype.aether.connector.wagon.WagonRepositoryConnector$GetTask.flush(WagonRepositoryConnector.java:695)
	at org.sonatype.aether.connector.wagon.WagonRepositoryConnector$GetTask.flush(WagonRepositoryConnector.java:689)
	at org.sonatype.aether.connector.wagon.WagonRepositoryConnector.get(WagonRepositoryConnector.java:445)
	at org.sonatype.aether.impl.internal.DefaultArtifactResolver.resolve(DefaultArtifactResolver.java:460)
	... 34 more
channel stopped
[locks-and-latches] Releasing all the locks
[locks-and-latches] All the locks released

---------------------------------------------------------------------
To unsubscribe, e-mail: dev-unsubscribe@synapse.apache.org
For additional commands, e-mail: dev-help@synapse.apache.org


Mime
View raw message