synapse-dev mailing list archives

Site index · List index
Message view « Date » · « Thread »
Top « Date » · « Thread »
From Apache Jenkins Server <jenk...@builds.apache.org>
Subject Build failed in Jenkins: Synapse - Trunk #4123
Date Tue, 07 Feb 2012 23:37:33 GMT
See <https://builds.apache.org/job/Synapse%20-%20Trunk/4123/>

------------------------------------------
[...truncated 1633 lines...]
[WARNING] Bundle org.apache.synapse:synapse-extensions:bundle:2.2.0-SNAPSHOT : Did not find
matching referal for !org.apache.synapse.mediators.bsf.*
[WARNING] Bundle org.apache.synapse:synapse-extensions:bundle:2.2.0-SNAPSHOT : Did not find
matching referal for !org.apache.synapse.mediators.spring.*
[WARNING] Bundle org.apache.synapse:synapse-extensions:bundle:2.2.0-SNAPSHOT : Did not find
matching referal for !org.apache.synapse.mediators.throttle.*
[WARNING] Bundle org.apache.synapse:synapse-extensions:bundle:2.2.0-SNAPSHOT : Did not find
matching referal for !org.apache.synapse.mediators.xquery.*
[INFO] [INFO] Installing <https://builds.apache.org/job/Synapse%20-%20Trunk/ws/java/modules/extensions/target/synapse-extensions-2.2.0-SNAPSHOT.jar>
to <https://builds.apache.org/job/Synapse%20-%20Trunk/ws/.repository/org/apache/synapse/synapse-extensions/2.2.0-SNAPSHOT/synapse-extensions-2.2.0-SNAPSHOT.jar>
[INFO] Installing <https://builds.apache.org/job/Synapse%20-%20Trunk/ws/java/modules/extensions/pom.xml>
to <https://builds.apache.org/job/Synapse%20-%20Trunk/ws/.repository/org/apache/synapse/synapse-extensions/2.2.0-SNAPSHOT/synapse-extensions-2.2.0-SNAPSHOT.pom>

[INFO] --- maven-install-plugin:2.3.1:install (default-install) @ synapse-extensions ---
[INFO] 
[INFO] --- maven-bundle-plugin:2.3.6:install (default-install) @ synapse-extensions ---
[INFO] Installing org/apache/synapse/synapse-extensions/2.2.0-SNAPSHOT/synapse-extensions-2.2.0-SNAPSHOT.jar
[INFO] Writing OBR metadata
[INFO] [INFO] configuring report plugin org.apache.maven.plugins:maven-project-info-reports-plugin:2.2

[INFO] --- maven-site-plugin:3.0:site (default-site) @ synapse-extensions ---
[INFO] Parent project loaded from repository: org.apache:apache:pom:9
[INFO] Relativizing decoration links with respect to project URL: http://synapse.apache.org/modules/synapse-extensions/
[INFO] Rendering site with org.apache.maven.skins:maven-default-skin:jar:1.0 skin.
[INFO] Generating "About" report    --- maven-project-info-reports-plugin:2.2
[INFO] Generating "Source Repository" report    --- maven-project-info-reports-plugin:2.2
[INFO] Generating "Plugin Management" report    --- maven-project-info-reports-plugin:2.2
[INFO] Generating "Mailing Lists" report    --- maven-project-info-reports-plugin:2.2
[INFO] Generating "Issue Tracking" report    --- maven-project-info-reports-plugin:2.2
[INFO] Generating "Project Plugins" report    --- maven-project-info-reports-plugin:2.2
[INFO] Generating "Dependency Convergence" report    --- maven-project-info-reports-plugin:2.2
[INFO] Generating "Project Summary" report    --- maven-project-info-reports-plugin:2.2
[INFO] Generating "Dependency Management" report    --- maven-project-info-reports-plugin:2.2
Downloading: http://people.apache.org/repo/m2-snapshot-repository/net/sf/saxon/saxon/8.9/saxon-8.9.pom
Downloading: http://dist.wso2.org/maven2/net/sf/saxon/saxon/8.9/saxon-8.9.pom
Downloading: http://repo1.maven.org/maven2/net/sf/saxon/saxon/8.9/saxon-8.9.pom
Downloading: http://people.apache.org/repo/m2-snapshot-repository/net/sf/saxon/saxon-xqj/8.9/saxon-xqj-8.9.pom
Downloading: http://dist.wso2.org/maven2/net/sf/saxon/saxon-xqj/8.9/saxon-xqj-8.9.pom
Downloading: http://repo1.maven.org/maven2/net/sf/saxon/saxon-xqj/8.9/saxon-xqj-8.9.pom
Downloading: http://people.apache.org/repo/m2-snapshot-repository/org/apache/bsf/bsf-all/3.0/bsf-all-3.0.pom
Downloading: http://dist.wso2.org/maven2/org/apache/bsf/bsf-all/3.0/bsf-all-3.0.pom
Downloading: http://repo1.maven.org/maven2/org/apache/bsf/bsf-all/3.0/bsf-all-3.0.pom
Downloading: http://people.apache.org/repo/m2-snapshot-repository/quickfixj/quickfixj-all/1.4.0/quickfixj-all-1.4.0.pom
Downloading: http://dist.wso2.org/maven2/quickfixj/quickfixj-all/1.4.0/quickfixj-all-1.4.0.pom
Downloading: http://repo1.maven.org/maven2/quickfixj/quickfixj-all/1.4.0/quickfixj-all-1.4.0.pom
[INFO] Generating "Dependencies" report    --- maven-project-info-reports-plugin:2.2
Downloading: http://people.apache.org/repo/m2-snapshot-repository/net/sf/saxon/saxon-xqj/8.9/saxon-xqj-8.9.pom
Downloading: http://dist.wso2.org/maven2/net/sf/saxon/saxon-xqj/8.9/saxon-xqj-8.9.pom
Downloading: http://repo1.maven.org/maven2/net/sf/saxon/saxon-xqj/8.9/saxon-xqj-8.9.pom
Downloading: http://people.apache.org/repo/m2-snapshot-repository/org/apache/bsf/bsf-all/3.0/bsf-all-3.0.pom
Downloading: http://dist.wso2.org/maven2/org/apache/bsf/bsf-all/3.0/bsf-all-3.0.pom
Downloading: http://repo1.maven.org/maven2/org/apache/bsf/bsf-all/3.0/bsf-all-3.0.pom
Downloading: http://people.apache.org/repo/m2-snapshot-repository/net/sf/saxon/saxon/8.9/saxon-8.9.pom
Downloading: http://dist.wso2.org/maven2/net/sf/saxon/saxon/8.9/saxon-8.9.pom
Downloading: http://repo1.maven.org/maven2/net/sf/saxon/saxon/8.9/saxon-8.9.pom
Downloading: http://people.apache.org/repo/m2-snapshot-repository/net/sf/saxon/saxon/8.9/saxon-8.9.pom
Downloading: http://dist.wso2.org/maven2/net/sf/saxon/saxon/8.9/saxon-8.9.pom
Downloading: http://repo1.maven.org/maven2/net/sf/saxon/saxon/8.9/saxon-8.9.pom
Downloading: http://people.apache.org/repo/m2-snapshot-repository/net/sf/saxon/saxon-xqj/8.9/saxon-xqj-8.9.pom
Downloading: http://dist.wso2.org/maven2/net/sf/saxon/saxon-xqj/8.9/saxon-xqj-8.9.pom
Downloading: http://repo1.maven.org/maven2/net/sf/saxon/saxon-xqj/8.9/saxon-xqj-8.9.pom
Downloading: http://people.apache.org/repo/m2-snapshot-repository/org/apache/bsf/bsf-all/3.0/bsf-all-3.0.pom
Downloading: http://dist.wso2.org/maven2/org/apache/bsf/bsf-all/3.0/bsf-all-3.0.pom
Downloading: http://repo1.maven.org/maven2/org/apache/bsf/bsf-all/3.0/bsf-all-3.0.pom
[INFO] Generating "Project License" report    --- maven-project-info-reports-plugin:2.2
[INFO] Generating "Project Team" report    --- maven-project-info-reports-plugin:2.2
[INFO] Generating "Continuous Integration" report    --- maven-project-info-reports-plugin:2.2
[FINDBUGS] Using set difference to compute new warnings
[FINDBUGS] Not changing build status, since no threshold has been exceeded
[JENKINS] Archiving site from <https://builds.apache.org/job/Synapse%20-%20Trunk/ws/java/modules/extensions/target/site>
to /home/hudson/hudson/jobs/Synapse - Trunk/site/synapse-extensions
[JENKINS] Archiving <https://builds.apache.org/job/Synapse%20-%20Trunk/ws/java/modules/extensions/pom.xml>
to /home/hudson/hudson/jobs/Synapse - Trunk/modules/org.apache.synapse$synapse-extensions/builds/2012-02-07_23-30-47/archive/org.apache.synapse/synapse-extensions/2.2.0-SNAPSHOT/synapse-extensions-2.2.0-SNAPSHOT.pom
[JENKINS] Archiving <https://builds.apache.org/job/Synapse%20-%20Trunk/ws/java/modules/extensions/target/synapse-extensions-2.2.0-SNAPSHOT.jar>
to /home/hudson/hudson/jobs/Synapse - Trunk/modules/org.apache.synapse$synapse-extensions/builds/2012-02-07_23-30-47/archive/org.apache.synapse/synapse-extensions/2.2.0-SNAPSHOT/synapse-extensions-2.2.0-SNAPSHOT.jar
[INFO]                                                                         
[INFO] ------------------------------------------------------------------------
[INFO] Building Apache Synapse - Samples 2.2.0-SNAPSHOT
[INFO] ------------------------------------------------------------------------
Downloading: http://shibboleth.internet2.edu/downloads/maven2/org/apache/rampart/rampart-policy/1.7.0-SNAPSHOT/maven-metadata.xml
Downloading: http://shibboleth.internet2.edu/downloads/maven2/org/apache/axis2/mex/1.7.0-SNAPSHOT/maven-metadata.xml
Downloading: http://shibboleth.internet2.edu/downloads/maven2/org/apache/rampart/rampart-trust/1.7.0-SNAPSHOT/maven-metadata.xml
Downloading: http://shibboleth.internet2.edu/downloads/maven2/org/apache/ws/commons/axiom/axiom-dom/1.2.13-SNAPSHOT/maven-metadata.xml
Downloading: http://shibboleth.internet2.edu/downloads/maven2/org/apache/axis2/axis2-kernel/1.7.0-SNAPSHOT/maven-metadata.xml
Downloading: http://shibboleth.internet2.edu/downloads/maven2/org/apache/woden/woden-impl-dom/1.0-SNAPSHOT/maven-metadata.xml
Downloading: http://shibboleth.internet2.edu/downloads/maven2/org/apache/woden/woden-impl-commons/1.0-SNAPSHOT/maven-metadata.xml
Downloading: http://shibboleth.internet2.edu/downloads/maven2/org/apache/axis2/axis2-mtompolicy/1.7.0-SNAPSHOT/maven-metadata.xml
Downloading: http://shibboleth.internet2.edu/downloads/maven2/org/apache/axis2/addressing/1.7.0-SNAPSHOT/maven-metadata.xml
Downloading: http://repository.apache.org/snapshots/org/apache/rampart/rampart-core/1.7.0-SNAPSHOT/rampart-core-1.7.0-20120207.231346-376.jar
Downloading: http://repository.apache.org/snapshots/org/apache/rampart/rampart-policy/1.7.0-SNAPSHOT/rampart-policy-1.7.0-20120207.231355-376.jar
Downloading: http://repository.apache.org/snapshots/org/apache/rampart/rampart-trust/1.7.0-SNAPSHOT/rampart-trust-1.7.0-20120207.231359-376.jar
Downloading: http://repository.apache.org/snapshots/org/apache/axis2/mex/1.7.0-SNAPSHOT/mex-1.7.0-20120207.215532-515-impl.jar
Downloaded: http://repository.apache.org/snapshots/org/apache/axis2/mex/1.7.0-SNAPSHOT/mex-1.7.0-20120207.215532-515-impl.jar
(33 KB at 183.0 KB/sec)
Downloaded: http://repository.apache.org/snapshots/org/apache/rampart/rampart-policy/1.7.0-SNAPSHOT/rampart-policy-1.7.0-20120207.231355-376.jar
(158 KB at 857.0 KB/sec)
Downloaded: http://repository.apache.org/snapshots/org/apache/rampart/rampart-trust/1.7.0-SNAPSHOT/rampart-trust-1.7.0-20120207.231359-376.jar
(121 KB at 655.1 KB/sec)
Downloaded: http://repository.apache.org/snapshots/org/apache/rampart/rampart-core/1.7.0-SNAPSHOT/rampart-core-1.7.0-20120207.231346-376.jar
(171 KB at 302.3 KB/sec)
[INFO] [INFO] Deleting <https://builds.apache.org/job/Synapse%20-%20Trunk/ws/java/modules/samples/target>

[INFO] --- maven-clean-plugin:2.4.1:clean (default-clean) @ synapse-samples ---
[INFO] 
[INFO] --- maven-remote-resources-plugin:1.1:process (default) @ synapse-samples ---
Downloading: http://shibboleth.internet2.edu/downloads/maven2/org/apache/rampart/rampart-project/1.7.0-SNAPSHOT/maven-metadata.xml
Downloading: http://shibboleth.internet2.edu/downloads/maven2/org/apache/axis2/axis2-parent/1.7.0-SNAPSHOT/maven-metadata.xml
Downloading: http://shibboleth.internet2.edu/downloads/maven2/org/apache/ws/commons/axiom/axiom-parent/1.2.13-SNAPSHOT/maven-metadata.xml
Downloading: http://shibboleth.internet2.edu/downloads/maven2/org/apache/ws/commons/axiom/axiom-api/1.2.13-SNAPSHOT/maven-metadata.xml
Downloading: http://shibboleth.internet2.edu/downloads/maven2/org/apache/ws/commons/axiom/axiom-impl/1.2.13-SNAPSHOT/maven-metadata.xml
Downloading: http://shibboleth.internet2.edu/downloads/maven2/org/apache/neethi/neethi/3.0.2-SNAPSHOT/maven-metadata.xml
Downloading: http://shibboleth.internet2.edu/downloads/maven2/org/apache/woden/woden/1.0-SNAPSHOT/maven-metadata.xml
Downloading: http://people.apache.org/repo/m2-snapshot-repository/org/apache/bsf/bsf-all/3.0/bsf-all-3.0.pom
Downloading: http://dist.wso2.org/maven2/org/apache/bsf/bsf-all/3.0/bsf-all-3.0.pom
Downloading: http://repo1.maven.org/maven2/org/apache/bsf/bsf-all/3.0/bsf-all-3.0.pom
Downloading: http://people.apache.org/repo/m2-snapshot-repository/net/sf/saxon/saxon-xqj/8.9/saxon-xqj-8.9.pom
Downloading: http://dist.wso2.org/maven2/net/sf/saxon/saxon-xqj/8.9/saxon-xqj-8.9.pom
Downloading: http://repo1.maven.org/maven2/net/sf/saxon/saxon-xqj/8.9/saxon-xqj-8.9.pom
[INFO] [debug] execute contextualize
[INFO] Using 'UTF-8' encoding to copy filtered resources.

[INFO] --- maven-resources-plugin:2.5:resources (default-resources) @ synapse-samples ---
[INFO] Copying 0 resource
[INFO] Copying 3 resources
[INFO] 
[INFO] --- maven-compiler-plugin:2.3.2:compile (default-compile) @ synapse-samples ---
[INFO] Compiling 23 source files to <https://builds.apache.org/job/Synapse%20-%20Trunk/ws/java/modules/samples/target/classes>
[INFO] -------------------------------------------------------------
[ERROR] COMPILATION ERROR : 
[INFO] -------------------------------------------------------------
[ERROR] <https://builds.apache.org/job/Synapse%20-%20Trunk/ws/java/modules/samples/src/main/java/samples/userguide/PWCallback.java>:[104,26]
cannot find symbol
symbol  : method getIdentifer()
location: class org.apache.ws.security.WSPasswordCallback
[ERROR] <https://builds.apache.org/job/Synapse%20-%20Trunk/ws/java/modules/samples/src/main/java/samples/userguide/PWCallback.java>:[110,26]
cannot find symbol
symbol  : method getIdentifer()
location: class org.apache.ws.security.WSPasswordCallback
[ERROR] <https://builds.apache.org/job/Synapse%20-%20Trunk/ws/java/modules/samples/src/main/java/samples/userguide/PWCallback.java>:[144,29]
cannot find symbol
symbol  : method getIdentifer()
location: class org.apache.ws.security.WSPasswordCallback
[ERROR] <https://builds.apache.org/job/Synapse%20-%20Trunk/ws/java/modules/samples/src/main/java/samples/userguide/PWCallback.java>:[148,29]
cannot find symbol
symbol  : method getIdentifer()
location: class org.apache.ws.security.WSPasswordCallback
[ERROR] <https://builds.apache.org/job/Synapse%20-%20Trunk/ws/java/modules/samples/src/main/java/samples/userguide/PWCallback.java>:[152,29]
cannot find symbol
symbol  : method getIdentifer()
location: class org.apache.ws.security.WSPasswordCallback
[ERROR] <https://builds.apache.org/job/Synapse%20-%20Trunk/ws/java/modules/samples/src/main/java/samples/userguide/PWCallback.java>:[156,29]
cannot find symbol
symbol  : method getIdentifer()
location: class org.apache.ws.security.WSPasswordCallback
[ERROR] <https://builds.apache.org/job/Synapse%20-%20Trunk/ws/java/modules/samples/src/main/java/samples/userguide/PWCallback.java>:[160,29]
cannot find symbol
symbol  : method getIdentifer()
location: class org.apache.ws.security.WSPasswordCallback
[INFO] 7 errors 
[INFO] -------------------------------------------------------------
[JENKINS] Archiving <https://builds.apache.org/job/Synapse%20-%20Trunk/ws/java/modules/samples/pom.xml>
to /home/hudson/hudson/jobs/Synapse - Trunk/modules/org.apache.synapse$synapse-samples/builds/2012-02-07_23-30-47/archive/org.apache.synapse/synapse-samples/2.2.0-SNAPSHOT/synapse-samples-2.2.0-SNAPSHOT.pom
[INFO] ------------------------------------------------------------------------
[INFO] Reactor Summary:
[INFO] 
[INFO] Apache Synapse .................................... SUCCESS [38.350s]
[INFO] Apache Synapse - Secure Vault ..................... SUCCESS [2:06.465s]
[INFO] Apache Synapse - Commons .......................... SUCCESS [11.882s]
[INFO] Apache Synapse - Transports ....................... SUCCESS [3.629s]
[INFO] Apache Synapse - Non-blocking HTTP/s Transport .... SUCCESS [16.143s]
[INFO] Apache Synapse - PIPE Transport ................... SUCCESS [4.582s]
[INFO] Apache Synapse - VFS Transport .................... SUCCESS [15.601s]
[INFO] Apache Synapse - FIX Transport .................... SUCCESS [6.782s]
[INFO] Apache Synapse - Tasks ............................ SUCCESS [4.064s]
[INFO] Apache Synapse - Core ............................. SUCCESS [2:07.020s]
[INFO] Apache Synapse - Extensions ....................... SUCCESS [23.853s]
[INFO] Apache Synapse - Samples .......................... FAILURE [8.967s]
[INFO] Apache Synapse - Patches .......................... SKIPPED
[INFO] Apache Synapse - Experimental code ................ SKIPPED
[INFO] Apache Synapse - Web Application .................. SKIPPED
[INFO] Apache Synapse - Handler Module ................... SKIPPED
[INFO] Apache Synapse - XAR Maven Plugin ................. SKIPPED
[INFO] Apache Synapse - Configuration Migrator ........... SKIPPED
[INFO] Apache Synapse - Distribution ..................... SKIPPED
[INFO] Apache Synapse - Package skeleton ZIP ............. SKIPPED
[INFO] Apache Synapse - Package archetype ................ SKIPPED
[INFO] Apache Synapse - Integration ...................... SKIPPED
[INFO] ------------------------------------------------------------------------
[INFO] BUILD FAILURE
[INFO] ------------------------------------------------------------------------
[INFO] Total time: 6:38.140s
[INFO] Finished at: Tue Feb 07 23:37:31 UTC 2012
[INFO] Final Memory: 73M/466M
[INFO] ------------------------------------------------------------------------
Waiting for Jenkins to finish collecting data
mavenExecutionResult exceptions not empty
message : Failed to execute goal org.apache.maven.plugins:maven-compiler-plugin:2.3.2:compile
(default-compile) on project synapse-samples: Compilation failure
cause : Compilation failure
Stack trace : 
org.apache.maven.lifecycle.LifecycleExecutionException: Failed to execute goal org.apache.maven.plugins:maven-compiler-plugin:2.3.2:compile
(default-compile) on project synapse-samples: Compilation failure
	at org.apache.maven.lifecycle.internal.MojoExecutor.execute(MojoExecutor.java:213)
	at org.apache.maven.lifecycle.internal.MojoExecutor.execute(MojoExecutor.java:153)
	at org.apache.maven.lifecycle.internal.MojoExecutor.execute(MojoExecutor.java:145)
	at org.apache.maven.lifecycle.internal.LifecycleModuleBuilder.buildProject(LifecycleModuleBuilder.java:84)
	at org.apache.maven.lifecycle.internal.LifecycleModuleBuilder.buildProject(LifecycleModuleBuilder.java:59)
	at org.apache.maven.lifecycle.internal.LifecycleStarter.singleThreadedBuild(LifecycleStarter.java:183)
	at org.apache.maven.lifecycle.internal.LifecycleStarter.execute(LifecycleStarter.java:161)
	at org.apache.maven.DefaultMaven.doExecute(DefaultMaven.java:319)
	at org.apache.maven.DefaultMaven.execute(DefaultMaven.java:156)
	at org.jvnet.hudson.maven3.launcher.Maven3Launcher.main(Maven3Launcher.java:79)
	at sun.reflect.NativeMethodAccessorImpl.invoke0(Native Method)
	at sun.reflect.NativeMethodAccessorImpl.invoke(NativeMethodAccessorImpl.java:39)
	at sun.reflect.DelegatingMethodAccessorImpl.invoke(DelegatingMethodAccessorImpl.java:25)
	at java.lang.reflect.Method.invoke(Method.java:597)
	at org.codehaus.plexus.classworlds.launcher.Launcher.launchStandard(Launcher.java:329)
	at org.codehaus.plexus.classworlds.launcher.Launcher.launch(Launcher.java:239)
	at org.jvnet.hudson.maven3.agent.Maven3Main.launch(Maven3Main.java:158)
	at hudson.maven.Maven3Builder.call(Maven3Builder.java:104)
	at hudson.maven.Maven3Builder.call(Maven3Builder.java:70)
	at hudson.remoting.UserRequest.perform(UserRequest.java:118)
	at hudson.remoting.UserRequest.perform(UserRequest.java:48)
	at hudson.remoting.Request$2.run(Request.java:287)
	at java.util.concurrent.Executors$RunnableAdapter.call(Executors.java:441)
	at java.util.concurrent.FutureTask$Sync.innerRun(FutureTask.java:303)
	at java.util.concurrent.FutureTask.run(FutureTask.java:138)
	at java.util.concurrent.ThreadPoolExecutor$Worker.runTask(ThreadPoolExecutor.java:886)
	at java.util.concurrent.ThreadPoolExecutor$Worker.run(ThreadPoolExecutor.java:908)
	at java.lang.Thread.run(Thread.java:619)
Caused by: org.apache.maven.plugin.CompilationFailureException: Compilation failure
	at org.apache.maven.plugin.AbstractCompilerMojo.execute(AbstractCompilerMojo.java:656)
	at org.apache.maven.plugin.CompilerMojo.execute(CompilerMojo.java:128)
	at org.apache.maven.plugin.DefaultBuildPluginManager.executeMojo(DefaultBuildPluginManager.java:101)
	at org.apache.maven.lifecycle.internal.MojoExecutor.execute(MojoExecutor.java:209)
	... 27 more
[FINDBUGS] Aggregating results of Apache Synapse
[FINDBUGS] Using set difference to compute new warnings
[FINDBUGS] Not changing build status, since no threshold has been exceeded
[FINDBUGS] Aggregating results of Apache Synapse - Secure Vault
[FINDBUGS] Using set difference to compute new warnings
[FINDBUGS] Not changing build status, since no threshold has been exceeded
[FINDBUGS] Aggregating results of Apache Synapse - Commons
[FINDBUGS] Using set difference to compute new warnings
[FINDBUGS] Not changing build status, since no threshold has been exceeded
[FINDBUGS] Aggregating results of Apache Synapse - Transports
[FINDBUGS] Using set difference to compute new warnings
[FINDBUGS] Not changing build status, since no threshold has been exceeded
[FINDBUGS] Aggregating results of Apache Synapse - Non-blocking HTTP/s Transport
[FINDBUGS] Using set difference to compute new warnings
[FINDBUGS] Not changing build status, since no threshold has been exceeded
[FINDBUGS] Aggregating results of Apache Synapse - PIPE Transport
[FINDBUGS] Using set difference to compute new warnings
[FINDBUGS] Not changing build status, since no threshold has been exceeded
[FINDBUGS] Aggregating results of Apache Synapse - VFS Transport
[FINDBUGS] Using set difference to compute new warnings
[FINDBUGS] Not changing build status, since no threshold has been exceeded
[FINDBUGS] Aggregating results of Apache Synapse - FIX Transport
[FINDBUGS] Using set difference to compute new warnings
[FINDBUGS] Not changing build status, since no threshold has been exceeded
[FINDBUGS] Aggregating results of Apache Synapse - Tasks
[FINDBUGS] Using set difference to compute new warnings
[FINDBUGS] Not changing build status, since no threshold has been exceeded
[FINDBUGS] Aggregating results of Apache Synapse - Core
[FINDBUGS] Using set difference to compute new warnings
[FINDBUGS] Not changing build status, since no threshold has been exceeded
[FINDBUGS] Aggregating results of Apache Synapse - Extensions
[FINDBUGS] Using set difference to compute new warnings
[FINDBUGS] Not changing build status, since no threshold has been exceeded
channel stopped
[locks-and-latches] Releasing all the locks
[locks-and-latches] All the locks released


---------------------------------------------------------------------
To unsubscribe, e-mail: dev-unsubscribe@synapse.apache.org
For additional commands, e-mail: dev-help@synapse.apache.org


Mime
View raw message