synapse-dev mailing list archives

Site index · List index
Message view « Date » · « Thread »
Top « Date » · « Thread »
From Apache Jenkins Server <jenk...@builds.apache.org>
Subject Build failed in Jenkins: Synapse - Trunk #4121
Date Mon, 06 Feb 2012 08:12:46 GMT
See <https://builds.apache.org/job/Synapse%20-%20Trunk/4121/changes>

Changes:

[uswick] committing synapse lib changes wrt classloading. enable to load lib based classes
on demand

------------------------------------------
[...truncated 1775 lines...]
Downloading: http://repo1.maven.org/maven2/org/bouncycastle/bcprov-jdk15/1.45/bcprov-jdk15-1.45.pom
Downloaded: http://repo1.maven.org/maven2/org/bouncycastle/bcprov-jdk15/1.45/bcprov-jdk15-1.45.pom
(819 B at 2.1 KB/sec)
Downloading: http://people.apache.org/repo/m2-snapshot-repository/ca/juliusdavies/not-yet-commons-ssl/0.3.9/not-yet-commons-ssl-0.3.9.pom
Downloading: http://dist.wso2.org/maven2/ca/juliusdavies/not-yet-commons-ssl/0.3.9/not-yet-commons-ssl-0.3.9.pom
Downloading: http://repo1.maven.org/maven2/ca/juliusdavies/not-yet-commons-ssl/0.3.9/not-yet-commons-ssl-0.3.9.pom
Downloaded: http://repo1.maven.org/maven2/ca/juliusdavies/not-yet-commons-ssl/0.3.9/not-yet-commons-ssl-0.3.9.pom
(3 KB at 6.6 KB/sec)
Downloading: http://people.apache.org/repo/m2-snapshot-repository/commons-httpclient/commons-httpclient/3.0/commons-httpclient-3.0.pom
Downloading: http://dist.wso2.org/maven2/commons-httpclient/commons-httpclient/3.0/commons-httpclient-3.0.pom
Downloading: http://repo1.maven.org/maven2/commons-httpclient/commons-httpclient/3.0/commons-httpclient-3.0.pom
Downloaded: http://repo1.maven.org/maven2/commons-httpclient/commons-httpclient/3.0/commons-httpclient-3.0.pom
(8 KB at 20.3 KB/sec)
Downloading: http://people.apache.org/repo/m2-snapshot-repository/xml-apis/xml-apis/1.4.01/xml-apis-1.4.01.pom
Downloading: http://dist.wso2.org/maven2/xml-apis/xml-apis/1.4.01/xml-apis-1.4.01.pom
Downloading: http://repo1.maven.org/maven2/xml-apis/xml-apis/1.4.01/xml-apis-1.4.01.pom
Downloaded: http://repo1.maven.org/maven2/xml-apis/xml-apis/1.4.01/xml-apis-1.4.01.pom (3
KB at 3.7 KB/sec)
Downloading: http://people.apache.org/repo/m2-snapshot-repository/xml-resolver/xml-resolver/1.2/xml-resolver-1.2.pom
Downloading: http://dist.wso2.org/maven2/xml-resolver/xml-resolver/1.2/xml-resolver-1.2.pom
Downloaded: http://dist.wso2.org/maven2/xml-resolver/xml-resolver/1.2/xml-resolver-1.2.pom
(2 KB at 16.9 KB/sec)
Downloading: http://people.apache.org/repo/m2-snapshot-repository/org/owasp/esapi/esapi/2.0GA/esapi-2.0GA.pom
Downloading: http://dist.wso2.org/maven2/org/owasp/esapi/esapi/2.0GA/esapi-2.0GA.pom
Downloading: http://repo1.maven.org/maven2/org/owasp/esapi/esapi/2.0GA/esapi-2.0GA.pom
Downloaded: http://repo1.maven.org/maven2/org/owasp/esapi/esapi/2.0GA/esapi-2.0GA.pom (21
KB at 65.3 KB/sec)
Downloading: http://people.apache.org/repo/m2-snapshot-repository/org/sonatype/oss/oss-parent/5/oss-parent-5.pom
Downloading: http://dist.wso2.org/maven2/org/sonatype/oss/oss-parent/5/oss-parent-5.pom
Downloading: http://repo1.maven.org/maven2/org/sonatype/oss/oss-parent/5/oss-parent-5.pom
Downloaded: http://repo1.maven.org/maven2/org/sonatype/oss/oss-parent/5/oss-parent-5.pom (4
KB at 10.3 KB/sec)
Downloading: http://shibboleth.internet2.edu/downloads/maven2/org/apache/rampart/rampart-trust/1.7.0-SNAPSHOT/maven-metadata.xml
Downloading: http://shibboleth.internet2.edu/downloads/maven2/org/apache/ws/commons/axiom/axiom-dom/1.2.13-SNAPSHOT/maven-metadata.xml
Downloading: http://shibboleth.internet2.edu/downloads/maven2/org/apache/axis2/axis2-kernel/1.7.0-SNAPSHOT/maven-metadata.xml
Downloading: http://shibboleth.internet2.edu/downloads/maven2/org/apache/woden/woden-impl-dom/1.0-SNAPSHOT/maven-metadata.xml
Downloading: http://shibboleth.internet2.edu/downloads/maven2/org/apache/woden/woden-impl-commons/1.0-SNAPSHOT/maven-metadata.xml
Downloading: http://shibboleth.internet2.edu/downloads/maven2/org/apache/axis2/axis2-mtompolicy/1.7.0-SNAPSHOT/maven-metadata.xml
Downloading: http://shibboleth.internet2.edu/downloads/maven2/org/apache/axis2/addressing/1.7.0-SNAPSHOT/maven-metadata.xml
Downloading: http://repository.apache.org/snapshots/org/apache/rampart/rampart-core/1.7.0-SNAPSHOT/rampart-core-1.7.0-20120205.024852-374.jar
Downloading: http://repository.apache.org/snapshots/org/apache/rampart/rampart-policy/1.7.0-SNAPSHOT/rampart-policy-1.7.0-20120205.024858-374.jar
Downloading: http://repository.apache.org/snapshots/org/apache/rampart/rampart-trust/1.7.0-SNAPSHOT/rampart-trust-1.7.0-20120205.024901-374.jar
Downloading: http://repository.apache.org/snapshots/org/apache/axis2/mex/1.7.0-SNAPSHOT/mex-1.7.0-20120205.012338-512-impl.jar
Downloaded: http://repository.apache.org/snapshots/org/apache/rampart/rampart-core/1.7.0-SNAPSHOT/rampart-core-1.7.0-20120205.024852-374.jar
(171 KB at 418.1 KB/sec)
Downloaded: http://repository.apache.org/snapshots/org/apache/rampart/rampart-policy/1.7.0-SNAPSHOT/rampart-policy-1.7.0-20120205.024858-374.jar
(158 KB at 244.1 KB/sec)
Downloaded: http://repository.apache.org/snapshots/org/apache/axis2/mex/1.7.0-SNAPSHOT/mex-1.7.0-20120205.012338-512-impl.jar
(33 KB at 45.4 KB/sec)
Downloaded: http://repository.apache.org/snapshots/org/apache/rampart/rampart-trust/1.7.0-SNAPSHOT/rampart-trust-1.7.0-20120205.024901-374.jar
(121 KB at 156.3 KB/sec)
Downloading: http://people.apache.org/repo/m2-snapshot-repository/org/apache/ws/security/wss4j/1.6.4/wss4j-1.6.4.jar
Downloading: http://people.apache.org/repo/m2-snapshot-repository/org/apache/santuario/xmlsec/1.4.6/xmlsec-1.4.6.jar
Downloading: http://people.apache.org/repo/m2-snapshot-repository/org/opensaml/openws/1.4.2-1/openws-1.4.2-1.jar
Downloading: http://people.apache.org/repo/m2-snapshot-repository/org/opensaml/opensaml/2.5.1-1/opensaml-2.5.1-1.jar
Downloading: http://people.apache.org/repo/m2-snapshot-repository/org/opensaml/xmltooling/1.3.2-1/xmltooling-1.3.2-1.jar
Downloading: http://people.apache.org/repo/m2-snapshot-repository/org/slf4j/slf4j-api/1.6.1/slf4j-api-1.6.1.jar
Downloading: http://people.apache.org/repo/m2-snapshot-repository/org/slf4j/jul-to-slf4j/1.6.1/jul-to-slf4j-1.6.1.jar
Downloading: http://people.apache.org/repo/m2-snapshot-repository/joda-time/joda-time/1.6.2/joda-time-1.6.2.jar
Downloading: http://people.apache.org/repo/m2-snapshot-repository/org/bouncycastle/bcprov-jdk15/1.45/bcprov-jdk15-1.45.jar
Downloading: http://people.apache.org/repo/m2-snapshot-repository/ca/juliusdavies/not-yet-commons-ssl/0.3.9/not-yet-commons-ssl-0.3.9.jar
Downloading: http://people.apache.org/repo/m2-snapshot-repository/org/owasp/esapi/esapi/2.0GA/esapi-2.0GA.jar
Downloading: http://people.apache.org/repo/m2-snapshot-repository/xml-resolver/xml-resolver/1.2/xml-resolver-1.2.jar
Downloading: http://dist.wso2.org/maven2/org/apache/ws/security/wss4j/1.6.4/wss4j-1.6.4.jar
Downloading: http://dist.wso2.org/maven2/org/apache/santuario/xmlsec/1.4.6/xmlsec-1.4.6.jar
Downloading: http://dist.wso2.org/maven2/org/opensaml/opensaml/2.5.1-1/opensaml-2.5.1-1.jar
Downloading: http://dist.wso2.org/maven2/org/opensaml/openws/1.4.2-1/openws-1.4.2-1.jar
Downloading: http://dist.wso2.org/maven2/org/opensaml/xmltooling/1.3.2-1/xmltooling-1.3.2-1.jar
Downloading: http://dist.wso2.org/maven2/org/slf4j/slf4j-api/1.6.1/slf4j-api-1.6.1.jar
Downloading: http://dist.wso2.org/maven2/org/slf4j/jul-to-slf4j/1.6.1/jul-to-slf4j-1.6.1.jar
Downloading: http://dist.wso2.org/maven2/joda-time/joda-time/1.6.2/joda-time-1.6.2.jar
Downloading: http://dist.wso2.org/maven2/org/bouncycastle/bcprov-jdk15/1.45/bcprov-jdk15-1.45.jar
Downloading: http://dist.wso2.org/maven2/ca/juliusdavies/not-yet-commons-ssl/0.3.9/not-yet-commons-ssl-0.3.9.jar
Downloading: http://dist.wso2.org/maven2/org/owasp/esapi/esapi/2.0GA/esapi-2.0GA.jar
Downloading: http://dist.wso2.org/maven2/xml-resolver/xml-resolver/1.2/xml-resolver-1.2.jar
Downloaded: http://dist.wso2.org/maven2/xml-resolver/xml-resolver/1.2/xml-resolver-1.2.jar
(83 KB at 44.1 KB/sec)
Downloading: http://repo1.maven.org/maven2/org/apache/ws/security/wss4j/1.6.4/wss4j-1.6.4.jar
Downloading: http://repo1.maven.org/maven2/org/apache/santuario/xmlsec/1.4.6/xmlsec-1.4.6.jar
Downloading: http://repo1.maven.org/maven2/org/opensaml/opensaml/2.5.1-1/opensaml-2.5.1-1.jar
Downloading: http://repo1.maven.org/maven2/org/opensaml/openws/1.4.2-1/openws-1.4.2-1.jar
Downloading: http://repo1.maven.org/maven2/org/opensaml/xmltooling/1.3.2-1/xmltooling-1.3.2-1.jar
Downloaded: http://repo1.maven.org/maven2/org/opensaml/xmltooling/1.3.2-1/xmltooling-1.3.2-1.jar
(597 KB at 385.1 KB/sec)
Downloading: http://repo1.maven.org/maven2/org/slf4j/slf4j-api/1.6.1/slf4j-api-1.6.1.jar
Downloaded: http://repo1.maven.org/maven2/org/opensaml/opensaml/2.5.1-1/opensaml-2.5.1-1.jar
(1322 KB at 733.6 KB/sec)
Downloading: http://repo1.maven.org/maven2/org/slf4j/jul-to-slf4j/1.6.1/jul-to-slf4j-1.6.1.jar
Downloaded: http://repo1.maven.org/maven2/org/apache/santuario/xmlsec/1.4.6/xmlsec-1.4.6.jar
(439 KB at 213.6 KB/sec)
Downloading: http://repo1.maven.org/maven2/joda-time/joda-time/1.6.2/joda-time-1.6.2.jar
Downloaded: http://repo1.maven.org/maven2/org/opensaml/openws/1.4.2-1/openws-1.4.2-1.jar (553
KB at 240.0 KB/sec)
Downloading: http://repo1.maven.org/maven2/org/bouncycastle/bcprov-jdk15/1.45/bcprov-jdk15-1.45.jar
Downloaded: http://repo1.maven.org/maven2/org/apache/ws/security/wss4j/1.6.4/wss4j-1.6.4.jar
(390 KB at 102.6 KB/sec)
Downloading: http://repo1.maven.org/maven2/ca/juliusdavies/not-yet-commons-ssl/0.3.9/not-yet-commons-ssl-0.3.9.jar
Downloaded: http://repo1.maven.org/maven2/org/slf4j/slf4j-api/1.6.1/slf4j-api-1.6.1.jar (25
KB at 9.9 KB/sec)
Downloading: http://repo1.maven.org/maven2/org/owasp/esapi/esapi/2.0GA/esapi-2.0GA.jar
Downloaded: http://repo1.maven.org/maven2/org/slf4j/jul-to-slf4j/1.6.1/jul-to-slf4j-1.6.1.jar
(5 KB at 1.7 KB/sec)
Downloaded: http://repo1.maven.org/maven2/joda-time/joda-time/1.6.2/joda-time-1.6.2.jar (531
KB at 193.0 KB/sec)
Downloaded: http://repo1.maven.org/maven2/org/bouncycastle/bcprov-jdk15/1.45/bcprov-jdk15-1.45.jar
(1625 KB at 537.9 KB/sec)
Downloaded: http://repo1.maven.org/maven2/ca/juliusdavies/not-yet-commons-ssl/0.3.9/not-yet-commons-ssl-0.3.9.jar
(253 KB at 143.1 KB/sec)
Downloaded: http://repo1.maven.org/maven2/org/owasp/esapi/esapi/2.0GA/esapi-2.0GA.jar (359
KB at 204.3 KB/sec)
[INFO] Deleting <https://builds.apache.org/job/Synapse%20-%20Trunk/ws/java/modules/samples/target>
[INFO] 
[INFO] --- maven-clean-plugin:2.4.1:clean (default-clean) @ synapse-samples ---
[INFO] Downloading: http://shibboleth.internet2.edu/downloads/maven2/org/apache/rampart/rampart-project/1.7.0-SNAPSHOT/maven-metadata.xml

[INFO] --- maven-remote-resources-plugin:1.1:process (default) @ synapse-samples ---
Downloading: http://shibboleth.internet2.edu/downloads/maven2/org/apache/axis2/axis2-parent/1.7.0-SNAPSHOT/maven-metadata.xml
Downloading: http://shibboleth.internet2.edu/downloads/maven2/org/apache/ws/commons/axiom/axiom-parent/1.2.13-SNAPSHOT/maven-metadata.xml
Downloading: http://shibboleth.internet2.edu/downloads/maven2/org/apache/ws/commons/axiom/axiom-api/1.2.13-SNAPSHOT/maven-metadata.xml
Downloading: http://shibboleth.internet2.edu/downloads/maven2/org/apache/ws/commons/axiom/axiom-impl/1.2.13-SNAPSHOT/maven-metadata.xml
Downloading: http://shibboleth.internet2.edu/downloads/maven2/org/apache/neethi/neethi/3.0.2-SNAPSHOT/maven-metadata.xml
Downloading: http://shibboleth.internet2.edu/downloads/maven2/org/apache/woden/woden/1.0-SNAPSHOT/maven-metadata.xml
Downloading: http://people.apache.org/repo/m2-snapshot-repository/org/apache/bsf/bsf-all/3.0/bsf-all-3.0.pom
Downloading: http://dist.wso2.org/maven2/org/apache/bsf/bsf-all/3.0/bsf-all-3.0.pom
Downloading: http://repo1.maven.org/maven2/org/apache/bsf/bsf-all/3.0/bsf-all-3.0.pom
Downloading: http://people.apache.org/repo/m2-snapshot-repository/net/sf/saxon/saxon-xqj/8.9/saxon-xqj-8.9.pom
Downloading: http://dist.wso2.org/maven2/net/sf/saxon/saxon-xqj/8.9/saxon-xqj-8.9.pom
Downloading: http://repo1.maven.org/maven2/net/sf/saxon/saxon-xqj/8.9/saxon-xqj-8.9.pom
[debug] execute contextualize
[INFO] [INFO] Using 'UTF-8' encoding to copy filtered resources.

[INFO] --- maven-resources-plugin:2.5:resources (default-resources) @ synapse-samples ---
[INFO] Copying 0 resource
[INFO] Copying 3 resources
[INFO] 
[INFO] --- maven-compiler-plugin:2.3.2:compile (default-compile) @ synapse-samples ---
[INFO] Compiling 23 source files to <https://builds.apache.org/job/Synapse%20-%20Trunk/ws/java/modules/samples/target/classes>
[INFO] -------------------------------------------------------------
[ERROR] COMPILATION ERROR : 
[INFO] -------------------------------------------------------------
[ERROR] <https://builds.apache.org/job/Synapse%20-%20Trunk/ws/java/modules/samples/src/main/java/samples/userguide/PWCallback.java>:[104,26]
cannot find symbol
symbol  : method getIdentifer()
location: class org.apache.ws.security.WSPasswordCallback
[ERROR] <https://builds.apache.org/job/Synapse%20-%20Trunk/ws/java/modules/samples/src/main/java/samples/userguide/PWCallback.java>:[110,26]
cannot find symbol
symbol  : method getIdentifer()
location: class org.apache.ws.security.WSPasswordCallback
[ERROR] <https://builds.apache.org/job/Synapse%20-%20Trunk/ws/java/modules/samples/src/main/java/samples/userguide/PWCallback.java>:[144,29]
cannot find symbol
symbol  : method getIdentifer()
location: class org.apache.ws.security.WSPasswordCallback
[ERROR] <https://builds.apache.org/job/Synapse%20-%20Trunk/ws/java/modules/samples/src/main/java/samples/userguide/PWCallback.java>:[148,29]
cannot find symbol
symbol  : method getIdentifer()
location: class org.apache.ws.security.WSPasswordCallback
[ERROR] <https://builds.apache.org/job/Synapse%20-%20Trunk/ws/java/modules/samples/src/main/java/samples/userguide/PWCallback.java>:[152,29]
cannot find symbol
symbol  : method getIdentifer()
location: class org.apache.ws.security.WSPasswordCallback
[ERROR] <https://builds.apache.org/job/Synapse%20-%20Trunk/ws/java/modules/samples/src/main/java/samples/userguide/PWCallback.java>:[156,29]
cannot find symbol
symbol  : method getIdentifer()
location: class org.apache.ws.security.WSPasswordCallback
[ERROR] <https://builds.apache.org/job/Synapse%20-%20Trunk/ws/java/modules/samples/src/main/java/samples/userguide/PWCallback.java>:[160,29]
cannot find symbol
symbol  : method getIdentifer()
location: class org.apache.ws.security.WSPasswordCallback
[INFO] 7 errors 
[INFO] -------------------------------------------------------------
[JENKINS] Archiving <https://builds.apache.org/job/Synapse%20-%20Trunk/ws/java/modules/samples/pom.xml>
to /home/hudson/hudson/jobs/Synapse - Trunk/modules/org.apache.synapse$synapse-samples/builds/2012-02-06_08-04-52/archive/org.apache.synapse/synapse-samples/2.2.0-SNAPSHOT/synapse-samples-2.2.0-SNAPSHOT.pom
[INFO] ------------------------------------------------------------------------
[INFO] Reactor Summary:
[INFO] 
[INFO] Apache Synapse .................................... SUCCESS [1:48.785s]
[INFO] Apache Synapse - Secure Vault ..................... SUCCESS [13.801s]
[INFO] Apache Synapse - Commons .......................... SUCCESS [22.417s]
[INFO] Apache Synapse - Transports ....................... SUCCESS [6.576s]
[INFO] Apache Synapse - Non-blocking HTTP/s Transport .... SUCCESS [21.079s]
[INFO] Apache Synapse - PIPE Transport ................... SUCCESS [7.878s]
[INFO] Apache Synapse - VFS Transport .................... SUCCESS [18.411s]
[INFO] Apache Synapse - FIX Transport .................... SUCCESS [12.112s]
[INFO] Apache Synapse - Tasks ............................ SUCCESS [7.318s]
[INFO] Apache Synapse - Core ............................. SUCCESS [2:30.939s]
[INFO] Apache Synapse - Extensions ....................... SUCCESS [26.357s]
[INFO] Apache Synapse - Samples .......................... FAILURE [25.322s]
[INFO] Apache Synapse - Patches .......................... SKIPPED
[INFO] Apache Synapse - Experimental code ................ SKIPPED
[INFO] Apache Synapse - Web Application .................. SKIPPED
[INFO] Apache Synapse - Handler Module ................... SKIPPED
[INFO] Apache Synapse - XAR Maven Plugin ................. SKIPPED
[INFO] Apache Synapse - Configuration Migrator ........... SKIPPED
[INFO] Apache Synapse - Distribution ..................... SKIPPED
[INFO] Apache Synapse - Package skeleton ZIP ............. SKIPPED
[INFO] Apache Synapse - Package archetype ................ SKIPPED
[INFO] Apache Synapse - Integration ...................... SKIPPED
[INFO] ------------------------------------------------------------------------
[INFO] BUILD FAILURE
[INFO] ------------------------------------------------------------------------
[INFO] Total time: 7:33.027s
[INFO] Finished at: Mon Feb 06 08:12:43 UTC 2012
[INFO] Final Memory: 64M/435M
[INFO] ------------------------------------------------------------------------
Waiting for Jenkins to finish collecting data
mavenExecutionResult exceptions not empty
message : Failed to execute goal org.apache.maven.plugins:maven-compiler-plugin:2.3.2:compile
(default-compile) on project synapse-samples: Compilation failure
cause : Compilation failure
Stack trace : 
org.apache.maven.lifecycle.LifecycleExecutionException: Failed to execute goal org.apache.maven.plugins:maven-compiler-plugin:2.3.2:compile
(default-compile) on project synapse-samples: Compilation failure
	at org.apache.maven.lifecycle.internal.MojoExecutor.execute(MojoExecutor.java:213)
	at org.apache.maven.lifecycle.internal.MojoExecutor.execute(MojoExecutor.java:153)
	at org.apache.maven.lifecycle.internal.MojoExecutor.execute(MojoExecutor.java:145)
	at org.apache.maven.lifecycle.internal.LifecycleModuleBuilder.buildProject(LifecycleModuleBuilder.java:84)
	at org.apache.maven.lifecycle.internal.LifecycleModuleBuilder.buildProject(LifecycleModuleBuilder.java:59)
	at org.apache.maven.lifecycle.internal.LifecycleStarter.singleThreadedBuild(LifecycleStarter.java:183)
	at org.apache.maven.lifecycle.internal.LifecycleStarter.execute(LifecycleStarter.java:161)
	at org.apache.maven.DefaultMaven.doExecute(DefaultMaven.java:319)
	at org.apache.maven.DefaultMaven.execute(DefaultMaven.java:156)
	at org.jvnet.hudson.maven3.launcher.Maven3Launcher.main(Maven3Launcher.java:79)
	at sun.reflect.NativeMethodAccessorImpl.invoke0(Native Method)
	at sun.reflect.NativeMethodAccessorImpl.invoke(NativeMethodAccessorImpl.java:39)
	at sun.reflect.DelegatingMethodAccessorImpl.invoke(DelegatingMethodAccessorImpl.java:25)
	at java.lang.reflect.Method.invoke(Method.java:597)
	at org.codehaus.plexus.classworlds.launcher.Launcher.launchStandard(Launcher.java:329)
	at org.codehaus.plexus.classworlds.launcher.Launcher.launch(Launcher.java:239)
	at org.jvnet.hudson.maven3.agent.Maven3Main.launch(Maven3Main.java:158)
	at hudson.maven.Maven3Builder.call(Maven3Builder.java:104)
	at hudson.maven.Maven3Builder.call(Maven3Builder.java:70)
	at hudson.remoting.UserRequest.perform(UserRequest.java:118)
	at hudson.remoting.UserRequest.perform(UserRequest.java:48)
	at hudson.remoting.Request$2.run(Request.java:287)
	at java.util.concurrent.Executors$RunnableAdapter.call(Executors.java:441)
	at java.util.concurrent.FutureTask$Sync.innerRun(FutureTask.java:303)
	at java.util.concurrent.FutureTask.run(FutureTask.java:138)
	at java.util.concurrent.ThreadPoolExecutor$Worker.runTask(ThreadPoolExecutor.java:886)
	at java.util.concurrent.ThreadPoolExecutor$Worker.run(ThreadPoolExecutor.java:908)
	at java.lang.Thread.run(Thread.java:619)
Caused by: org.apache.maven.plugin.CompilationFailureException: Compilation failure
	at org.apache.maven.plugin.AbstractCompilerMojo.execute(AbstractCompilerMojo.java:656)
	at org.apache.maven.plugin.CompilerMojo.execute(CompilerMojo.java:128)
	at org.apache.maven.plugin.DefaultBuildPluginManager.executeMojo(DefaultBuildPluginManager.java:101)
	at org.apache.maven.lifecycle.internal.MojoExecutor.execute(MojoExecutor.java:209)
	... 27 more
[FINDBUGS] Aggregating results of Apache Synapse
[FINDBUGS] Using set difference to compute new warnings
[FINDBUGS] Not changing build status, since no threshold has been exceeded
[FINDBUGS] Aggregating results of Apache Synapse - Secure Vault
[FINDBUGS] Using set difference to compute new warnings
[FINDBUGS] Not changing build status, since no threshold has been exceeded
[FINDBUGS] Aggregating results of Apache Synapse - Commons
[FINDBUGS] Using set difference to compute new warnings
[FINDBUGS] Not changing build status, since no threshold has been exceeded
[FINDBUGS] Aggregating results of Apache Synapse - Transports
[FINDBUGS] Using set difference to compute new warnings
[FINDBUGS] Not changing build status, since no threshold has been exceeded
[FINDBUGS] Aggregating results of Apache Synapse - Non-blocking HTTP/s Transport
[FINDBUGS] Using set difference to compute new warnings
[FINDBUGS] Not changing build status, since no threshold has been exceeded
[FINDBUGS] Aggregating results of Apache Synapse - PIPE Transport
[FINDBUGS] Using set difference to compute new warnings
[FINDBUGS] Not changing build status, since no threshold has been exceeded
[FINDBUGS] Aggregating results of Apache Synapse - VFS Transport
[FINDBUGS] Using set difference to compute new warnings
[FINDBUGS] Not changing build status, since no threshold has been exceeded
[FINDBUGS] Aggregating results of Apache Synapse - FIX Transport
[FINDBUGS] Using set difference to compute new warnings
[FINDBUGS] Not changing build status, since no threshold has been exceeded
[FINDBUGS] Aggregating results of Apache Synapse - Tasks
[FINDBUGS] Using set difference to compute new warnings
[FINDBUGS] Not changing build status, since no threshold has been exceeded
[FINDBUGS] Aggregating results of Apache Synapse - Core
[FINDBUGS] Using set difference to compute new warnings
[FINDBUGS] Not changing build status, since no threshold has been exceeded
[FINDBUGS] Aggregating results of Apache Synapse - Extensions
[FINDBUGS] Using set difference to compute new warnings
[FINDBUGS] Not changing build status, since no threshold has been exceeded
channel stopped
[locks-and-latches] Releasing all the locks
[locks-and-latches] All the locks released


---------------------------------------------------------------------
To unsubscribe, e-mail: dev-unsubscribe@synapse.apache.org
For additional commands, e-mail: dev-help@synapse.apache.org


Mime
View raw message