synapse-dev mailing list archives

Site index · List index
Message view « Date » · « Thread »
Top « Date » · « Thread »
From Apache Jenkins Server <jenk...@builds.apache.org>
Subject Build failed in Jenkins: Synapse - Trunk #4069
Date Mon, 26 Dec 2011 09:03:23 GMT
See <https://builds.apache.org/job/Synapse%20-%20Trunk/4069/changes>

Changes:

[hiranya] POM cleanup
1. Removed unneccessary dependencies (bcel, groovy, jlex etc)
2. All dependency versions defined properly in the root POM's dependency mgt section
3. All plugin versions defined properly in the root POM's plugin mgt section
4. Plugins upgraded to latest compatible versions (except for maven-assembly-plugin whose
latest version messes up the file permissions of the created artifacts)
5. Integration module added to the build
6. Securevault and xar-plugin modules added as children of the root POM
7. 3rd party dependencies upgraded to latest compatible versions (almost all Apache commons
libs, throttling etc)
8. Fixed throttling issues in the trunk and re-enabled the ThrottleMediatorTest

------------------------------------------
[...truncated 608 lines...]
Downloaded: http://repo1.maven.org/maven2/commons-logging/commons-logging/1.0.4/commons-logging-1.0.4.pom
(0 B at 0.0 KB/sec)
Downloading: http://repo1.maven.org/maven2/org/apache/maven/shared/maven-shared-jar/1.0/maven-shared-jar-1.0.pom
Downloaded: http://repo1.maven.org/maven2/org/apache/maven/shared/maven-shared-jar/1.0/maven-shared-jar-1.0.pom
(5 KB at 10.7 KB/sec)
Downloading: http://repo1.maven.org/maven2/org/apache/bcel/bcel/5.2/bcel-5.2.pom
Downloaded: http://repo1.maven.org/maven2/org/apache/bcel/bcel/5.2/bcel-5.2.pom (0 B at 0.0
KB/sec)
Downloading: http://repo1.maven.org/maven2/jakarta-regexp/jakarta-regexp/1.4/jakarta-regexp-1.4.pom
Downloaded: http://repo1.maven.org/maven2/jakarta-regexp/jakarta-regexp/1.4/jakarta-regexp-1.4.pom
(0 B at 0.0 KB/sec)
Downloading: http://repo1.maven.org/maven2/org/apache/maven/wagon/wagon-provider-api/1.0-beta-3/wagon-provider-api-1.0-beta-3.pom
Downloaded: http://repo1.maven.org/maven2/org/apache/maven/wagon/wagon-provider-api/1.0-beta-3/wagon-provider-api-1.0-beta-3.pom
(906 B at 1.7 KB/sec)
Downloading: http://repo1.maven.org/maven2/org/apache/maven/wagon/wagon/1.0-beta-3/wagon-1.0-beta-3.pom
Downloaded: http://repo1.maven.org/maven2/org/apache/maven/wagon/wagon/1.0-beta-3/wagon-1.0-beta-3.pom
(9 KB at 16.6 KB/sec)
Downloading: http://repo1.maven.org/maven2/org/apache/maven/wagon/wagon-ssh/1.0-beta-3/wagon-ssh-1.0-beta-3.pom
Downloaded: http://repo1.maven.org/maven2/org/apache/maven/wagon/wagon-ssh/1.0-beta-3/wagon-ssh-1.0-beta-3.pom
(2 KB at 3.7 KB/sec)
Downloading: http://repo1.maven.org/maven2/org/apache/maven/wagon/wagon-providers/1.0-beta-3/wagon-providers-1.0-beta-3.pom
Downloaded: http://repo1.maven.org/maven2/org/apache/maven/wagon/wagon-providers/1.0-beta-3/wagon-providers-1.0-beta-3.pom
(2 KB at 2.4 KB/sec)
Downloading: http://repo1.maven.org/maven2/com/jcraft/jsch/0.1.38/jsch-0.1.38.pom
Downloaded: http://repo1.maven.org/maven2/com/jcraft/jsch/0.1.38/jsch-0.1.38.pom (967 B at
2.0 KB/sec)
Downloading: http://repo1.maven.org/maven2/org/apache/maven/wagon/wagon-ssh-common/1.0-beta-3/wagon-ssh-common-1.0-beta-3.pom
Downloaded: http://repo1.maven.org/maven2/org/apache/maven/wagon/wagon-ssh-common/1.0-beta-3/wagon-ssh-common-1.0-beta-3.pom
(968 B at 1.9 KB/sec)
Downloading: http://repo1.maven.org/maven2/org/codehaus/plexus/plexus-interactivity-api/1.0-alpha-6/plexus-interactivity-api-1.0-alpha-6.pom
Downloaded: http://repo1.maven.org/maven2/org/codehaus/plexus/plexus-interactivity-api/1.0-alpha-6/plexus-interactivity-api-1.0-alpha-6.pom
(726 B at 1.4 KB/sec)
Downloading: http://repo1.maven.org/maven2/org/codehaus/plexus/plexus-interactivity/1.0-alpha-6/plexus-interactivity-1.0-alpha-6.pom
Downloaded: http://repo1.maven.org/maven2/org/codehaus/plexus/plexus-interactivity/1.0-alpha-6/plexus-interactivity-1.0-alpha-6.pom
(2 KB at 2.1 KB/sec)
Downloading: http://repo1.maven.org/maven2/org/codehaus/plexus/plexus-utils/1.4/plexus-utils-1.4.pom
Downloaded: http://repo1.maven.org/maven2/org/codehaus/plexus/plexus-utils/1.4/plexus-utils-1.4.pom
(2 KB at 2.3 KB/sec)
Downloading: http://repo1.maven.org/maven2/org/apache/maven/wagon/wagon-file/1.0-beta-3/wagon-file-1.0-beta-3.pom
Downloaded: http://repo1.maven.org/maven2/org/apache/maven/wagon/wagon-file/1.0-beta-3/wagon-file-1.0-beta-3.pom
(575 B at 1.1 KB/sec)
Downloading: http://repo1.maven.org/maven2/org/apache/maven/wagon/wagon-http-lightweight/1.0-beta-3/wagon-http-lightweight-1.0-beta-3.pom
Downloaded: http://repo1.maven.org/maven2/org/apache/maven/wagon/wagon-http-lightweight/1.0-beta-3/wagon-http-lightweight-1.0-beta-3.pom
(2 KB at 2.8 KB/sec)
Downloading: http://repo1.maven.org/maven2/org/apache/maven/wagon/wagon-http-shared/1.0-beta-3/wagon-http-shared-1.0-beta-3.pom
Downloaded: http://repo1.maven.org/maven2/org/apache/maven/wagon/wagon-http-shared/1.0-beta-3/wagon-http-shared-1.0-beta-3.pom
(2 KB at 2.4 KB/sec)
Downloading: http://repo1.maven.org/maven2/nekohtml/xercesMinimal/1.9.6.2/xercesMinimal-1.9.6.2.pom
Downloaded: http://repo1.maven.org/maven2/nekohtml/xercesMinimal/1.9.6.2/xercesMinimal-1.9.6.2.pom
(390 B at 0.8 KB/sec)
Downloading: http://repo1.maven.org/maven2/nekohtml/nekohtml/1.9.6.2/nekohtml-1.9.6.2.pom
Downloaded: http://repo1.maven.org/maven2/nekohtml/nekohtml/1.9.6.2/nekohtml-1.9.6.2.pom (704
B at 1.4 KB/sec)
Downloading: http://repo1.maven.org/maven2/org/apache/maven/scm/maven-scm-api/1.1/maven-scm-api-1.1.pom
Downloaded: http://repo1.maven.org/maven2/org/apache/maven/scm/maven-scm-api/1.1/maven-scm-api-1.1.pom
(2 KB at 3.0 KB/sec)
Downloading: http://repo1.maven.org/maven2/org/apache/maven/scm/maven-scm/1.1/maven-scm-1.1.pom
Downloaded: http://repo1.maven.org/maven2/org/apache/maven/scm/maven-scm/1.1/maven-scm-1.1.pom
(20 KB at 37.5 KB/sec)
Downloading: http://repo1.maven.org/maven2/org/apache/maven/scm/maven-scm-manager-plexus/1.1/maven-scm-manager-plexus-1.1.pom
Downloaded: http://repo1.maven.org/maven2/org/apache/maven/scm/maven-scm-manager-plexus/1.1/maven-scm-manager-plexus-1.1.pom
(3 KB at 4.0 KB/sec)
Downloading: http://repo1.maven.org/maven2/org/apache/maven/scm/maven-scm-managers/1.1/maven-scm-managers-1.1.pom
Downloaded: http://repo1.maven.org/maven2/org/apache/maven/scm/maven-scm-managers/1.1/maven-scm-managers-1.1.pom
(2 KB at 3.3 KB/sec)
Downloading: http://repo1.maven.org/maven2/org/apache/maven/scm/maven-scm-provider-perforce/1.1/maven-scm-provider-perforce-1.1.pom
Downloaded: http://repo1.maven.org/maven2/org/apache/maven/scm/maven-scm-provider-perforce/1.1/maven-scm-provider-perforce-1.1.pom
(3 KB at 4.9 KB/sec)
Downloading: http://repo1.maven.org/maven2/org/apache/maven/scm/maven-scm-providers/1.1/maven-scm-providers-1.1.pom
Downloaded: http://repo1.maven.org/maven2/org/apache/maven/scm/maven-scm-providers/1.1/maven-scm-providers-1.1.pom
(4 KB at 7.0 KB/sec)
Downloading: http://repo1.maven.org/maven2/regexp/regexp/1.3/regexp-1.3.pom
Downloaded: http://repo1.maven.org/maven2/regexp/regexp/1.3/regexp-1.3.pom (0 B at 0.0 KB/sec)
Downloading: http://repo1.maven.org/maven2/org/apache/maven/scm/maven-scm-provider-starteam/1.1/maven-scm-provider-starteam-1.1.pom
Downloaded: http://repo1.maven.org/maven2/org/apache/maven/scm/maven-scm-provider-starteam/1.1/maven-scm-provider-starteam-1.1.pom
(3 KB at 4.4 KB/sec)
Downloading: http://repo1.maven.org/maven2/org/apache/maven/scm/maven-scm-provider-svn-commons/1.1/maven-scm-provider-svn-commons-1.1.pom
Downloaded: http://repo1.maven.org/maven2/org/apache/maven/scm/maven-scm-provider-svn-commons/1.1/maven-scm-provider-svn-commons-1.1.pom
(2 KB at 4.2 KB/sec)
Downloading: http://repo1.maven.org/maven2/org/apache/maven/scm/maven-scm-providers-svn/1.1/maven-scm-providers-svn-1.1.pom
Downloaded: http://repo1.maven.org/maven2/org/apache/maven/scm/maven-scm-providers-svn/1.1/maven-scm-providers-svn-1.1.pom
(2 KB at 3.3 KB/sec)
Downloading: http://repo1.maven.org/maven2/org/apache/maven/scm/maven-scm-provider-svnexe/1.1/maven-scm-provider-svnexe-1.1.pom
Downloaded: http://repo1.maven.org/maven2/org/apache/maven/scm/maven-scm-provider-svnexe/1.1/maven-scm-provider-svnexe-1.1.pom
(3 KB at 4.5 KB/sec)
Downloading: http://repo1.maven.org/maven2/org/apache/maven/scm/maven-scm-provider-cvs-commons/1.1/maven-scm-provider-cvs-commons-1.1.pom
Downloaded: http://repo1.maven.org/maven2/org/apache/maven/scm/maven-scm-provider-cvs-commons/1.1/maven-scm-provider-cvs-commons-1.1.pom
(3 KB at 4.3 KB/sec)
Downloading: http://repo1.maven.org/maven2/org/apache/maven/scm/maven-scm-providers-cvs/1.1/maven-scm-providers-cvs-1.1.pom
Downloaded: http://repo1.maven.org/maven2/org/apache/maven/scm/maven-scm-providers-cvs/1.1/maven-scm-providers-cvs-1.1.pom
(2 KB at 3.4 KB/sec)
Downloading: http://repo1.maven.org/maven2/org/apache/maven/scm/maven-scm-provider-cvsexe/1.1/maven-scm-provider-cvsexe-1.1.pom
Downloaded: http://repo1.maven.org/maven2/org/apache/maven/scm/maven-scm-provider-cvsexe/1.1/maven-scm-provider-cvsexe-1.1.pom
(3 KB at 5.0 KB/sec)
Downloading: http://repo1.maven.org/maven2/org/apache/maven/scm/maven-scm-provider-cvsjava/1.1/maven-scm-provider-cvsjava-1.1.pom
Downloaded: http://repo1.maven.org/maven2/org/apache/maven/scm/maven-scm-provider-cvsjava/1.1/maven-scm-provider-cvsjava-1.1.pom
(3 KB at 5.0 KB/sec)
Downloading: http://repo1.maven.org/maven2/org/netbeans/lib/cvsclient/20060125/cvsclient-20060125.pom
Downloaded: http://repo1.maven.org/maven2/org/netbeans/lib/cvsclient/20060125/cvsclient-20060125.pom
(459 B at 0.9 KB/sec)
Downloading: http://repo1.maven.org/maven2/ch/ethz/ganymed/ganymed-ssh2/build210/ganymed-ssh2-build210.pom
Downloaded: http://repo1.maven.org/maven2/ch/ethz/ganymed/ganymed-ssh2/build210/ganymed-ssh2-build210.pom
(710 B at 1.4 KB/sec)
Downloading: http://repo1.maven.org/maven2/org/apache/maven/reporting/maven-reporting-impl/2.0.4.2/maven-reporting-impl-2.0.4.2.jar
Downloading: http://repo1.maven.org/maven2/org/apache/maven/shared/maven-shared-jar/1.0/maven-shared-jar-1.0.jar
Downloading: http://repo1.maven.org/maven2/org/apache/bcel/bcel/5.2/bcel-5.2.jar
Downloading: http://repo1.maven.org/maven2/jakarta-regexp/jakarta-regexp/1.4/jakarta-regexp-1.4.jar
Downloading: http://repo1.maven.org/maven2/commons-collections/commons-collections/3.1/commons-collections-3.1.jar
Downloaded: http://repo1.maven.org/maven2/org/apache/bcel/bcel/5.2/bcel-5.2.jar (0 B at 0.0
KB/sec)
Downloading: http://repo1.maven.org/maven2/org/apache/maven/wagon/wagon-ssh/1.0-beta-3/wagon-ssh-1.0-beta-3.jar
Downloaded: http://repo1.maven.org/maven2/commons-collections/commons-collections/3.1/commons-collections-3.1.jar
(0 B at 0.0 KB/sec)
Downloading: http://repo1.maven.org/maven2/com/jcraft/jsch/0.1.38/jsch-0.1.38.jar
Downloaded: http://repo1.maven.org/maven2/jakarta-regexp/jakarta-regexp/1.4/jakarta-regexp-1.4.jar
(0 B at 0.0 KB/sec)
Downloading: http://repo1.maven.org/maven2/org/apache/maven/wagon/wagon-ssh-common/1.0-beta-3/wagon-ssh-common-1.0-beta-3.jar
Downloaded: http://repo1.maven.org/maven2/org/apache/maven/reporting/maven-reporting-impl/2.0.4.2/maven-reporting-impl-2.0.4.2.jar
(20 KB at 13.4 KB/sec)
Downloading: http://repo1.maven.org/maven2/org/codehaus/plexus/plexus-interactivity-api/1.0-alpha-6/plexus-interactivity-api-1.0-alpha-6.jar
Downloaded: http://repo1.maven.org/maven2/org/apache/maven/shared/maven-shared-jar/1.0/maven-shared-jar-1.0.jar
(37 KB at 16.3 KB/sec)
Downloading: http://repo1.maven.org/maven2/org/apache/maven/wagon/wagon-file/1.0-beta-3/wagon-file-1.0-beta-3.jar
Downloaded: http://repo1.maven.org/maven2/org/apache/maven/wagon/wagon-ssh/1.0-beta-3/wagon-ssh-1.0-beta-3.jar
(28 KB at 11.0 KB/sec)
Downloading: http://repo1.maven.org/maven2/org/apache/maven/wagon/wagon-http-lightweight/1.0-beta-3/wagon-http-lightweight-1.0-beta-3.jar
Downloaded: http://repo1.maven.org/maven2/com/jcraft/jsch/0.1.38/jsch-0.1.38.jar (174 KB at
63.1 KB/sec)
Downloading: http://repo1.maven.org/maven2/org/apache/maven/wagon/wagon-http-shared/1.0-beta-3/wagon-http-shared-1.0-beta-3.jar
Downloaded: http://repo1.maven.org/maven2/org/apache/maven/wagon/wagon-ssh-common/1.0-beta-3/wagon-ssh-common-1.0-beta-3.jar
(24 KB at 9.4 KB/sec)
Downloading: http://repo1.maven.org/maven2/nekohtml/xercesMinimal/1.9.6.2/xercesMinimal-1.9.6.2.jar
Downloaded: http://repo1.maven.org/maven2/org/codehaus/plexus/plexus-interactivity-api/1.0-alpha-6/plexus-interactivity-api-1.0-alpha-6.jar
(12 KB at 4.6 KB/sec)
Downloading: http://repo1.maven.org/maven2/nekohtml/nekohtml/1.9.6.2/nekohtml-1.9.6.2.jar
Downloaded: http://repo1.maven.org/maven2/org/apache/maven/wagon/wagon-file/1.0-beta-3/wagon-file-1.0-beta-3.jar
(10 KB at 4.3 KB/sec)
Downloading: http://repo1.maven.org/maven2/org/apache/maven/scm/maven-scm-api/1.1/maven-scm-api-1.1.jar
Downloaded: http://repo1.maven.org/maven2/org/apache/maven/wagon/wagon-http-lightweight/1.0-beta-3/wagon-http-lightweight-1.0-beta-3.jar
(14 KB at 5.4 KB/sec)
Downloading: http://repo1.maven.org/maven2/org/apache/maven/scm/maven-scm-manager-plexus/1.1/maven-scm-manager-plexus-1.1.jar
Downloaded: http://repo1.maven.org/maven2/org/apache/maven/wagon/wagon-http-shared/1.0-beta-3/wagon-http-shared-1.0-beta-3.jar
(19 KB at 7.5 KB/sec)
Downloading: http://repo1.maven.org/maven2/org/apache/maven/scm/maven-scm-provider-perforce/1.1/maven-scm-provider-perforce-1.1.jar
Downloaded: http://repo1.maven.org/maven2/nekohtml/xercesMinimal/1.9.6.2/xercesMinimal-1.9.6.2.jar
(39 KB at 15.6 KB/sec)
Downloading: http://repo1.maven.org/maven2/regexp/regexp/1.3/regexp-1.3.jar
Downloaded: http://repo1.maven.org/maven2/nekohtml/nekohtml/1.9.6.2/nekohtml-1.9.6.2.jar (110
KB at 39.9 KB/sec)
Downloading: http://repo1.maven.org/maven2/org/apache/maven/scm/maven-scm-provider-starteam/1.1/maven-scm-provider-starteam-1.1.jar
Downloaded: http://repo1.maven.org/maven2/org/apache/maven/scm/maven-scm-api/1.1/maven-scm-api-1.1.jar
(81 KB at 32.6 KB/sec)
Downloading: http://repo1.maven.org/maven2/org/apache/maven/scm/maven-scm-provider-svn-commons/1.1/maven-scm-provider-svn-commons-1.1.jar
Downloaded: http://repo1.maven.org/maven2/regexp/regexp/1.3/regexp-1.3.jar (0 B at 0.0 KB/sec)
Downloading: http://repo1.maven.org/maven2/org/apache/maven/scm/maven-scm-provider-svnexe/1.1/maven-scm-provider-svnexe-1.1.jar
Downloaded: http://repo1.maven.org/maven2/org/apache/maven/scm/maven-scm-manager-plexus/1.1/maven-scm-manager-plexus-1.1.jar
(10 KB at 4.4 KB/sec)
Downloading: http://repo1.maven.org/maven2/org/apache/maven/scm/maven-scm-provider-cvs-commons/1.1/maven-scm-provider-cvs-commons-1.1.jar
Downloaded: http://repo1.maven.org/maven2/org/apache/maven/scm/maven-scm-provider-perforce/1.1/maven-scm-provider-perforce-1.1.jar
(64 KB at 25.5 KB/sec)
Downloading: http://repo1.maven.org/maven2/org/apache/maven/scm/maven-scm-provider-cvsexe/1.1/maven-scm-provider-cvsexe-1.1.jar
Downloaded: http://repo1.maven.org/maven2/org/apache/maven/scm/maven-scm-provider-starteam/1.1/maven-scm-provider-starteam-1.1.jar
(68 KB at 26.9 KB/sec)
Downloading: http://repo1.maven.org/maven2/org/apache/maven/scm/maven-scm-provider-cvsjava/1.1/maven-scm-provider-cvsjava-1.1.jar
Downloaded: http://repo1.maven.org/maven2/org/apache/maven/scm/maven-scm-provider-svn-commons/1.1/maven-scm-provider-svn-commons-1.1.jar
(37 KB at 14.3 KB/sec)
Downloading: http://repo1.maven.org/maven2/org/netbeans/lib/cvsclient/20060125/cvsclient-20060125.jar
Downloaded: http://repo1.maven.org/maven2/org/apache/maven/scm/maven-scm-provider-svnexe/1.1/maven-scm-provider-svnexe-1.1.jar
(58 KB at 22.8 KB/sec)
Downloading: http://repo1.maven.org/maven2/ch/ethz/ganymed/ganymed-ssh2/build210/ganymed-ssh2-build210.jar
Downloaded: http://repo1.maven.org/maven2/org/apache/maven/scm/maven-scm-provider-cvs-commons/1.1/maven-scm-provider-cvs-commons-1.1.jar
(69 KB at 27.3 KB/sec)
Downloaded: http://repo1.maven.org/maven2/org/apache/maven/scm/maven-scm-provider-cvsexe/1.1/maven-scm-provider-cvsexe-1.1.jar
(26 KB at 9.9 KB/sec)
Downloaded: http://repo1.maven.org/maven2/org/apache/maven/scm/maven-scm-provider-cvsjava/1.1/maven-scm-provider-cvsjava-1.1.jar
(40 KB at 17.5 KB/sec)
Downloaded: http://repo1.maven.org/maven2/org/netbeans/lib/cvsclient/20060125/cvsclient-20060125.jar
(605 KB at 276.5 KB/sec)
Downloaded: http://repo1.maven.org/maven2/ch/ethz/ganymed/ganymed-ssh2/build210/ganymed-ssh2-build210.jar
(240 KB at 120.6 KB/sec)
[INFO] configuring report plugin org.apache.maven.plugins:maven-javadoc-plugin:2.1
Downloading: http://repo1.maven.org/maven2/org/apache/maven/plugins/maven-javadoc-plugin/2.1/maven-javadoc-plugin-2.1.pom
Downloaded: http://repo1.maven.org/maven2/org/apache/maven/plugins/maven-javadoc-plugin/2.1/maven-javadoc-plugin-2.1.pom
(4 KB at 9.9 KB/sec)
Downloading: http://repo1.maven.org/maven2/org/apache/maven/plugins/maven-javadoc-plugin/2.1/maven-javadoc-plugin-2.1.jar
Downloaded: http://repo1.maven.org/maven2/org/apache/maven/plugins/maven-javadoc-plugin/2.1/maven-javadoc-plugin-2.1.jar
(41 KB at 84.9 KB/sec)
Downloading: http://repo1.maven.org/maven2/org/apache/maven/maven-plugin-api/2.0.2/maven-plugin-api-2.0.2.pom
Downloaded: http://repo1.maven.org/maven2/org/apache/maven/maven-plugin-api/2.0.2/maven-plugin-api-2.0.2.pom
(643 B at 1.5 KB/sec)
Downloading: http://repo1.maven.org/maven2/org/apache/maven/reporting/maven-reporting-impl/2.0.2/maven-reporting-impl-2.0.2.pom
Downloaded: http://repo1.maven.org/maven2/org/apache/maven/reporting/maven-reporting-impl/2.0.2/maven-reporting-impl-2.0.2.pom
(2 KB at 3.4 KB/sec)
Downloading: http://repo1.maven.org/maven2/org/apache/maven/reporting/maven-reporting/2.0.2/maven-reporting-2.0.2.pom
Downloaded: http://repo1.maven.org/maven2/org/apache/maven/reporting/maven-reporting/2.0.2/maven-reporting-2.0.2.pom
(738 B at 1.6 KB/sec)
Downloading: http://repo1.maven.org/maven2/commons-validator/commons-validator/1.1.4/commons-validator-1.1.4.pom
Downloaded: http://repo1.maven.org/maven2/commons-validator/commons-validator/1.1.4/commons-validator-1.1.4.pom
(168 B at 0.3 KB/sec)
Downloading: http://repo1.maven.org/maven2/org/apache/maven/reporting/maven-reporting-api/2.0.2/maven-reporting-api-2.0.2.pom
Downloaded: http://repo1.maven.org/maven2/org/apache/maven/reporting/maven-reporting-api/2.0.2/maven-reporting-api-2.0.2.pom
(902 B at 1.7 KB/sec)
Downloading: http://repo1.maven.org/maven2/org/codehaus/plexus/plexus-utils/1.2/plexus-utils-1.2.jar
Downloading: http://repo1.maven.org/maven2/org/apache/maven/reporting/maven-reporting-impl/2.0.2/maven-reporting-impl-2.0.2.jar
Downloading: http://repo1.maven.org/maven2/commons-validator/commons-validator/1.1.4/commons-validator-1.1.4.jar
Downloaded: http://repo1.maven.org/maven2/org/codehaus/plexus/plexus-utils/1.2/plexus-utils-1.2.jar
(169 KB at 178.4 KB/sec)
Downloaded: http://repo1.maven.org/maven2/commons-validator/commons-validator/1.1.4/commons-validator-1.1.4.jar
(83 KB at 69.0 KB/sec)
Downloaded: http://repo1.maven.org/maven2/org/apache/maven/reporting/maven-reporting-impl/2.0.2/maven-reporting-impl-2.0.2.jar
(14 KB at 9.2 KB/sec)
[FINDBUGS] Using set difference to compute new warnings
[FINDBUGS] Not changing build status, since no threshold has been exceeded
[JENKINS] Archiving <https://builds.apache.org/job/Synapse%20-%20Trunk/ws/java/pom.xml>
to /home/hudson/hudson/jobs/Synapse - Trunk/modules/org.apache.synapse$Apache-Synapse/builds/2011-12-26_09-01-10/archive/org.apache.synapse/Apache-Synapse/2.1.0-SNAPSHOT/Apache-Synapse-2.1.0-SNAPSHOT.pom
[INFO] ------------------------------------------------------------------------
[INFO] Reactor Summary:
[INFO] 
[INFO] Apache Synapse .................................... FAILURE [1:31.060s]
[INFO] Apache Synapse - Secure vault ..................... SKIPPED
[INFO] Apache Synapse - Commons .......................... SKIPPED
[INFO] Apache Synapse - Transports ....................... SKIPPED
[INFO] Apache Synapse - Non-blocking HTTP/s Transport .... SKIPPED
[INFO] Apache Synapse - PIPE Transport ................... SKIPPED
[INFO] Apache Synapse - VFS Transport .................... SKIPPED
[INFO] Apache Synapse - FIX Transport .................... SKIPPED
[INFO] Apache Synapse - Tasks ............................ SKIPPED
[INFO] Apache Synapse - Core ............................. SKIPPED
[INFO] Apache Synapse - Extensions ....................... SKIPPED
[INFO] Apache Synapse - Samples .......................... SKIPPED
[INFO] Apache Synapse - Patches .......................... SKIPPED
[INFO] Apache Synapse - Experimental code ................ SKIPPED
[INFO] Apache Synapse - Web Application .................. SKIPPED
[INFO] Apache Synapse - Handler Module ................... SKIPPED
[INFO] Apache Synapse - XAR Maven Plugin ................. SKIPPED
[INFO] Apache Synapse - Configuration Migrator ........... SKIPPED
[INFO] Apache Synapse - Distribution ..................... SKIPPED
[INFO] Apache Synapse - Package skeleton ZIP ............. SKIPPED
[INFO] Apache Synapse - Package archetype ................ SKIPPED
[INFO] Apache Synapse - Integration ...................... SKIPPED
[INFO] ------------------------------------------------------------------------
[INFO] BUILD FAILURE
[INFO] ------------------------------------------------------------------------
[INFO] Total time: 2:07.699s
[INFO] Finished at: Mon Dec 26 09:03:22 GMT 2011
[INFO] Final Memory: 20M/374M
[INFO] ------------------------------------------------------------------------
mavenExecutionResult exceptions not empty
message : Failed to execute goal org.apache.maven.plugins:maven-site-plugin:3.0:site (default-site)
on project Apache-Synapse: failed to get report for org.apache.maven.plugins:maven-javadoc-plugin
cause : failed to get report for org.apache.maven.plugins:maven-javadoc-plugin
Stack trace : 
org.apache.maven.lifecycle.LifecycleExecutionException: Failed to execute goal org.apache.maven.plugins:maven-site-plugin:3.0:site
(default-site) on project Apache-Synapse: failed to get report for org.apache.maven.plugins:maven-javadoc-plugin
	at org.apache.maven.lifecycle.internal.MojoExecutor.execute(MojoExecutor.java:217)
	at org.apache.maven.lifecycle.internal.MojoExecutor.execute(MojoExecutor.java:153)
	at org.apache.maven.lifecycle.internal.MojoExecutor.execute(MojoExecutor.java:145)
	at org.apache.maven.lifecycle.internal.LifecycleModuleBuilder.buildProject(LifecycleModuleBuilder.java:84)
	at org.apache.maven.lifecycle.internal.LifecycleModuleBuilder.buildProject(LifecycleModuleBuilder.java:59)
	at org.apache.maven.lifecycle.internal.LifecycleStarter.singleThreadedBuild(LifecycleStarter.java:183)
	at org.apache.maven.lifecycle.internal.LifecycleStarter.execute(LifecycleStarter.java:161)
	at org.apache.maven.DefaultMaven.doExecute(DefaultMaven.java:319)
	at org.apache.maven.DefaultMaven.execute(DefaultMaven.java:156)
	at org.jvnet.hudson.maven3.launcher.Maven3Launcher.main(Maven3Launcher.java:79)
	at sun.reflect.NativeMethodAccessorImpl.invoke0(Native Method)
	at sun.reflect.NativeMethodAccessorImpl.invoke(NativeMethodAccessorImpl.java:39)
	at sun.reflect.DelegatingMethodAccessorImpl.invoke(DelegatingMethodAccessorImpl.java:25)
	at java.lang.reflect.Method.invoke(Method.java:592)
	at org.codehaus.plexus.classworlds.launcher.Launcher.launchStandard(Launcher.java:329)
	at org.codehaus.plexus.classworlds.launcher.Launcher.launch(Launcher.java:239)
	at org.jvnet.hudson.maven3.agent.Maven3Main.launch(Maven3Main.java:158)
	at hudson.maven.Maven3Builder.call(Maven3Builder.java:122)
	at hudson.maven.Maven3Builder.call(Maven3Builder.java:74)
	at hudson.remoting.UserRequest.perform(UserRequest.java:118)
	at hudson.remoting.UserRequest.perform(UserRequest.java:48)
	at hudson.remoting.Request$2.run(Request.java:287)
	at java.util.concurrent.Executors$RunnableAdapter.call(Executors.java:417)
	at java.util.concurrent.FutureTask$Sync.innerRun(FutureTask.java:269)
	at java.util.concurrent.FutureTask.run(FutureTask.java:123)
	at java.util.concurrent.ThreadPoolExecutor$Worker.runTask(ThreadPoolExecutor.java:651)
	at java.util.concurrent.ThreadPoolExecutor$Worker.run(ThreadPoolExecutor.java:676)
	at java.lang.Thread.run(Thread.java:595)
Caused by: org.apache.maven.plugin.MojoExecutionException: failed to get report for org.apache.maven.plugins:maven-javadoc-plugin
	at org.apache.maven.reporting.exec.DefaultMavenReportExecutor.buildMavenReports(DefaultMavenReportExecutor.java:154)
	at org.apache.maven.plugins.site.AbstractSiteRenderingMojo.getReports(AbstractSiteRenderingMojo.java:240)
	at org.apache.maven.plugins.site.SiteMojo.execute(SiteMojo.java:121)
	at org.apache.maven.plugin.DefaultBuildPluginManager.executeMojo(DefaultBuildPluginManager.java:101)
	at org.apache.maven.lifecycle.internal.MojoExecutor.execute(MojoExecutor.java:209)
	... 27 more
Caused by: org.apache.maven.plugin.PluginConfigurationException: Unable to parse configuration
of mojo org.apache.maven.plugins:maven-javadoc-plugin:2.1:javadoc: Setter org.apache.maven.plugin.javadoc.JavadocReport.setReportOutputDirectory(
java.io.File ) threw exception when called with parameter '<https://builds.apache.org/job/Synapse%20-%20Trunk/ws/java/target/site/apidocs'>:
null
	at org.apache.maven.plugin.internal.DefaultMavenPluginManager.populatePluginFields(DefaultMavenPluginManager.java:597)
	at org.apache.maven.plugin.internal.DefaultMavenPluginManager.getConfiguredMojo(DefaultMavenPluginManager.java:529)
	at org.apache.maven.reporting.exec.DefaultMavenReportExecutor.getConfiguredMavenReport(DefaultMavenReportExecutor.java:318)
	at org.apache.maven.reporting.exec.DefaultMavenReportExecutor.buildReportPlugin(DefaultMavenReportExecutor.java:267)
	at org.apache.maven.reporting.exec.DefaultMavenReportExecutor.buildMavenReports(DefaultMavenReportExecutor.java:148)
	... 31 more
Caused by: org.codehaus.plexus.component.configurator.ComponentConfigurationException: Setter
org.apache.maven.plugin.javadoc.JavadocReport.setReportOutputDirectory( java.io.File ) threw
exception when called with parameter '<https://builds.apache.org/job/Synapse%20-%20Trunk/ws/java/target/site/apidocs'>:
null
	at org.codehaus.plexus.component.configurator.converters.ComponentValueSetter.setValueUsingSetter(ComponentValueSetter.java:249)
	at org.codehaus.plexus.component.configurator.converters.ComponentValueSetter.configure(ComponentValueSetter.java:285)
	at org.codehaus.plexus.component.configurator.converters.composite.ObjectWithFieldsConverter.processConfiguration(ObjectWithFieldsConverter.java:151)
	at org.codehaus.plexus.component.configurator.BasicComponentConfigurator.configureComponent(BasicComponentConfigurator.java:56)
	at org.apache.maven.plugin.internal.DefaultMavenPluginManager.populatePluginFields(DefaultMavenPluginManager.java:567)
	... 35 more
Caused by: java.lang.reflect.InvocationTargetException
	at sun.reflect.NativeMethodAccessorImpl.invoke0(Native Method)
	at sun.reflect.NativeMethodAccessorImpl.invoke(NativeMethodAccessorImpl.java:39)
	at sun.reflect.DelegatingMethodAccessorImpl.invoke(DelegatingMethodAccessorImpl.java:25)
	at java.lang.reflect.Method.invoke(Method.java:592)
	at org.codehaus.plexus.component.configurator.converters.ComponentValueSetter.setValueUsingSetter(ComponentValueSetter.java:236)
	... 39 more
Caused by: java.lang.NullPointerException
	at java.lang.String.endsWith(String.java:1296)
	at org.apache.maven.plugin.javadoc.JavadocReport.setReportOutputDirectory(JavadocReport.java:196)
	... 44 more
[FINDBUGS] Aggregating results of Apache Synapse
[FINDBUGS] Using set difference to compute new warnings
[FINDBUGS] Not changing build status, since no threshold has been exceeded
Sending e-mails to: dev@synapse.apache.org
channel stopped
[locks-and-latches] Releasing all the locks
[locks-and-latches] All the locks released


---------------------------------------------------------------------
To unsubscribe, e-mail: dev-unsubscribe@synapse.apache.org
For additional commands, e-mail: dev-help@synapse.apache.org


Mime
View raw message