synapse-dev mailing list archives

Site index · List index
Message view « Date » · « Thread »
Top « Date » · « Thread »
From Apache Hudson Server <hud...@hudson.apache.org>
Subject Build failed in Hudson: Synapse - Trunk #3258
Date Wed, 16 Feb 2011 00:38:48 GMT
See <https://hudson.apache.org/hudson/job/Synapse%20-%20Trunk/3258/changes>

Changes:

[supun] improving the sampler as well as improving the in memory message store to use synchronization

[supun] changing the thread pool to have the default as a unbounded queue

------------------------------------------
[...truncated 788 lines...]
[HUDSON] Recording test results
[INFO] [bundle:bundle {execution: default-bundle}]
[INFO] [assembly:attached {execution: attach-testkit-logs}]
[INFO] Reading assembly descriptor: src/main/assembly/testkit-logs.xml
[INFO] Building zip: <https://hudson.apache.org/hudson/job/Synapse%20-%20Trunk/ws/java/modules/transports/core/vfs/target/synapse-vfs-transport-2.1.0-SNAPSHOT-testkit-logs.zip>
[INFO] [install:install {execution: default-install}]
[INFO] Installing <https://hudson.apache.org/hudson/job/Synapse%20-%20Trunk/ws/java/modules/transports/core/vfs/target/synapse-vfs-transport-2.1.0-SNAPSHOT.jar>
to /home/hudson/.m2/repository/org/apache/synapse/synapse-vfs-transport/2.1.0-SNAPSHOT/synapse-vfs-transport-2.1.0-SNAPSHOT.jar
[INFO] Installing <https://hudson.apache.org/hudson/job/Synapse%20-%20Trunk/ws/java/modules/transports/core/vfs/target/synapse-vfs-transport-2.1.0-SNAPSHOT-testkit-logs.zip>
to /home/hudson/.m2/repository/org/apache/synapse/synapse-vfs-transport/2.1.0-SNAPSHOT/synapse-vfs-transport-2.1.0-SNAPSHOT-testkit-logs.zip
[INFO] [bundle:install {execution: default-install}]
[INFO] Parsing file:/home/hudson/.m2/repository/repository.xml
[Fatal Error] :-1:-1: Premature end of file.
org.xml.sax.SAXParseException: Premature end of file.
	at com.sun.org.apache.xerces.internal.parsers.DOMParser.parse(DOMParser.java:264)
	at com.sun.org.apache.xerces.internal.jaxp.DocumentBuilderImpl.parse(DocumentBuilderImpl.java:292)
	at javax.xml.parsers.DocumentBuilder.parse(DocumentBuilder.java:172)
	at org.apache.felix.obrplugin.ObrUpdate.parseFile(ObrUpdate.java:347)
	at org.apache.felix.obrplugin.ObrUpdate.parseRepositoryXml(ObrUpdate.java:324)
	at org.apache.felix.obrplugin.ObrInstall.execute(ObrInstall.java:136)
	at org.apache.maven.plugin.DefaultPluginManager.executeMojo(DefaultPluginManager.java:490)
	at hudson.maven.agent.PluginManagerInterceptor.executeMojo(PluginManagerInterceptor.java:182)
	at org.apache.maven.lifecycle.DefaultLifecycleExecutor.executeGoals(DefaultLifecycleExecutor.java:694)
	at org.apache.maven.lifecycle.DefaultLifecycleExecutor.executeGoalWithLifecycle(DefaultLifecycleExecutor.java:556)
	at org.apache.maven.lifecycle.DefaultLifecycleExecutor.executeGoal(DefaultLifecycleExecutor.java:535)
	at org.apache.maven.lifecycle.DefaultLifecycleExecutor.executeGoalAndHandleFailures(DefaultLifecycleExecutor.java:387)
	at org.apache.maven.lifecycle.DefaultLifecycleExecutor.executeTaskSegments(DefaultLifecycleExecutor.java:348)
	at org.apache.maven.lifecycle.DefaultLifecycleExecutor.execute(DefaultLifecycleExecutor.java:180)
	at org.apache.maven.lifecycle.LifecycleExecutorInterceptor.execute(LifecycleExecutorInterceptor.java:65)
	at org.apache.maven.DefaultMaven.doExecute(DefaultMaven.java:328)
	at org.apache.maven.DefaultMaven.execute(DefaultMaven.java:138)
	at org.apache.maven.cli.MavenCli.main(MavenCli.java:362)
	at sun.reflect.NativeMethodAccessorImpl.invoke0(Native Method)
	at sun.reflect.NativeMethodAccessorImpl.invoke(NativeMethodAccessorImpl.java:39)
	at sun.reflect.DelegatingMethodAccessorImpl.invoke(DelegatingMethodAccessorImpl.java:25)
	at java.lang.reflect.Method.invoke(Method.java:592)
	at org.codehaus.classworlds.Launcher.launchEnhanced(Launcher.java:315)
	at org.codehaus.classworlds.Launcher.launch(Launcher.java:255)
	at hudson.maven.agent.Main.launch(Main.java:173)
	at hudson.maven.MavenBuilder.call(MavenBuilder.java:164)
	at hudson.maven.MavenModuleSetBuild$Builder.call(MavenModuleSetBuild.java:868)
	at hudson.maven.MavenModuleSetBuild$Builder.call(MavenModuleSetBuild.java:799)
	at hudson.remoting.UserRequest.perform(UserRequest.java:114)
	at hudson.remoting.UserRequest.perform(UserRequest.java:48)
	at hudson.remoting.Request$2.run(Request.java:270)
	at java.util.concurrent.Executors$RunnableAdapter.call(Executors.java:417)
	at java.util.concurrent.FutureTask$Sync.innerRun(FutureTask.java:269)
	at java.util.concurrent.FutureTask.run(FutureTask.java:123)
	at java.util.concurrent.ThreadPoolExecutor$Worker.runTask(ThreadPoolExecutor.java:651)
	at java.util.concurrent.ThreadPoolExecutor$Worker.run(ThreadPoolExecutor.java:676)
	at java.lang.Thread.run(Thread.java:595)
[INFO] Writing OBR metadata
[WARNING] Exception while updating local OBR: null
java.lang.NullPointerException
	at org.apache.felix.obrplugin.ObrUpdate.writeRepositoryXml(ObrUpdate.java:268)
	at org.apache.felix.obrplugin.ObrInstall.execute(ObrInstall.java:144)
	at org.apache.maven.plugin.DefaultPluginManager.executeMojo(DefaultPluginManager.java:490)
	at hudson.maven.agent.PluginManagerInterceptor.executeMojo(PluginManagerInterceptor.java:182)
	at org.apache.maven.lifecycle.DefaultLifecycleExecutor.executeGoals(DefaultLifecycleExecutor.java:694)
	at org.apache.maven.lifecycle.DefaultLifecycleExecutor.executeGoalWithLifecycle(DefaultLifecycleExecutor.java:556)
	at org.apache.maven.lifecycle.DefaultLifecycleExecutor.executeGoal(DefaultLifecycleExecutor.java:535)
	at org.apache.maven.lifecycle.DefaultLifecycleExecutor.executeGoalAndHandleFailures(DefaultLifecycleExecutor.java:387)
	at org.apache.maven.lifecycle.DefaultLifecycleExecutor.executeTaskSegments(DefaultLifecycleExecutor.java:348)
	at org.apache.maven.lifecycle.DefaultLifecycleExecutor.execute(DefaultLifecycleExecutor.java:180)
	at org.apache.maven.lifecycle.LifecycleExecutorInterceptor.execute(LifecycleExecutorInterceptor.java:65)
	at org.apache.maven.DefaultMaven.doExecute(DefaultMaven.java:328)
	at org.apache.maven.DefaultMaven.execute(DefaultMaven.java:138)
	at org.apache.maven.cli.MavenCli.main(MavenCli.java:362)
	at sun.reflect.NativeMethodAccessorImpl.invoke0(Native Method)
	at sun.reflect.NativeMethodAccessorImpl.invoke(NativeMethodAccessorImpl.java:39)
	at sun.reflect.DelegatingMethodAccessorImpl.invoke(DelegatingMethodAccessorImpl.java:25)
	at java.lang.reflect.Method.invoke(Method.java:592)
	at org.codehaus.classworlds.Launcher.launchEnhanced(Launcher.java:315)
	at org.codehaus.classworlds.Launcher.launch(Launcher.java:255)
	at hudson.maven.agent.Main.launch(Main.java:173)
	at hudson.maven.MavenBuilder.call(MavenBuilder.java:164)
	at hudson.maven.MavenModuleSetBuild$Builder.call(MavenModuleSetBuild.java:868)
	at hudson.maven.MavenModuleSetBuild$Builder.call(MavenModuleSetBuild.java:799)
	at hudson.remoting.UserRequest.perform(UserRequest.java:114)
	at hudson.remoting.UserRequest.perform(UserRequest.java:48)
	at hudson.remoting.Request$2.run(Request.java:270)
	at java.util.concurrent.Executors$RunnableAdapter.call(Executors.java:417)
	at java.util.concurrent.FutureTask$Sync.innerRun(FutureTask.java:269)
	at java.util.concurrent.FutureTask.run(FutureTask.java:123)
	at java.util.concurrent.ThreadPoolExecutor$Worker.runTask(ThreadPoolExecutor.java:651)
	at java.util.concurrent.ThreadPoolExecutor$Worker.run(ThreadPoolExecutor.java:676)
	at java.lang.Thread.run(Thread.java:595)
[HUDSON] Archiving <https://hudson.apache.org/hudson/job/Synapse%20-%20Trunk/ws/java/modules/transports/core/vfs/pom.xml>
to /home/hudson/hudson/jobs/Synapse - Trunk/modules/org.apache.synapse$synapse-vfs-transport/builds/2011-02-16_00-36-18/archive/org.apache.synapse/synapse-vfs-transport/2.1.0-SNAPSHOT/pom.xml
[HUDSON] Archiving <https://hudson.apache.org/hudson/job/Synapse%20-%20Trunk/ws/java/modules/transports/core/vfs/target/synapse-vfs-transport-2.1.0-SNAPSHOT.jar>
to /home/hudson/hudson/jobs/Synapse - Trunk/modules/org.apache.synapse$synapse-vfs-transport/builds/2011-02-16_00-36-18/archive/org.apache.synapse/synapse-vfs-transport/2.1.0-SNAPSHOT/synapse-vfs-transport-2.1.0-SNAPSHOT.jar
[HUDSON] Archiving <https://hudson.apache.org/hudson/job/Synapse%20-%20Trunk/ws/java/modules/transports/core/vfs/target/synapse-vfs-transport-2.1.0-SNAPSHOT-testkit-logs.zip>
to /home/hudson/hudson/jobs/Synapse - Trunk/modules/org.apache.synapse$synapse-vfs-transport/builds/2011-02-16_00-36-18/archive/org.apache.synapse/synapse-vfs-transport/2.1.0-SNAPSHOT/synapse-vfs-transport-2.1.0-SNAPSHOT-testkit-logs.zip
[INFO] ------------------------------------------------------------------------
[INFO] Building Apache Synapse - Tasks classes
[INFO]    task-segment: [clean, install]
[INFO] ------------------------------------------------------------------------
[INFO] [clean:clean {execution: default-clean}]
[INFO] Deleting directory <https://hudson.apache.org/hudson/job/Synapse%20-%20Trunk/ws/java/modules/tasks/target>
[INFO] [remote-resources:process {execution: default}]
[INFO] [resources:resources {execution: default-resources}]
[INFO] Using encoding: 'UTF-8' to copy filtered resources.
[INFO] [compiler:compile {execution: default-compile}]
Compiling 16 source files to <https://hudson.apache.org/hudson/job/Synapse%20-%20Trunk/ws/java/modules/tasks/target/classes>
[INFO] [resources:testResources {execution: default-testResources}]
[INFO] Using encoding: 'UTF-8' to copy filtered resources.
[INFO] [compiler:testCompile {execution: default-testCompile}]
[INFO] No sources to compile
[INFO] [surefire:test {execution: default-test}]
[INFO] Surefire report directory: <https://hudson.apache.org/hudson/job/Synapse%20-%20Trunk/ws/java/modules/tasks/target/surefire-reports>

-------------------------------------------------------
 T E S T S
-------------------------------------------------------
There are no tests to run.

Results :
Tests run: 0, Failures: 0, Errors: 0, Skipped: 0

[HUDSON] Recording test results[INFO] [bundle:bundle {execution: default-bundle}]

[INFO] [install:install {execution: default-install}]
[INFO] Installing <https://hudson.apache.org/hudson/job/Synapse%20-%20Trunk/ws/java/modules/tasks/target/synapse-tasks-2.1.0-SNAPSHOT.jar>
to /home/hudson/.m2/repository/org/apache/synapse/synapse-tasks/2.1.0-SNAPSHOT/synapse-tasks-2.1.0-SNAPSHOT.jar
[INFO] [bundle:install {execution: default-install}]
[INFO] Parsing file:/home/hudson/.m2/repository/repository.xml
[Fatal Error] :-1:-1: Premature end of file.
org.xml.sax.SAXParseException: Premature end of file.
	at com.sun.org.apache.xerces.internal.parsers.DOMParser.parse(DOMParser.java:264)
	at com.sun.org.apache.xerces.internal.jaxp.DocumentBuilderImpl.parse(DocumentBuilderImpl.java:292)
	at javax.xml.parsers.DocumentBuilder.parse(DocumentBuilder.java:172)
	at org.apache.felix.obrplugin.ObrUpdate.parseFile(ObrUpdate.java:347)
	at org.apache.felix.obrplugin.ObrUpdate.parseRepositoryXml(ObrUpdate.java:324)
	at org.apache.felix.obrplugin.ObrInstall.execute(ObrInstall.java:136)
	at org.apache.maven.plugin.DefaultPluginManager.executeMojo(DefaultPluginManager.java:490)
	at hudson.maven.agent.PluginManagerInterceptor.executeMojo(PluginManagerInterceptor.java:182)
	at org.apache.maven.lifecycle.DefaultLifecycleExecutor.executeGoals(DefaultLifecycleExecutor.java:694)
	at org.apache.maven.lifecycle.DefaultLifecycleExecutor.executeGoalWithLifecycle(DefaultLifecycleExecutor.java:556)
	at org.apache.maven.lifecycle.DefaultLifecycleExecutor.executeGoal(DefaultLifecycleExecutor.java:535)
	at org.apache.maven.lifecycle.DefaultLifecycleExecutor.executeGoalAndHandleFailures(DefaultLifecycleExecutor.java:387)
	at org.apache.maven.lifecycle.DefaultLifecycleExecutor.executeTaskSegments(DefaultLifecycleExecutor.java:348)
	at org.apache.maven.lifecycle.DefaultLifecycleExecutor.execute(DefaultLifecycleExecutor.java:180)
	at org.apache.maven.lifecycle.LifecycleExecutorInterceptor.execute(LifecycleExecutorInterceptor.java:65)
	at org.apache.maven.DefaultMaven.doExecute(DefaultMaven.java:328)
	at org.apache.maven.DefaultMaven.execute(DefaultMaven.java:138)
	at org.apache.maven.cli.MavenCli.main(MavenCli.java:362)
	at sun.reflect.NativeMethodAccessorImpl.invoke0(Native Method)
	at sun.reflect.NativeMethodAccessorImpl.invoke(NativeMethodAccessorImpl.java:39)
	at sun.reflect.DelegatingMethodAccessorImpl.invoke(DelegatingMethodAccessorImpl.java:25)
	at java.lang.reflect.Method.invoke(Method.java:592)
	at org.codehaus.classworlds.Launcher.launchEnhanced(Launcher.java:315)
	at org.codehaus.classworlds.Launcher.launch(Launcher.java:255)
	at hudson.maven.agent.Main.launch(Main.java:173)
	at hudson.maven.MavenBuilder.call(MavenBuilder.java:164)
	at hudson.maven.MavenModuleSetBuild$Builder.call(MavenModuleSetBuild.java:868)
	at hudson.maven.MavenModuleSetBuild$Builder.call(MavenModuleSetBuild.java:799)
	at hudson.remoting.UserRequest.perform(UserRequest.java:114)
	at hudson.remoting.UserRequest.perform(UserRequest.java:48)
	at hudson.remoting.Request$2.run(Request.java:270)
	at java.util.concurrent.Executors$RunnableAdapter.call(Executors.java:417)
	at java.util.concurrent.FutureTask$Sync.innerRun(FutureTask.java:269)
	at java.util.concurrent.FutureTask.run(FutureTask.java:123)
	at java.util.concurrent.ThreadPoolExecutor$Worker.runTask(ThreadPoolExecutor.java:651)
	at java.util.concurrent.ThreadPoolExecutor$Worker.run(ThreadPoolExecutor.java:676)
	at java.lang.Thread.run(Thread.java:595)
[INFO] Writing OBR metadata
[WARNING] Exception while updating local OBR: null
java.lang.NullPointerException
	at org.apache.felix.obrplugin.ObrUpdate.writeRepositoryXml(ObrUpdate.java:268)
	at org.apache.felix.obrplugin.ObrInstall.execute(ObrInstall.java:144)
	at org.apache.maven.plugin.DefaultPluginManager.executeMojo(DefaultPluginManager.java:490)
	at hudson.maven.agent.PluginManagerInterceptor.executeMojo(PluginManagerInterceptor.java:182)
	at org.apache.maven.lifecycle.DefaultLifecycleExecutor.executeGoals(DefaultLifecycleExecutor.java:694)
	at org.apache.maven.lifecycle.DefaultLifecycleExecutor.executeGoalWithLifecycle(DefaultLifecycleExecutor.java:556)
	at org.apache.maven.lifecycle.DefaultLifecycleExecutor.executeGoal(DefaultLifecycleExecutor.java:535)
	at org.apache.maven.lifecycle.DefaultLifecycleExecutor.executeGoalAndHandleFailures(DefaultLifecycleExecutor.java:387)
	at org.apache.maven.lifecycle.DefaultLifecycleExecutor.executeTaskSegments(DefaultLifecycleExecutor.java:348)
	at org.apache.maven.lifecycle.DefaultLifecycleExecutor.execute(DefaultLifecycleExecutor.java:180)
	at org.apache.maven.lifecycle.LifecycleExecutorInterceptor.execute(LifecycleExecutorInterceptor.java:65)
	at org.apache.maven.DefaultMaven.doExecute(DefaultMaven.java:328)
	at org.apache.maven.DefaultMaven.execute(DefaultMaven.java:138)
	at org.apache.maven.cli.MavenCli.main(MavenCli.java:362)
	at sun.reflect.NativeMethodAccessorImpl.invoke0(Native Method)
	at sun.reflect.NativeMethodAccessorImpl.invoke(NativeMethodAccessorImpl.java:39)
	at sun.reflect.DelegatingMethodAccessorImpl.invoke(DelegatingMethodAccessorImpl.java:25)
	at java.lang.reflect.Method.invoke(Method.java:592)
	at org.codehaus.classworlds.Launcher.launchEnhanced(Launcher.java:315)
	at org.codehaus.classworlds.Launcher.launch(Launcher.java:255)
	at hudson.maven.agent.Main.launch(Main.java:173)
	at hudson.maven.MavenBuilder.call(MavenBuilder.java:164)
	at hudson.maven.MavenModuleSetBuild$Builder.call(MavenModuleSetBuild.java:868)
	at hudson.maven.MavenModuleSetBuild$Builder.call(MavenModuleSetBuild.java:799)
	at hudson.remoting.UserRequest.perform(UserRequest.java:114)
	at hudson.remoting.UserRequest.perform(UserRequest.java:48)
	at hudson.remoting.Request$2.run(Request.java:270)
	at java.util.concurrent.Executors$RunnableAdapter.call(Executors.java:417)
	at java.util.concurrent.FutureTask$Sync.innerRun(FutureTask.java:269)
	at java.util.concurrent.FutureTask.run(FutureTask.java:123)
	at java.util.concurrent.ThreadPoolExecutor$Worker.runTask(ThreadPoolExecutor.java:651)
	at java.util.concurrent.ThreadPoolExecutor$Worker.run(ThreadPoolExecutor.java:676)
	at java.lang.Thread.run(Thread.java:595)
[HUDSON] Archiving <https://hudson.apache.org/hudson/job/Synapse%20-%20Trunk/ws/java/modules/tasks/pom.xml>
to /home/hudson/hudson/jobs/Synapse - Trunk/modules/org.apache.synapse$synapse-tasks/builds/2011-02-16_00-36-18/archive/org.apache.synapse/synapse-tasks/2.1.0-SNAPSHOT/pom.xml
[HUDSON] Archiving <https://hudson.apache.org/hudson/job/Synapse%20-%20Trunk/ws/java/modules/tasks/target/synapse-tasks-2.1.0-SNAPSHOT.jar>
to /home/hudson/hudson/jobs/Synapse - Trunk/modules/org.apache.synapse$synapse-tasks/builds/2011-02-16_00-36-18/archive/org.apache.synapse/synapse-tasks/2.1.0-SNAPSHOT/synapse-tasks-2.1.0-SNAPSHOT.jar
[INFO] ------------------------------------------------------------------------
[INFO] Building Apache Synapse - Core
[INFO]    task-segment: [clean, install]
[INFO] ------------------------------------------------------------------------
[INFO] [clean:clean {execution: default-clean}]
[INFO] Deleting directory <https://hudson.apache.org/hudson/job/Synapse%20-%20Trunk/ws/java/modules/core/target>
[INFO] [remote-resources:process {execution: default}]
[INFO] snapshot org.apache.axis2:axis2-transport-jms:1.1.0-SNAPSHOT: checking for updates
from apache-snapshots
[INFO] snapshot org.apache.axis2:axis2-transport-jms:1.1.0-SNAPSHOT: checking for updates
from wso2-m2-snapshots
[INFO] snapshot org.apache.axis2:axis2-transport-jms:1.1.0-SNAPSHOT: checking for updates
from apache.snapshots
Downloading: http://repository.apache.org/snapshots/org/apache/axis2/axis2-transport-jms/1.1.0-SNAPSHOT/axis2-transport-jms-1.1.0-SNAPSHOT.pom
[INFO] snapshot org.apache.axis2:axis2-transport-mail:1.1.0-SNAPSHOT: checking for updates
from apache-snapshots
[INFO] snapshot org.apache.axis2:axis2-transport-mail:1.1.0-SNAPSHOT: checking for updates
from wso2-m2-snapshots
[INFO] snapshot org.apache.axis2:axis2-transport-mail:1.1.0-SNAPSHOT: checking for updates
from apache.snapshots
Downloading: http://repository.apache.org/snapshots/org/apache/axis2/axis2-transport-mail/1.1.0-SNAPSHOT/axis2-transport-mail-1.1.0-SNAPSHOT.pom
[INFO] snapshot org.apache.synapse:synapse-tasks:2.1.0-SNAPSHOT: checking for updates from
apache-snapshots
Downloading: http://repository.apache.org/snapshots/org/apache/axis2/axis2-transport-jms/1.1.0-SNAPSHOT/axis2-transport-jms-1.1.0-SNAPSHOT.jar
[INFO] snapshot org.apache.synapse:synapse-tasks:2.1.0-SNAPSHOT: checking for updates from
wso2-m2-snapshots
Downloading: http://repository.apache.org/snapshots/org/apache/axis2/axis2-transport-mail/1.1.0-SNAPSHOT/axis2-transport-mail-1.1.0-SNAPSHOT.jar
[INFO] snapshot org.apache.synapse:synapse-tasks:2.1.0-SNAPSHOT: checking for updates from
apache.snapshots
[INFO] snapshot org.apache.synapse:synapse-nhttp-transport:2.1.0-SNAPSHOT: checking for updates
from apache-snapshots
[INFO] snapshot org.apache.synapse:synapse-nhttp-transport:2.1.0-SNAPSHOT: checking for updates
from wso2-m2-snapshots
[INFO] snapshot org.apache.synapse:synapse-nhttp-transport:2.1.0-SNAPSHOT: checking for updates
from apache.snapshots
[INFO] snapshot org.apache.synapse:synapse-vfs-transport:2.1.0-SNAPSHOT: checking for updates
from apache-snapshots
[INFO] snapshot org.apache.synapse:synapse-vfs-transport:2.1.0-SNAPSHOT: checking for updates
from wso2-m2-snapshots
[INFO] snapshot org.apache.synapse:synapse-vfs-transport:2.1.0-SNAPSHOT: checking for updates
from apache.snapshots
[INFO] [resources:resources {execution: default-resources}]
[INFO] Using encoding: 'UTF-8' to copy filtered resources.
[INFO] [compiler:compile {execution: default-compile}]
Compiling 403 source files to <https://hudson.apache.org/hudson/job/Synapse%20-%20Trunk/ws/java/modules/core/target/classes>
[HUDSON] Archiving <https://hudson.apache.org/hudson/job/Synapse%20-%20Trunk/ws/java/modules/core/pom.xml>
to /home/hudson/hudson/jobs/Synapse - Trunk/modules/org.apache.synapse$synapse-core/builds/2011-02-16_00-36-18/archive/org.apache.synapse/synapse-core/2.1.0-SNAPSHOT/pom.xml
[INFO] ------------------------------------------------------------------------
[ERROR] BUILD FAILURE
[INFO] ------------------------------------------------------------------------
[INFO] Compilation failure

<https://hudson.apache.org/hudson/job/Synapse%20-%20Trunk/ws/java/modules/core/src/main/java/org/apache/synapse/util/concurrent/SynapseThreadPool.java>:[84,69]
cannot find symbol
symbol  : class LinkedBlockingDeque
location: class org.apache.synapse.util.concurrent.SynapseThreadPool


[INFO] ------------------------------------------------------------------------
[INFO] For more information, run Maven with the -e switch
[INFO] ------------------------------------------------------------------------
[INFO] Total time: 1 minute 59 seconds
[INFO] Finished at: Wed Feb 16 00:39:11 UTC 2011
[INFO] Final Memory: 56M/192M
[INFO] ------------------------------------------------------------------------
Sending e-mails to: dev@synapse.apache.org
channel stopped
[locks-and-latches] Releasing all the locks
[locks-and-latches] All the locks released


---------------------------------------------------------------------
To unsubscribe, e-mail: dev-unsubscribe@synapse.apache.org
For additional commands, e-mail: dev-help@synapse.apache.org


Mime
View raw message