synapse-dev mailing list archives

Site index · List index
Message view « Date » · « Thread »
Top « Date » · « Thread »
From Apache Hudson Server <hud...@hudson.apache.org>
Subject Build failed in Hudson: Synapse - Trunk #3220
Date Mon, 07 Feb 2011 01:22:32 GMT
See <https://hudson.apache.org/hudson/job/Synapse%20-%20Trunk/3220/>

------------------------------------------
[...truncated 1776 lines...]
[INFO] ------------------------------------------------------------------------
[INFO] Building Apache Synapse - Experimental code
[INFO]    task-segment: [clean, install]
[INFO] ------------------------------------------------------------------------
[INFO] [clean:clean {execution: default-clean}]
[INFO] Deleting directory <https://hudson.apache.org/hudson/job/Synapse%20-%20Trunk/ws/java/modules/experimental/target>
[INFO] [remote-resources:process {execution: default}]
[INFO] [resources:resources {execution: default-resources}]
[INFO] Using encoding: 'UTF-8' to copy filtered resources.
[INFO] [compiler:compile {execution: default-compile}]
Compiling 15 source files to <https://hudson.apache.org/hudson/job/Synapse%20-%20Trunk/ws/java/modules/experimental/target/classes>
[INFO] [resources:testResources {execution: default-testResources}]
[HUDSON] Recording test results[INFO] Using encoding: 'UTF-8' to copy filtered resources.
[INFO] [compiler:testCompile {execution: default-testCompile}]
[INFO] No sources to compile
[INFO] [surefire:test {execution: default-test}]
[INFO] Surefire report directory: <https://hudson.apache.org/hudson/job/Synapse%20-%20Trunk/ws/java/modules/experimental/target/surefire-reports>

-------------------------------------------------------
 T E S T S
-------------------------------------------------------
There are no tests to run.

Results :

Tests run: 0, Failures: 0, Errors: 0, Skipped: 0

[INFO] [bundle:bundle {execution: default-bundle}]
[INFO] [install:install {execution: default-install}]
[INFO] Installing <https://hudson.apache.org/hudson/job/Synapse%20-%20Trunk/ws/java/modules/experimental/target/synapse-experimental-2.1.0-SNAPSHOT.jar>
to /home/hudson/.m2/repository/org/apache/synapse/synapse-experimental/2.1.0-SNAPSHOT/synapse-experimental-2.1.0-SNAPSHOT.jar
[INFO] [bundle:install {execution: default-install}]
[INFO] Parsing file:/home/hudson/.m2/repository/repository.xml
[Fatal Error] :-1:-1: Premature end of file.
org.xml.sax.SAXParseException: Premature end of file.
	at com.sun.org.apache.xerces.internal.parsers.DOMParser.parse(DOMParser.java:264)
	at com.sun.org.apache.xerces.internal.jaxp.DocumentBuilderImpl.parse(DocumentBuilderImpl.java:292)
	at javax.xml.parsers.DocumentBuilder.parse(DocumentBuilder.java:172)
	at org.apache.felix.obrplugin.ObrUpdate.parseFile(ObrUpdate.java:347)
	at org.apache.felix.obrplugin.ObrUpdate.parseRepositoryXml(ObrUpdate.java:324)
	at org.apache.felix.obrplugin.ObrInstall.execute(ObrInstall.java:136)
	at org.apache.maven.plugin.DefaultPluginManager.executeMojo(DefaultPluginManager.java:490)
	at hudson.maven.agent.PluginManagerInterceptor.executeMojo(PluginManagerInterceptor.java:182)
	at org.apache.maven.lifecycle.DefaultLifecycleExecutor.executeGoals(DefaultLifecycleExecutor.java:694)
	at org.apache.maven.lifecycle.DefaultLifecycleExecutor.executeGoalWithLifecycle(DefaultLifecycleExecutor.java:556)
	at org.apache.maven.lifecycle.DefaultLifecycleExecutor.executeGoal(DefaultLifecycleExecutor.java:535)
	at org.apache.maven.lifecycle.DefaultLifecycleExecutor.executeGoalAndHandleFailures(DefaultLifecycleExecutor.java:387)
	at org.apache.maven.lifecycle.DefaultLifecycleExecutor.executeTaskSegments(DefaultLifecycleExecutor.java:348)
	at org.apache.maven.lifecycle.DefaultLifecycleExecutor.execute(DefaultLifecycleExecutor.java:180)
	at org.apache.maven.lifecycle.LifecycleExecutorInterceptor.execute(LifecycleExecutorInterceptor.java:65)
	at org.apache.maven.DefaultMaven.doExecute(DefaultMaven.java:328)
	at org.apache.maven.DefaultMaven.execute(DefaultMaven.java:138)
	at org.apache.maven.cli.MavenCli.main(MavenCli.java:362)
	at sun.reflect.NativeMethodAccessorImpl.invoke0(Native Method)
	at sun.reflect.NativeMethodAccessorImpl.invoke(NativeMethodAccessorImpl.java:39)
	at sun.reflect.DelegatingMethodAccessorImpl.invoke(DelegatingMethodAccessorImpl.java:25)
	at java.lang.reflect.Method.invoke(Method.java:592)
	at org.codehaus.classworlds.Launcher.launchEnhanced(Launcher.java:315)
	at org.codehaus.classworlds.Launcher.launch(Launcher.java:255)
	at hudson.maven.agent.Main.launch(Main.java:173)
	at hudson.maven.MavenBuilder.call(MavenBuilder.java:164)
	at hudson.maven.MavenModuleSetBuild$Builder.call(MavenModuleSetBuild.java:868)
	at hudson.maven.MavenModuleSetBuild$Builder.call(MavenModuleSetBuild.java:799)
	at hudson.remoting.UserRequest.perform(UserRequest.java:114)
	at hudson.remoting.UserRequest.perform(UserRequest.java:48)
	at hudson.remoting.Request$2.run(Request.java:270)
	at java.util.concurrent.Executors$RunnableAdapter.call(Executors.java:417)
	at java.util.concurrent.FutureTask$Sync.innerRun(FutureTask.java:269)
	at java.util.concurrent.FutureTask.run(FutureTask.java:123)
	at java.util.concurrent.ThreadPoolExecutor$Worker.runTask(ThreadPoolExecutor.java:651)
	at java.util.concurrent.ThreadPoolExecutor$Worker.run(ThreadPoolExecutor.java:676)
	at java.lang.Thread.run(Thread.java:595)
[INFO] Writing OBR metadata
[WARNING] Exception while updating local OBR: null
java.lang.NullPointerException
	at org.apache.felix.obrplugin.ObrUpdate.writeRepositoryXml(ObrUpdate.java:268)
	at org.apache.felix.obrplugin.ObrInstall.execute(ObrInstall.java:144)
	at org.apache.maven.plugin.DefaultPluginManager.executeMojo(DefaultPluginManager.java:490)
	at hudson.maven.agent.PluginManagerInterceptor.executeMojo(PluginManagerInterceptor.java:182)
	at org.apache.maven.lifecycle.DefaultLifecycleExecutor.executeGoals(DefaultLifecycleExecutor.java:694)
	at org.apache.maven.lifecycle.DefaultLifecycleExecutor.executeGoalWithLifecycle(DefaultLifecycleExecutor.java:556)
	at org.apache.maven.lifecycle.DefaultLifecycleExecutor.executeGoal(DefaultLifecycleExecutor.java:535)
	at org.apache.maven.lifecycle.DefaultLifecycleExecutor.executeGoalAndHandleFailures(DefaultLifecycleExecutor.java:387)
	at org.apache.maven.lifecycle.DefaultLifecycleExecutor.executeTaskSegments(DefaultLifecycleExecutor.java:348)
	at org.apache.maven.lifecycle.DefaultLifecycleExecutor.execute(DefaultLifecycleExecutor.java:180)
	at org.apache.maven.lifecycle.LifecycleExecutorInterceptor.execute(LifecycleExecutorInterceptor.java:65)
	at org.apache.maven.DefaultMaven.doExecute(DefaultMaven.java:328)
	at org.apache.maven.DefaultMaven.execute(DefaultMaven.java:138)
	at org.apache.maven.cli.MavenCli.main(MavenCli.java:362)
	at sun.reflect.NativeMethodAccessorImpl.invoke0(Native Method)
	at sun.reflect.NativeMethodAccessorImpl.invoke(NativeMethodAccessorImpl.java:39)
	at sun.reflect.DelegatingMethodAccessorImpl.invoke(DelegatingMethodAccessorImpl.java:25)
	at java.lang.reflect.Method.invoke(Method.java:592)
	at org.codehaus.classworlds.Launcher.launchEnhanced(Launcher.java:315)
	at org.codehaus.classworlds.Launcher.launch(Launcher.java:255)
	at hudson.maven.agent.Main.launch(Main.java:173)
	at hudson.maven.MavenBuilder.call(MavenBuilder.java:164)
	at hudson.maven.MavenModuleSetBuild$Builder.call(MavenModuleSetBuild.java:868)
	at hudson.maven.MavenModuleSetBuild$Builder.call(MavenModuleSetBuild.java:799)
	at hudson.remoting.UserRequest.perform(UserRequest.java:114)
	at hudson.remoting.UserRequest.perform(UserRequest.java:48)
	at hudson.remoting.Request$2.run(Request.java:270)
	at java.util.concurrent.Executors$RunnableAdapter.call(Executors.java:417)
	at java.util.concurrent.FutureTask$Sync.innerRun(FutureTask.java:269)
	at java.util.concurrent.FutureTask.run(FutureTask.java:123)
	at java.util.concurrent.ThreadPoolExecutor$Worker.runTask(ThreadPoolExecutor.java:651)
	at java.util.concurrent.ThreadPoolExecutor$Worker.run(ThreadPoolExecutor.java:676)
	at java.lang.Thread.run(Thread.java:595)

[HUDSON] Archiving <https://hudson.apache.org/hudson/job/Synapse%20-%20Trunk/ws/java/modules/experimental/pom.xml>
to /home/hudson/hudson/jobs/Synapse - Trunk/modules/org.apache.synapse$synapse-experimental/builds/2011-02-07_00-49-21/archive/org.apache.synapse/synapse-experimental/2.1.0-SNAPSHOT/pom.xml
[HUDSON] Archiving <https://hudson.apache.org/hudson/job/Synapse%20-%20Trunk/ws/java/modules/experimental/target/synapse-experimental-2.1.0-SNAPSHOT.jar>
to /home/hudson/hudson/jobs/Synapse - Trunk/modules/org.apache.synapse$synapse-experimental/builds/2011-02-07_00-49-21/archive/org.apache.synapse/synapse-experimental/2.1.0-SNAPSHOT/synapse-experimental-2.1.0-SNAPSHOT.jar
[INFO] ------------------------------------------------------------------------
[INFO] Building Apache Synapse - Web Application
[INFO]    task-segment: [clean, install]
[INFO] ------------------------------------------------------------------------
[INFO] [clean:clean {execution: default-clean}]
[INFO] Deleting directory <https://hudson.apache.org/hudson/job/Synapse%20-%20Trunk/ws/java/modules/war/target>
[INFO] [dependency:copy {execution: copy}]
[INFO] Configured Artifact: org.apache.axis2:addressing:SNAPSHOT:mar
[INFO] Configured Artifact: org.apache.sandesha2:sandesha2:SNAPSHOT:mar
[INFO] snapshot org.apache.sandesha2:sandesha2:SNAPSHOT: checking for updates from apache-snapshots
[INFO] snapshot org.apache.sandesha2:sandesha2:SNAPSHOT: checking for updates from wso2-m2-snapshots
[INFO] snapshot org.apache.sandesha2:sandesha2:SNAPSHOT: checking for updates from apache.snapshots
Downloading: http://repository.apache.org/snapshots/org/apache/sandesha2/sandesha2/SNAPSHOT/sandesha2-SNAPSHOT.mar
[INFO] Configured Artifact: org.apache.rampart:rampart:SNAPSHOT:mar
[INFO] snapshot org.apache.rampart:rampart:SNAPSHOT: checking for updates from apache-snapshots
[INFO] snapshot org.apache.rampart:rampart:SNAPSHOT: checking for updates from wso2-m2-snapshots
[INFO] snapshot org.apache.rampart:rampart:SNAPSHOT: checking for updates from apache.snapshots
Downloading: http://repository.apache.org/snapshots/org/apache/rampart/rampart/SNAPSHOT/rampart-SNAPSHOT.mar
[INFO] Copying addressing-SNAPSHOT.mar to <https://hudson.apache.org/hudson/job/Synapse%20-%20Trunk/ws/java/modules/war/target/temp/lib/addressing-SNAPSHOT.mar>
[INFO] Copying sandesha2-SNAPSHOT.mar to <https://hudson.apache.org/hudson/job/Synapse%20-%20Trunk/ws/java/modules/war/target/temp/lib/sandesha2-SNAPSHOT.mar>
[INFO] Copying rampart-SNAPSHOT.mar to <https://hudson.apache.org/hudson/job/Synapse%20-%20Trunk/ws/java/modules/war/target/temp/lib/rampart-SNAPSHOT.mar>
[INFO] [remote-resources:process {execution: default}]
[HUDSON] Recording test results[INFO] snapshot org.apache.synapse:synapse-samples:2.1.0-SNAPSHOT:
checking for updates from apache-snapshots
[INFO] snapshot org.apache.synapse:synapse-samples:2.1.0-SNAPSHOT: checking for updates from
wso2-m2-snapshots
[INFO] snapshot org.apache.synapse:synapse-samples:2.1.0-SNAPSHOT: checking for updates from
apache.snapshots
[INFO] snapshot org.apache.synapse:synapse-experimental:2.1.0-SNAPSHOT: checking for updates
from apache-snapshots
[INFO] snapshot org.apache.synapse:synapse-experimental:2.1.0-SNAPSHOT: checking for updates
from wso2-m2-snapshots
[INFO] snapshot org.apache.synapse:synapse-experimental:2.1.0-SNAPSHOT: checking for updates
from apache.snapshots
[INFO] [resources:resources {execution: default-resources}]
[INFO] Using encoding: 'UTF-8' to copy filtered resources.
[INFO] [compiler:compile {execution: default-compile}]
[INFO] No sources to compile
[INFO] [dependency:unpack-dependencies {execution: unpack-patches}]
[INFO] Unpacking <https://hudson.apache.org/hudson/job/Synapse%20-%20Trunk/ws/java/modules/patches/target/synapse-patches-2.1.0-SNAPSHOT.jar>
to
  <https://hudson.apache.org/hudson/job/Synapse%20-%20Trunk/ws/java/modules/war/target/classes>
   with includes null and excludes:META-INF/**/*
[INFO] [resources:testResources {execution: default-testResources}]
[INFO] Using encoding: 'UTF-8' to copy filtered resources.
[INFO] [compiler:testCompile {execution: default-testCompile}]
[INFO] No sources to compile
[INFO] [surefire:test {execution: default-test}]
[INFO] Surefire report directory: <https://hudson.apache.org/hudson/job/Synapse%20-%20Trunk/ws/java/modules/war/target/surefire-reports>

-------------------------------------------------------
 T E S T S
-------------------------------------------------------
There are no tests to run.

Results :

Tests run: 0, Failures: 0, Errors: 0, Skipped: 0


[INFO] [war:war {execution: default-war}]
[INFO] Packaging webapp
[INFO] Assembling webapp[synapse-war] in [<https://hudson.apache.org/hudson/job/Synapse%20-%20Trunk/ws/java/modules/war/target/synapse]>
[INFO] Processing war project
[INFO] Copying webapp webResources[<https://hudson.apache.org/hudson/job/Synapse%20-%20Trunk/ws/java/modules/war/../../repository]>
to[<https://hudson.apache.org/hudson/job/Synapse%20-%20Trunk/ws/java/modules/war/target/synapse]>
[INFO] Copying webapp webResources[<https://hudson.apache.org/hudson/job/Synapse%20-%20Trunk/ws/java/modules/war/../core/src/main/resources]>
to[<https://hudson.apache.org/hudson/job/Synapse%20-%20Trunk/ws/java/modules/war/target/synapse]>
[INFO] Copying webapp webResources[<https://hudson.apache.org/hudson/job/Synapse%20-%20Trunk/ws/java/modules/war/target/temp/lib]>
to[<https://hudson.apache.org/hudson/job/Synapse%20-%20Trunk/ws/java/modules/war/target/synapse]>
[INFO] Copying webapp webResources[<https://hudson.apache.org/hudson/job/Synapse%20-%20Trunk/ws/java/modules/war/../distribution/src/main/release/docs]>
to[<https://hudson.apache.org/hudson/job/Synapse%20-%20Trunk/ws/java/modules/war/target/synapse]>
[INFO] Copying webapp webResources[<https://hudson.apache.org/hudson/job/Synapse%20-%20Trunk/ws/java/modules/war/../../src/site/resources]>
to[<https://hudson.apache.org/hudson/job/Synapse%20-%20Trunk/ws/java/modules/war/target/synapse]>
[INFO] Copying webapp webResources[<https://hudson.apache.org/hudson/job/Synapse%20-%20Trunk/ws/java/modules/war/../../repository/conf]>
to[<https://hudson.apache.org/hudson/job/Synapse%20-%20Trunk/ws/java/modules/war/target/synapse]>
[INFO] Copying webapp webResources[<https://hudson.apache.org/hudson/job/Synapse%20-%20Trunk/ws/java/modules/war/../../repository/conf]>
to[<https://hudson.apache.org/hudson/job/Synapse%20-%20Trunk/ws/java/modules/war/target/synapse]>
[INFO] Webapp assembled in[909 msecs]
[INFO] Building war: <https://hudson.apache.org/hudson/job/Synapse%20-%20Trunk/ws/java/target/synapse.war>
[INFO] [install:install {execution: default-install}]
[INFO] Installing target/synapse.war to /home/hudson/.m2/repository/org/apache/synapse/synapse-war/2.1.0-SNAPSHOT/synapse-war-2.1.0-SNAPSHOT.war
[HUDSON] Archiving <https://hudson.apache.org/hudson/job/Synapse%20-%20Trunk/ws/java/modules/war/pom.xml>
to /home/hudson/hudson/jobs/Synapse - Trunk/modules/org.apache.synapse$synapse-war/builds/2011-02-07_00-49-21/archive/org.apache.synapse/synapse-war/2.1.0-SNAPSHOT/pom.xml
[HUDSON] Archiving target/synapse.war to /home/hudson/hudson/jobs/Synapse - Trunk/modules/org.apache.synapse$synapse-war/builds/2011-02-07_00-49-21/archive/org.apache.synapse/synapse-war/2.1.0-SNAPSHOT/synapse.war
Build timed out. Aborting
channel stopped
[INFO] ------------------------------------------------------------------------
[ERROR] FATAL ERROR
[INFO] ------------------------------------------------------------------------
[INFO] null
[INFO] ------------------------------------------------------------------------
[INFO] Trace
java.lang.reflect.UndeclaredThrowableException
	at $Proxy2.isArchivingDisabled(Unknown Source)
	at hudson.maven.MavenBuildProxy$Filter.isArchivingDisabled(MavenBuildProxy.java:224)
	at hudson.maven.reporters.MavenArtifact.archive(MavenArtifact.java:194)
	at hudson.maven.reporters.MavenArtifactArchiver.postBuild(MavenArtifactArchiver.java:107)
	at hudson.maven.MavenModuleSetBuild$Builder.postModule(MavenModuleSetBuild.java:918)
	at hudson.maven.MavenBuilder$Adapter.fireLeaveModule(MavenBuilder.java:353)
	at hudson.maven.MavenBuilder$Adapter.postBuild(MavenBuilder.java:311)
	at org.apache.maven.lifecycle.LifecycleExecutorInterceptor.execute(LifecycleExecutorInterceptor.java:68)
	at org.apache.maven.DefaultMaven.doExecute(DefaultMaven.java:328)
	at org.apache.maven.DefaultMaven.execute(DefaultMaven.java:138)
	at org.apache.maven.cli.MavenCli.main(MavenCli.java:362)
	at sun.reflect.NativeMethodAccessorImpl.invoke0(Native Method)
	at sun.reflect.NativeMethodAccessorImpl.invoke(NativeMethodAccessorImpl.java:39)
	at sun.reflect.DelegatingMethodAccessorImpl.invoke(DelegatingMethodAccessorImpl.java:25)
	at java.lang.reflect.Method.invoke(Method.java:592)
	at org.codehaus.classworlds.Launcher.launchEnhanced(Launcher.java:315)
	at org.codehaus.classworlds.Launcher.launch(Launcher.java:255)
	at hudson.maven.agent.Main.launch(Main.java:173)
	at hudson.maven.MavenBuilder.call(MavenBuilder.java:164)
	at hudson.maven.MavenModuleSetBuild$Builder.call(MavenModuleSetBuild.java:868)
	at hudson.maven.MavenModuleSetBuild$Builder.call(MavenModuleSetBuild.java:799)
	at hudson.remoting.UserRequest.perform(UserRequest.java:114)
	at hudson.remoting.UserRequest.perform(UserRequest.java:48)
	at hudson.remoting.Request$2.run(Request.java:270)
	at java.util.concurrent.Executors$RunnableAdapter.call(Executors.java:417)
	at java.util.concurrent.FutureTask$Sync.innerRun(FutureTask.java:269)
	at java.util.concurrent.FutureTask.run(FutureTask.java:123)
	at java.util.concurrent.ThreadPoolExecutor$Worker.runTask(ThreadPoolExecutor.java:651)
	at java.util.concurrent.ThreadPoolExecutor$Worker.run(ThreadPoolExecutor.java:676)
	at java.lang.Thread.run(Thread.java:595)
Caused by: hudson.remoting.ChannelClosedException: channel is already closed
	at hudson.remoting.Channel.send(Channel.java:466)
	at hudson.remoting.Request.call(Request.java:105)
	at hudson.remoting.Channel.call(Channel.java:629)
	at hudson.remoting.RemoteInvocationHandler.invoke(RemoteInvocationHandler.java:158)
	... 30 more
Caused by: hudson.remoting.Channel$OrderlyShutdown
	at hudson.remoting.Channel$CloseCommand.execute(Channel.java:763)
	at hudson.remoting.Channel$ReaderThread.run(Channel.java:962)
Caused by: Command close created at
	at hudson.remoting.Command.<init>(Command.java:58)
	at hudson.remoting.Command.<init>(Command.java:47)
	at hudson.remoting.Channel$CloseCommand.<init>(Channel.java:759)
	at hudson.remoting.Channel$CloseCommand.<init>(Channel.java:759)
	at hudson.remoting.Channel.close(Channel.java:804)
	at hudson.slaves.Channels$1.close(Channels.java:91)
	at hudson.maven.ProcessCache$MavenProcess.discard(ProcessCache.java:145)
	at hudson.maven.MavenModuleSetBuild$RunnerImpl.doRun(MavenModuleSetBuild.java:651)
	at hudson.model.AbstractBuild$AbstractRunner.run(AbstractBuild.java:420)
	at hudson.model.Run.run(Run.java:1362)
	at hudson.maven.MavenModuleSetBuild.run(MavenModuleSetBuild.java:405)
	at hudson.model.ResourceController.execute(ResourceController.java:88)
	at hudson.model.Executor.run(Executor.java:145)
[INFO] ------------------------------------------------------------------------
[INFO] Total time: 30 minutes 55 seconds
[INFO] Finished at: Mon Feb 07 01:22:43 UTC 2011
[INFO] Final Memory: 61M/186M
[INFO] ------------------------------------------------------------------------
[locks-and-latches] Releasing all the locks
[locks-and-latches] All the locks released


---------------------------------------------------------------------
To unsubscribe, e-mail: dev-unsubscribe@synapse.apache.org
For additional commands, e-mail: dev-help@synapse.apache.org


Mime
View raw message