synapse-dev mailing list archives

Site index · List index
Message view « Date » · « Thread »
Top « Date » · « Thread »
From Apache Hudson Server <hud...@hudson.apache.org>
Subject Build failed in Hudson: Synapse - Trunk #3195
Date Tue, 01 Feb 2011 00:18:12 GMT
See <https://hudson.apache.org/hudson/job/Synapse%20-%20Trunk/3195/>

------------------------------------------
[...truncated 410 lines...]
Downloading: http://dist.wso2.org/snapshots/maven2/org/apache/sandesha2/sandesha2-parent/SNAPSHOT/maven-metadata.xml
Downloading: http://repository.apache.org/snapshots/org/apache/sandesha2/sandesha2-parent/SNAPSHOT/maven-metadata.xml
Downloaded: http://dist.wso2.org/snapshots/maven2/org/apache/sandesha2/sandesha2-parent/SNAPSHOT/maven-metadata.xml
(366 B at 5.5 KB/sec)
Downloaded: http://repository.apache.org/snapshots/org/apache/sandesha2/sandesha2-parent/SNAPSHOT/maven-metadata.xml
(322 B at 2.3 KB/sec)
Downloaded: http://people.apache.org/repo/m2-snapshot-repository/org/apache/sandesha2/sandesha2-parent/SNAPSHOT/maven-metadata.xml
(322 B at 0.8 KB/sec)
Downloading: http://people.apache.org/repo/m2-snapshot-repository/org/apache/axis2/axis2-codegen/SNAPSHOT/maven-metadata.xml
Downloading: http://dist.wso2.org/snapshots/maven2/org/apache/axis2/axis2-codegen/SNAPSHOT/maven-metadata.xml
Downloading: http://repository.apache.org/snapshots/org/apache/axis2/axis2-codegen/SNAPSHOT/maven-metadata.xml
Downloaded: http://dist.wso2.org/snapshots/maven2/org/apache/axis2/axis2-codegen/SNAPSHOT/maven-metadata.xml
(360 B at 4.9 KB/sec)
Downloaded: http://repository.apache.org/snapshots/org/apache/axis2/axis2-codegen/SNAPSHOT/maven-metadata.xml
(360 B at 3.3 KB/sec)
Downloading: http://repository.apache.org/snapshots/org/apache/axis2/axis2-codegen/SNAPSHOT/axis2-codegen-20110131.160056-45.pom
Downloaded: http://repository.apache.org/snapshots/org/apache/axis2/axis2-codegen/SNAPSHOT/axis2-codegen-20110131.160056-45.pom
(10 KB at 76.9 KB/sec)
Downloading: http://people.apache.org/repo/m2-snapshot-repository/org/apache/ws/commons/axiom/axiom-dom/1.2.11-SNAPSHOT/maven-metadata.xml
Downloading: http://dist.wso2.org/snapshots/maven2/org/apache/ws/commons/axiom/axiom-dom/1.2.11-SNAPSHOT/maven-metadata.xml
Downloading: http://repository.apache.org/snapshots/org/apache/ws/commons/axiom/axiom-dom/1.2.11-SNAPSHOT/maven-metadata.xml
Downloaded: http://repository.apache.org/snapshots/org/apache/ws/commons/axiom/axiom-dom/1.2.11-SNAPSHOT/maven-metadata.xml
(329 B at 2.7 KB/sec)
Downloading: http://people.apache.org/repo/m2-snapshot-repository/org/apache/axis2/addressing/SNAPSHOT/maven-metadata.xml
Downloading: http://dist.wso2.org/snapshots/maven2/org/apache/axis2/addressing/SNAPSHOT/maven-metadata.xml
Downloading: http://repository.apache.org/snapshots/org/apache/axis2/addressing/SNAPSHOT/maven-metadata.xml
Downloaded: http://dist.wso2.org/snapshots/maven2/org/apache/axis2/addressing/SNAPSHOT/maven-metadata.xml
(357 B at 5.1 KB/sec)
Downloaded: http://repository.apache.org/snapshots/org/apache/axis2/addressing/SNAPSHOT/maven-metadata.xml
(357 B at 3.3 KB/sec)
Downloading: http://repository.apache.org/snapshots/org/apache/axis2/addressing/SNAPSHOT/addressing-20110131.160227-46.pom
Downloaded: http://repository.apache.org/snapshots/org/apache/axis2/addressing/SNAPSHOT/addressing-20110131.160227-46.pom
(5 KB at 52.8 KB/sec)
Downloading: http://people.apache.org/repo/m2-snapshot-repository/java-cup/java-cup/0.0/java-cup-0.0.pom
Downloading: http://dist.wso2.org/maven2/java-cup/java-cup/0.0/java-cup-0.0.pom
Downloading: http://repo1.maven.org/maven2/java-cup/java-cup/0.0/java-cup-0.0.pom
[WARNING] Missing POM for java-cup:java-cup:jar:0.0
Downloading: http://people.apache.org/repo/m2-snapshot-repository/JLex/JLex/0.0/JLex-0.0.pom
Downloading: http://dist.wso2.org/maven2/JLex/JLex/0.0/JLex-0.0.pom
Downloading: http://repo1.maven.org/maven2/JLex/JLex/0.0/JLex-0.0.pom
[WARNING] Missing POM for JLex:JLex:jar:0.0
Downloading: http://people.apache.org/repo/m2-snapshot-repository/net/sf/saxon/saxon/8.9/saxon-8.9.pom
Downloading: http://dist.wso2.org/maven2/net/sf/saxon/saxon/8.9/saxon-8.9.pom
Downloading: http://repo1.maven.org/maven2/net/sf/saxon/saxon/8.9/saxon-8.9.pom
[WARNING] Missing POM for net.sf.saxon:saxon:jar:8.9
Downloading: http://people.apache.org/repo/m2-snapshot-repository/net/sf/saxon/saxon-dom/8.9/saxon-dom-8.9.pom
Downloading: http://dist.wso2.org/maven2/net/sf/saxon/saxon-dom/8.9/saxon-dom-8.9.pom
Downloading: http://repo1.maven.org/maven2/net/sf/saxon/saxon-dom/8.9/saxon-dom-8.9.pom
[WARNING] Missing POM for net.sf.saxon:saxon-dom:jar:8.9
Downloading: http://people.apache.org/repo/m2-snapshot-repository/net/sf/saxon/saxon-xqj/8.9/saxon-xqj-8.9.pom
Downloading: http://dist.wso2.org/maven2/net/sf/saxon/saxon-xqj/8.9/saxon-xqj-8.9.pom
Downloading: http://repo1.maven.org/maven2/net/sf/saxon/saxon-xqj/8.9/saxon-xqj-8.9.pom
[WARNING] Missing POM for net.sf.saxon:saxon-xqj:jar:8.9
Downloading: http://snapshots.maven.codehaus.org/maven2/org/apache/axis2/axis2-kernel/SNAPSHOT/maven-metadata.xml
Downloading: http://dist.wso2.org/maven2/org/apache/axis2/axis2-kernel/SNAPSHOT/maven-metadata.xml
[WARNING] Could not transfer metadata org.apache.axis2:axis2-kernel:SNAPSHOT/maven-metadata.xml
from/to wso2-maven2-repository-snapshot (http://dist.wso2.org/snapshots/maven2): No connector
available to access repository wso2-maven2-repository-snapshot (http://dist.wso2.org/snapshots/maven2)
of type legacy using the available factories WagonRepositoryConnectorFactory
[WARNING] Could not transfer metadata org.apache.axis2:axis2-kernel:SNAPSHOT/maven-metadata.xml
from/to apache-zones (http://ws.zones.apache.org/repository): No connector available to access
repository apache-zones (http://ws.zones.apache.org/repository) of type legacy using the available
factories WagonRepositoryConnectorFactory
Downloading: http://snapshots.maven.codehaus.org/maven2/org/apache/axis2/axis2-parent/SNAPSHOT/maven-metadata.xml
Downloading: http://dist.wso2.org/maven2/org/apache/axis2/axis2-parent/SNAPSHOT/maven-metadata.xml
[WARNING] Could not transfer metadata org.apache.axis2:axis2-parent:SNAPSHOT/maven-metadata.xml
from/to wso2-maven2-repository-snapshot (http://dist.wso2.org/snapshots/maven2): No connector
available to access repository wso2-maven2-repository-snapshot (http://dist.wso2.org/snapshots/maven2)
of type legacy using the available factories WagonRepositoryConnectorFactory
[WARNING] Could not transfer metadata org.apache.axis2:axis2-parent:SNAPSHOT/maven-metadata.xml
from/to apache-zones (http://ws.zones.apache.org/repository): No connector available to access
repository apache-zones (http://ws.zones.apache.org/repository) of type legacy using the available
factories WagonRepositoryConnectorFactory
Downloading: http://people.apache.org/repo/m2-snapshot-repository/org/apache/axis2/axis2-saaj/SNAPSHOT/maven-metadata.xml
Downloading: http://dist.wso2.org/snapshots/maven2/org/apache/axis2/axis2-saaj/SNAPSHOT/maven-metadata.xml
Downloading: http://repository.apache.org/snapshots/org/apache/axis2/axis2-saaj/SNAPSHOT/maven-metadata.xml
Downloading: http://snapshots.maven.codehaus.org/maven2/org/apache/axis2/axis2-saaj/SNAPSHOT/maven-metadata.xml
Downloading: http://dist.wso2.org/maven2/org/apache/axis2/axis2-saaj/SNAPSHOT/maven-metadata.xml
Downloaded: http://dist.wso2.org/snapshots/maven2/org/apache/axis2/axis2-saaj/SNAPSHOT/maven-metadata.xml
(357 B at 4.9 KB/sec)
Downloaded: http://repository.apache.org/snapshots/org/apache/axis2/axis2-saaj/SNAPSHOT/maven-metadata.xml
(357 B at 2.9 KB/sec)
[WARNING] Could not transfer metadata org.apache.axis2:axis2-saaj:SNAPSHOT/maven-metadata.xml
from/to wso2-maven2-repository-snapshot (http://dist.wso2.org/snapshots/maven2): No connector
available to access repository wso2-maven2-repository-snapshot (http://dist.wso2.org/snapshots/maven2)
of type legacy using the available factories WagonRepositoryConnectorFactory
[WARNING] Could not transfer metadata org.apache.axis2:axis2-saaj:SNAPSHOT/maven-metadata.xml
from/to apache-zones (http://ws.zones.apache.org/repository): No connector available to access
repository apache-zones (http://ws.zones.apache.org/repository) of type legacy using the available
factories WagonRepositoryConnectorFactory
Downloading: http://repository.apache.org/snapshots/org/apache/axis2/axis2-saaj/SNAPSHOT/axis2-saaj-20110131.160852-45.pom
Downloaded: http://repository.apache.org/snapshots/org/apache/axis2/axis2-saaj/SNAPSHOT/axis2-saaj-20110131.160852-45.pom
(7 KB at 57.6 KB/sec)
Downloading: http://snapshots.maven.codehaus.org/maven2/org/apache/ws/commons/axiom/axiom-dom/1.2.11-SNAPSHOT/maven-metadata.xml
Downloading: http://dist.wso2.org/maven2/org/apache/ws/commons/axiom/axiom-dom/1.2.11-SNAPSHOT/maven-metadata.xml
[WARNING] Could not transfer metadata org.apache.ws.commons.axiom:axiom-dom:1.2.11-SNAPSHOT/maven-metadata.xml
from/to wso2-maven2-repository-snapshot (http://dist.wso2.org/snapshots/maven2): No connector
available to access repository wso2-maven2-repository-snapshot (http://dist.wso2.org/snapshots/maven2)
of type legacy using the available factories WagonRepositoryConnectorFactory
[WARNING] Could not transfer metadata org.apache.ws.commons.axiom:axiom-dom:1.2.11-SNAPSHOT/maven-metadata.xml
from/to apache-zones (http://ws.zones.apache.org/repository): No connector available to access
repository apache-zones (http://ws.zones.apache.org/repository) of type legacy using the available
factories WagonRepositoryConnectorFactory
Downloading: http://snapshots.maven.codehaus.org/maven2/org/apache/ws/commons/axiom/axiom-parent/1.2.11-SNAPSHOT/maven-metadata.xml
Downloading: http://dist.wso2.org/maven2/org/apache/ws/commons/axiom/axiom-parent/1.2.11-SNAPSHOT/maven-metadata.xml
[WARNING] Could not transfer metadata org.apache.ws.commons.axiom:axiom-parent:1.2.11-SNAPSHOT/maven-metadata.xml
from/to wso2-maven2-repository-snapshot (http://dist.wso2.org/snapshots/maven2): No connector
available to access repository wso2-maven2-repository-snapshot (http://dist.wso2.org/snapshots/maven2)
of type legacy using the available factories WagonRepositoryConnectorFactory
[WARNING] Could not transfer metadata org.apache.ws.commons.axiom:axiom-parent:1.2.11-SNAPSHOT/maven-metadata.xml
from/to apache-zones (http://ws.zones.apache.org/repository): No connector available to access
repository apache-zones (http://ws.zones.apache.org/repository) of type legacy using the available
factories WagonRepositoryConnectorFactory
Downloading: http://snapshots.maven.codehaus.org/maven2/org/apache/axis2/axis2-clustering/SNAPSHOT/maven-metadata.xml
Downloading: http://dist.wso2.org/maven2/org/apache/axis2/axis2-clustering/SNAPSHOT/maven-metadata.xml
[WARNING] Could not transfer metadata org.apache.axis2:axis2-clustering:SNAPSHOT/maven-metadata.xml
from/to wso2-maven2-repository-snapshot (http://dist.wso2.org/snapshots/maven2): No connector
available to access repository wso2-maven2-repository-snapshot (http://dist.wso2.org/snapshots/maven2)
of type legacy using the available factories WagonRepositoryConnectorFactory
[WARNING] Could not transfer metadata org.apache.axis2:axis2-clustering:SNAPSHOT/maven-metadata.xml
from/to apache-zones (http://ws.zones.apache.org/repository): No connector available to access
repository apache-zones (http://ws.zones.apache.org/repository) of type legacy using the available
factories WagonRepositoryConnectorFactory
Downloading: http://dist.wso2.org/maven2/org/apache/ws/commons/axiom/axiom-impl/1.2.11-SNAPSHOT/maven-metadata.xml
Downloading: http://snapshots.maven.codehaus.org/maven2/org/apache/ws/commons/axiom/axiom-impl/1.2.11-SNAPSHOT/maven-metadata.xml
[WARNING] Could not transfer metadata org.apache.ws.commons.axiom:axiom-impl:1.2.11-SNAPSHOT/maven-metadata.xml
from/to wso2-maven2-repository-snapshot (http://dist.wso2.org/snapshots/maven2): No connector
available to access repository wso2-maven2-repository-snapshot (http://dist.wso2.org/snapshots/maven2)
of type legacy using the available factories WagonRepositoryConnectorFactory
[WARNING] Could not transfer metadata org.apache.ws.commons.axiom:axiom-impl:1.2.11-SNAPSHOT/maven-metadata.xml
from/to apache-zones (http://ws.zones.apache.org/repository): No connector available to access
repository apache-zones (http://ws.zones.apache.org/repository) of type legacy using the available
factories WagonRepositoryConnectorFactory
Downloading: http://dist.wso2.org/maven2/org/apache/ws/commons/axiom/axiom-api/1.2.11-SNAPSHOT/maven-metadata.xml
Downloading: http://snapshots.maven.codehaus.org/maven2/org/apache/ws/commons/axiom/axiom-api/1.2.11-SNAPSHOT/maven-metadata.xml
[WARNING] Could not transfer metadata org.apache.ws.commons.axiom:axiom-api:1.2.11-SNAPSHOT/maven-metadata.xml
from/to wso2-maven2-repository-snapshot (http://dist.wso2.org/snapshots/maven2): No connector
available to access repository wso2-maven2-repository-snapshot (http://dist.wso2.org/snapshots/maven2)
of type legacy using the available factories WagonRepositoryConnectorFactory
[WARNING] Could not transfer metadata org.apache.ws.commons.axiom:axiom-api:1.2.11-SNAPSHOT/maven-metadata.xml
from/to apache-zones (http://ws.zones.apache.org/repository): No connector available to access
repository apache-zones (http://ws.zones.apache.org/repository) of type legacy using the available
factories WagonRepositoryConnectorFactory
Downloading: http://people.apache.org/repo/m2-snapshot-repository/org/wso2/eventing/wso2eventing-api/SNAPSHOT/maven-metadata.xml
Downloading: http://dist.wso2.org/snapshots/maven2/org/wso2/eventing/wso2eventing-api/SNAPSHOT/maven-metadata.xml
Downloading: http://repository.apache.org/snapshots/org/wso2/eventing/wso2eventing-api/SNAPSHOT/maven-metadata.xml
Downloaded: http://dist.wso2.org/snapshots/maven2/org/wso2/eventing/wso2eventing-api/SNAPSHOT/maven-metadata.xml
(364 B at 5.4 KB/sec)
Downloading: http://people.apache.org/repo/m2-snapshot-repository/org/wso2/eventing/wso2eventing-parent/SNAPSHOT/maven-metadata.xml
Downloading: http://repository.apache.org/snapshots/org/wso2/eventing/wso2eventing-parent/SNAPSHOT/maven-metadata.xml
Downloading: http://dist.wso2.org/snapshots/maven2/org/wso2/eventing/wso2eventing-parent/SNAPSHOT/maven-metadata.xml
Downloaded: http://dist.wso2.org/snapshots/maven2/org/wso2/eventing/wso2eventing-parent/SNAPSHOT/maven-metadata.xml
(367 B at 5.6 KB/sec)
Downloading: http://repository.apache.org/snapshots/org/apache/axis2/axis2-kernel/SNAPSHOT/axis2-kernel-20110131.155841-49.jar
Downloading: http://repository.apache.org/snapshots/org/apache/axis2/axis2-transport-local/SNAPSHOT/axis2-transport-local-20110131.160004-50.jar
Downloading: http://repository.apache.org/snapshots/org/apache/axis2/axis2-adb/SNAPSHOT/axis2-adb-20110131.155932-49.jar
Downloading: http://repository.apache.org/snapshots/org/apache/axis2/axis2-clustering/SNAPSHOT/axis2-clustering-20110131.160720-45.jar
Downloading: http://repository.apache.org/snapshots/org/apache/axis2/axis2-mtompolicy/SNAPSHOT/axis2-mtompolicy-20110131.163352-42.jar
Downloaded: http://repository.apache.org/snapshots/org/apache/axis2/axis2-transport-local/SNAPSHOT/axis2-transport-local-20110131.160004-50.jar
(16 KB at 83.3 KB/sec)
Downloading: http://repository.apache.org/snapshots/org/apache/axis2/axis2-codegen/SNAPSHOT/axis2-codegen-20110131.160056-45.jar
Downloaded: http://repository.apache.org/snapshots/org/apache/axis2/axis2-mtompolicy/SNAPSHOT/axis2-mtompolicy-20110131.163352-42.jar
(14 KB at 57.4 KB/sec)
Downloading: http://repository.apache.org/snapshots/org/apache/axis2/addressing/SNAPSHOT/addressing-20110131.160227-46.mar
Downloaded: http://repository.apache.org/snapshots/org/apache/axis2/axis2-clustering/SNAPSHOT/axis2-clustering-20110131.160720-45.jar
(95 KB at 374.0 KB/sec)
Downloading: http://repository.apache.org/snapshots/org/apache/axis2/axis2-saaj/SNAPSHOT/axis2-saaj-20110131.160852-45.jar
Downloaded: http://repository.apache.org/snapshots/org/apache/axis2/addressing/SNAPSHOT/addressing-20110131.160227-46.mar
(30 KB at 246.0 KB/sec)
Downloaded: http://repository.apache.org/snapshots/org/apache/axis2/axis2-saaj/SNAPSHOT/axis2-saaj-20110131.160852-45.jar
(88 KB at 612.9 KB/sec)
Downloaded: http://repository.apache.org/snapshots/org/apache/axis2/axis2-codegen/SNAPSHOT/axis2-codegen-20110131.160056-45.jar
(249 KB at 750.3 KB/sec)
Downloaded: http://repository.apache.org/snapshots/org/apache/axis2/axis2-adb/SNAPSHOT/axis2-adb-20110131.155932-49.jar
(673 KB at 1170.4 KB/sec)
Downloaded: http://repository.apache.org/snapshots/org/apache/axis2/axis2-kernel/SNAPSHOT/axis2-kernel-20110131.155841-49.jar
(1016 KB at 978.5 KB/sec)
Downloading: http://people.apache.org/repo/m2-snapshot-repository/net/sf/saxon/saxon-dom/8.9/saxon-dom-8.9.pom
Downloading: http://dist.wso2.org/maven2/net/sf/saxon/saxon-dom/8.9/saxon-dom-8.9.pom
Downloading: http://repo1.maven.org/maven2/net/sf/saxon/saxon-dom/8.9/saxon-dom-8.9.pom
Downloading: http://people.apache.org/repo/m2-snapshot-repository/net/sf/saxon/saxon-xqj/8.9/saxon-xqj-8.9.pom
Downloading: http://dist.wso2.org/maven2/net/sf/saxon/saxon-xqj/8.9/saxon-xqj-8.9.pom
Downloading: http://repo1.maven.org/maven2/net/sf/saxon/saxon-xqj/8.9/saxon-xqj-8.9.pom
Downloading: http://people.apache.org/repo/m2-snapshot-repository/JLex/JLex/0.0/JLex-0.0.pom
Downloading: http://dist.wso2.org/maven2/JLex/JLex/0.0/JLex-0.0.pom
Downloading: http://repo1.maven.org/maven2/JLex/JLex/0.0/JLex-0.0.pom
Downloading: http://people.apache.org/repo/m2-snapshot-repository/net/sf/saxon/saxon/8.9/saxon-8.9.pom
Downloading: http://dist.wso2.org/maven2/net/sf/saxon/saxon/8.9/saxon-8.9.pom
Downloading: http://repo1.maven.org/maven2/net/sf/saxon/saxon/8.9/saxon-8.9.pom
Downloading: http://people.apache.org/repo/m2-snapshot-repository/java-cup/java-cup/0.0/java-cup-0.0.pom
Downloading: http://dist.wso2.org/maven2/java-cup/java-cup/0.0/java-cup-0.0.pom
Downloading: http://repo1.maven.org/maven2/java-cup/java-cup/0.0/java-cup-0.0.pom
[INFO] [INFO] Installing <https://hudson.apache.org/hudson/job/Synapse%20-%20Trunk/ws/java/pom.xml>
to /home/hudson/.m2/repository/org/apache/synapse/Apache-Synapse/2.1.0-SNAPSHOT/Apache-Synapse-2.1.0-SNAPSHOT.pom

[INFO] --- maven-install-plugin:2.3:install (default-install) @ Apache-Synapse ---
projectSucceeded org.apache.synapse:Apache-Synapse:2.1.0-SNAPSHOT
[HUDSON] Archiving <https://hudson.apache.org/hudson/job/Synapse%20-%20Trunk/ws/java/pom.xml>
to /home/hudson/hudson/jobs/Synapse - Trunk/modules/org.apache.synapse$Apache-Synapse/builds/2011-02-01_00-17-21/archive/org.apache.synapse/Apache-Synapse/2.1.0-SNAPSHOT/pom.xml
[INFO]                                                                         
[INFO] ------------------------------------------------------------------------
Downloading: http://people.apache.org/repo/m2-snapshot-repository/org/apache/axis2/axis2-transport-base/1.1.0-SNAPSHOT/maven-metadata.xml
Downloading: http://repository.apache.org/snapshots/org/apache/axis2/axis2-transport-base/1.1.0-SNAPSHOT/maven-metadata.xml
Downloading: http://dist.wso2.org/snapshots/maven2/org/apache/axis2/axis2-transport-base/1.1.0-SNAPSHOT/maven-metadata.xml
[INFO] Building Apache Synapse - Commons classes 2.1.0-SNAPSHOT
[INFO] ------------------------------------------------------------------------
Downloaded: http://dist.wso2.org/snapshots/maven2/org/apache/axis2/axis2-transport-base/1.1.0-SNAPSHOT/maven-metadata.xml
(372 B at 4.4 KB/sec)
Downloaded: http://repository.apache.org/snapshots/org/apache/axis2/axis2-transport-base/1.1.0-SNAPSHOT/maven-metadata.xml
(373 B at 2.5 KB/sec)
Downloading: http://people.apache.org/repo/m2-snapshot-repository/org/apache/axis2/axis2-transport-base/1.1.0-SNAPSHOT/axis2-transport-base-1.1.0-20110131.184828-52.pom
Downloading: http://dist.wso2.org/snapshots/maven2/org/apache/axis2/axis2-transport-base/1.1.0-SNAPSHOT/axis2-transport-base-1.1.0-20110131.184828-52.pom
Downloading: http://repository.apache.org/snapshots/org/apache/axis2/axis2-transport-base/1.1.0-SNAPSHOT/axis2-transport-base-1.1.0-20110131.184828-52.pom
[WARNING] The POM for org.apache.axis2:axis2-transport-base:jar:1.1.0-20110131.184828-52 is
missing, no dependency information available
Downloading: http://people.apache.org/repo/m2-snapshot-repository/java-cup/java-cup/0.0/java-cup-0.0.pom
Downloading: http://dist.wso2.org/maven2/java-cup/java-cup/0.0/java-cup-0.0.pom
Downloading: http://repo1.maven.org/maven2/java-cup/java-cup/0.0/java-cup-0.0.pom
[WARNING] The POM for java-cup:java-cup:jar:0.0 is missing, no dependency information available
Downloading: http://people.apache.org/repo/m2-snapshot-repository/JLex/JLex/0.0/JLex-0.0.pom
Downloading: http://dist.wso2.org/maven2/JLex/JLex/0.0/JLex-0.0.pom
Downloading: http://repo1.maven.org/maven2/JLex/JLex/0.0/JLex-0.0.pom
[WARNING] The POM for JLex:JLex:jar:0.0 is missing, no dependency information available
Downloading: http://people.apache.org/repo/m2-snapshot-repository/net/sf/saxon/saxon/8.9/saxon-8.9.pom
Downloading: http://dist.wso2.org/maven2/net/sf/saxon/saxon/8.9/saxon-8.9.pom
Downloading: http://repo1.maven.org/maven2/net/sf/saxon/saxon/8.9/saxon-8.9.pom
[WARNING] The POM for net.sf.saxon:saxon:jar:8.9 is missing, no dependency information available
Downloading: http://people.apache.org/repo/m2-snapshot-repository/net/sf/saxon/saxon-dom/8.9/saxon-dom-8.9.pom
Downloading: http://dist.wso2.org/maven2/net/sf/saxon/saxon-dom/8.9/saxon-dom-8.9.pom
Downloading: http://repo1.maven.org/maven2/net/sf/saxon/saxon-dom/8.9/saxon-dom-8.9.pom
[WARNING] The POM for net.sf.saxon:saxon-dom:jar:8.9 is missing, no dependency information
available
Downloading: http://people.apache.org/repo/m2-snapshot-repository/net/sf/saxon/saxon-xqj/8.9/saxon-xqj-8.9.pom
Downloading: http://dist.wso2.org/maven2/net/sf/saxon/saxon-xqj/8.9/saxon-xqj-8.9.pom
Downloading: http://repo1.maven.org/maven2/net/sf/saxon/saxon-xqj/8.9/saxon-xqj-8.9.pom
[WARNING] The POM for net.sf.saxon:saxon-xqj:jar:8.9 is missing, no dependency information
available
Downloading: http://repository.apache.org/snapshots/org/apache/axis2/axis2-transport-base/1.1.0-SNAPSHOT/axis2-transport-base-1.1.0-20110131.184828-52.jar
projectFailed org.apache.synapse:synapse-commons:2.1.0-SNAPSHOT
[HUDSON] Archiving <https://hudson.apache.org/hudson/job/Synapse%20-%20Trunk/ws/java/modules/commons/pom.xml>
to /home/hudson/hudson/jobs/Synapse - Trunk/modules/org.apache.synapse$synapse-commons/builds/2011-02-01_00-17-21/archive/org.apache.synapse/synapse-commons/2.1.0-SNAPSHOT/pom.xml
sessionEnded
[INFO] ------------------------------------------------------------------------
[INFO] Reactor Summary:
[INFO] 
[INFO] Apache Synapse - Secure vault ..................... SUCCESS [11.487s]
[INFO] Apache Synapse .................................... SUCCESS [15.410s]
[INFO] Apache Synapse - Commons classes .................. FAILURE [2.577s]
[INFO] Apache Synapse - Transports ....................... SKIPPED
[INFO] Apache Synapse - Non-blocking HTTP/s Transport .... SKIPPED
[INFO] Apache Synapse - PIPE Transport ................... SKIPPED
[INFO] Apache Synapse - VFS Transport .................... SKIPPED
[INFO] Apache Synapse - Tasks classes .................... SKIPPED
[INFO] Apache Synapse - Core ............................. SKIPPED
[INFO] Apache Synapse - FIX Transport .................... SKIPPED
[INFO] Apache Synapse - Extensions ....................... SKIPPED
[INFO] Apache Synapse - Samples .......................... SKIPPED
[INFO] Apache Synapse - Patches .......................... SKIPPED
[INFO] Apache Synapse - Experimental code ................ SKIPPED
[INFO] Apache Synapse - Web Application .................. SKIPPED
[INFO] Apache Synapse - Handler Module ................... SKIPPED
[INFO] Apache Synapse - XAR Maven Plugin ................. SKIPPED
[INFO] Apache Synapse - Configuration Migrator ........... SKIPPED
[INFO] Apache Synapse - Distribution ..................... SKIPPED
[INFO] Apache Synapse - Package skeleton ZIP ............. SKIPPED
[INFO] Apache Synapse - Package archetype ................ SKIPPED
[INFO] ------------------------------------------------------------------------
[INFO] BUILD FAILURE
[INFO] ------------------------------------------------------------------------
[INFO] Total time: 35.695s
[INFO] Finished at: Tue Feb 01 00:18:25 UTC 2011
[INFO] Final Memory: 22M/186M
[INFO] ------------------------------------------------------------------------
mavenExecutionResult exceptions not empty
org.apache.maven.lifecycle.LifecycleExecutionException: Failed to execute goal on project
synapse-commons: Could not resolve dependencies for project org.apache.synapse:synapse-commons:bundle:2.1.0-SNAPSHOT:
Could not find artifact org.apache.axis2:axis2-transport-base:jar:1.1.0-20110131.184828-52
in Nexus (http://repository.apache.org/snapshots)
	at org.apache.maven.lifecycle.internal.LifecycleDependencyResolver.getDependencies(LifecycleDependencyResolver.java:190)
	at org.apache.maven.lifecycle.internal.LifecycleDependencyResolver.resolveProjectDependencies(LifecycleDependencyResolver.java:104)
	at org.apache.maven.lifecycle.internal.MojoExecutor.ensureDependenciesAreResolved(MojoExecutor.java:258)
	at org.apache.maven.lifecycle.internal.MojoExecutor.execute(MojoExecutor.java:201)
	at org.apache.maven.lifecycle.internal.MojoExecutor.execute(MojoExecutor.java:153)
	at org.apache.maven.lifecycle.internal.MojoExecutor.execute(MojoExecutor.java:145)
	at org.apache.maven.lifecycle.internal.LifecycleModuleBuilder.buildProject(LifecycleModuleBuilder.java:84)
	at org.apache.maven.lifecycle.internal.LifecycleModuleBuilder.buildProject(LifecycleModuleBuilder.java:59)
	at org.apache.maven.lifecycle.internal.LifecycleStarter.singleThreadedBuild(LifecycleStarter.java:183)
	at org.apache.maven.lifecycle.internal.LifecycleStarter.execute(LifecycleStarter.java:161)
	at org.apache.maven.DefaultMaven.doExecute(DefaultMaven.java:319)
	at org.apache.maven.DefaultMaven.execute(DefaultMaven.java:156)
	at org.jvnet.hudson.maven3.launcher.Maven3Launcher.main(Maven3Launcher.java:79)
	at sun.reflect.NativeMethodAccessorImpl.invoke0(Native Method)
	at sun.reflect.NativeMethodAccessorImpl.invoke(NativeMethodAccessorImpl.java:39)
	at sun.reflect.DelegatingMethodAccessorImpl.invoke(DelegatingMethodAccessorImpl.java:25)
	at java.lang.reflect.Method.invoke(Method.java:592)
	at org.codehaus.plexus.classworlds.launcher.Launcher.launchStandard(Launcher.java:329)
	at org.codehaus.plexus.classworlds.launcher.Launcher.launch(Launcher.java:239)
	at org.jvnet.hudson.maven3.agent.Maven3Main.launch(Maven3Main.java:145)
	at hudson.maven.Maven3Builder.call(Maven3Builder.java:124)
	at hudson.maven.Maven3Builder.call(Maven3Builder.java:71)
	at hudson.remoting.UserRequest.perform(UserRequest.java:114)
	at hudson.remoting.UserRequest.perform(UserRequest.java:48)
	at hudson.remoting.Request$2.run(Request.java:270)
	at java.util.concurrent.Executors$RunnableAdapter.call(Executors.java:417)
	at java.util.concurrent.FutureTask$Sync.innerRun(FutureTask.java:269)
	at java.util.concurrent.FutureTask.run(FutureTask.java:123)
	at java.util.concurrent.ThreadPoolExecutor$Worker.runTask(ThreadPoolExecutor.java:651)
	at java.util.concurrent.ThreadPoolExecutor$Worker.run(ThreadPoolExecutor.java:676)
	at java.lang.Thread.run(Thread.java:595)
Caused by: org.apache.maven.project.DependencyResolutionException: Could not resolve dependencies
for project org.apache.synapse:synapse-commons:bundle:2.1.0-SNAPSHOT: Could not find artifact
org.apache.axis2:axis2-transport-base:jar:1.1.0-20110131.184828-52 in Nexus (http://repository.apache.org/snapshots)
	at org.apache.maven.project.DefaultProjectDependenciesResolver.resolve(DefaultProjectDependenciesResolver.java:156)
	at org.apache.maven.lifecycle.internal.LifecycleDependencyResolver.getDependencies(LifecycleDependencyResolver.java:165)
	... 30 more
Caused by: org.sonatype.aether.resolution.ArtifactResolutionException: Could not find artifact
org.apache.axis2:axis2-transport-base:jar:1.1.0-20110131.184828-52 in Nexus (http://repository.apache.org/snapshots)
	at org.sonatype.aether.impl.internal.DefaultArtifactResolver.resolveArtifacts(DefaultArtifactResolver.java:526)
	at org.sonatype.aether.impl.internal.DefaultRepositorySystem.resolveArtifacts(DefaultRepositorySystem.java:304)
	at org.sonatype.aether.impl.internal.DefaultRepositorySystem.resolveDependencies(DefaultRepositorySystem.java:334)
	at org.apache.maven.project.DefaultProjectDependenciesResolver.resolve(DefaultProjectDependenciesResolver.java:150)
	... 31 more
Caused by: org.sonatype.aether.transfer.ArtifactNotFoundException: Could not find artifact
org.apache.axis2:axis2-transport-base:jar:1.1.0-20110131.184828-52 in Nexus (http://repository.apache.org/snapshots)
	at org.sonatype.aether.connector.wagon.WagonRepositoryConnector$4.wrap(WagonRepositoryConnector.java:945)
	at org.sonatype.aether.connector.wagon.WagonRepositoryConnector$4.wrap(WagonRepositoryConnector.java:940)
	at org.sonatype.aether.connector.wagon.WagonRepositoryConnector$GetTask.flush(WagonRepositoryConnector.java:696)
	at org.sonatype.aether.connector.wagon.WagonRepositoryConnector$GetTask.flush(WagonRepositoryConnector.java:690)
	at org.sonatype.aether.connector.wagon.WagonRepositoryConnector.get(WagonRepositoryConnector.java:435)
	at org.sonatype.aether.impl.internal.DefaultArtifactResolver.resolveArtifacts(DefaultArtifactResolver.java:438)
	... 34 more
Sending e-mails to: dev@synapse.apache.org
channel stopped
[locks-and-latches] Releasing all the locks
[locks-and-latches] All the locks released


---------------------------------------------------------------------
To unsubscribe, e-mail: dev-unsubscribe@synapse.apache.org
For additional commands, e-mail: dev-help@synapse.apache.org


Mime
View raw message