synapse-dev mailing list archives

Site index · List index
Message view « Date » · « Thread »
Top « Date » · « Thread »
From Apache Hudson Server <hud...@hudson.apache.org>
Subject Build failed in Hudson: Synapse - Trunk #3096
Date Wed, 05 Jan 2011 20:03:34 GMT
See <https://hudson.apache.org/hudson/job/Synapse%20-%20Trunk/3096/>

------------------------------------------
[...truncated 2219 lines...]
[INFO] [bundle:bundle {execution: default-bundle}]
[WARNING] Warning building bundle org.apache.synapse:synapse-config-migrator:bundle:2.1.0-SNAPSHOT
: Did not find matching referal for !javax.xml.namespace
[WARNING] Warning building bundle org.apache.synapse:synapse-config-migrator:bundle:2.1.0-SNAPSHOT
: Importing packages that are never refered to by any class on the Bundle-Classpath[Jar:dot]:
[javax.xml.namespace]
[INFO] [install:install {execution: default-install}]
[INFO] Installing <https://hudson.apache.org/hudson/job/Synapse%20-%20Trunk/ws/java/modules/migrator/target/synapse-config-migrator-2.1.0-SNAPSHOT.jar>
to /home/hudson/.m2/repository/org/apache/synapse/synapse-config-migrator/2.1.0-SNAPSHOT/synapse-config-migrator-2.1.0-SNAPSHOT.jar
[INFO] [bundle:install {execution: default-install}]
[INFO] Parsing file:/home/hudson/.m2/repository/repository.xml
[Fatal Error] :-1:-1: Premature end of file.
org.xml.sax.SAXParseException: Premature end of file.
	at com.sun.org.apache.xerces.internal.parsers.DOMParser.parse(DOMParser.java:264)
	at com.sun.org.apache.xerces.internal.jaxp.DocumentBuilderImpl.parse(DocumentBuilderImpl.java:292)
	at javax.xml.parsers.DocumentBuilder.parse(DocumentBuilder.java:172)
	at org.apache.felix.obrplugin.ObrUpdate.parseFile(ObrUpdate.java:347)
	at org.apache.felix.obrplugin.ObrUpdate.parseRepositoryXml(ObrUpdate.java:324)
	at org.apache.felix.obrplugin.ObrInstall.execute(ObrInstall.java:136)
	at org.apache.maven.plugin.DefaultPluginManager.executeMojo(DefaultPluginManager.java:490)
	at hudson.maven.agent.PluginManagerInterceptor.executeMojo(PluginManagerInterceptor.java:182)
	at org.apache.maven.lifecycle.DefaultLifecycleExecutor.executeGoals(DefaultLifecycleExecutor.java:694)
	at org.apache.maven.lifecycle.DefaultLifecycleExecutor.executeGoalWithLifecycle(DefaultLifecycleExecutor.java:556)
	at org.apache.maven.lifecycle.DefaultLifecycleExecutor.executeGoal(DefaultLifecycleExecutor.java:535)
	at org.apache.maven.lifecycle.DefaultLifecycleExecutor.executeGoalAndHandleFailures(DefaultLifecycleExecutor.java:387)
	at org.apache.maven.lifecycle.DefaultLifecycleExecutor.executeTaskSegments(DefaultLifecycleExecutor.java:348)
	at org.apache.maven.lifecycle.DefaultLifecycleExecutor.execute(DefaultLifecycleExecutor.java:180)
	at org.apache.maven.lifecycle.LifecycleExecutorInterceptor.execute(LifecycleExecutorInterceptor.java:65)
	at org.apache.maven.DefaultMaven.doExecute(DefaultMaven.java:328)
	at org.apache.maven.DefaultMaven.execute(DefaultMaven.java:138)
	at org.apache.maven.cli.MavenCli.main(MavenCli.java:362)
	at sun.reflect.NativeMethodAccessorImpl.invoke0(Native Method)
	at sun.reflect.NativeMethodAccessorImpl.invoke(NativeMethodAccessorImpl.java:39)
	at sun.reflect.DelegatingMethodAccessorImpl.invoke(DelegatingMethodAccessorImpl.java:25)
	at java.lang.reflect.Method.invoke(Method.java:592)
	at org.codehaus.classworlds.Launcher.launchEnhanced(Launcher.java:315)
	at org.codehaus.classworlds.Launcher.launch(Launcher.java:255)
	at hudson.maven.agent.Main.launch(Main.java:165)
	at hudson.maven.MavenBuilder.call(MavenBuilder.java:165)
	at hudson.maven.MavenModuleSetBuild$Builder.call(MavenModuleSetBuild.java:750)
	at hudson.maven.MavenModuleSetBuild$Builder.call(MavenModuleSetBuild.java:694)
	at hudson.remoting.UserRequest.perform(UserRequest.java:114)
	at hudson.remoting.UserRequest.perform(UserRequest.java:48)
	at hudson.remoting.Request$2.run(Request.java:270)
	at java.util.concurrent.Executors$RunnableAdapter.call(Executors.java:417)
	at java.util.concurrent.FutureTask$Sync.innerRun(FutureTask.java:269)
	at java.util.concurrent.FutureTask.run(FutureTask.java:123)
	at java.util.concurrent.ThreadPoolExecutor$Worker.runTask(ThreadPoolExecutor.java:651)
	at java.util.concurrent.ThreadPoolExecutor$Worker.run(ThreadPoolExecutor.java:676)
	at java.lang.Thread.run(Thread.java:595)
[INFO] Writing OBR metadata
[WARNING] Exception while updating local OBR: null
java.lang.NullPointerException
	at org.apache.felix.obrplugin.ObrUpdate.writeRepositoryXml(ObrUpdate.java:268)
	at org.apache.felix.obrplugin.ObrInstall.execute(ObrInstall.java:144)
	at org.apache.maven.plugin.DefaultPluginManager.executeMojo(DefaultPluginManager.java:490)
	at hudson.maven.agent.PluginManagerInterceptor.executeMojo(PluginManagerInterceptor.java:182)
	at org.apache.maven.lifecycle.DefaultLifecycleExecutor.executeGoals(DefaultLifecycleExecutor.java:694)
	at org.apache.maven.lifecycle.DefaultLifecycleExecutor.executeGoalWithLifecycle(DefaultLifecycleExecutor.java:556)
	at org.apache.maven.lifecycle.DefaultLifecycleExecutor.executeGoal(DefaultLifecycleExecutor.java:535)
	at org.apache.maven.lifecycle.DefaultLifecycleExecutor.executeGoalAndHandleFailures(DefaultLifecycleExecutor.java:387)
	at org.apache.maven.lifecycle.DefaultLifecycleExecutor.executeTaskSegments(DefaultLifecycleExecutor.java:348)
	at org.apache.maven.lifecycle.DefaultLifecycleExecutor.execute(DefaultLifecycleExecutor.java:180)
	at org.apache.maven.lifecycle.LifecycleExecutorInterceptor.execute(LifecycleExecutorInterceptor.java:65)
	at org.apache.maven.DefaultMaven.doExecute(DefaultMaven.java:328)
	at org.apache.maven.DefaultMaven.execute(DefaultMaven.java:138)
	at org.apache.maven.cli.MavenCli.main(MavenCli.java:362)
	at sun.reflect.NativeMethodAccessorImpl.invoke0(Native Method)
	at sun.reflect.NativeMethodAccessorImpl.invoke(NativeMethodAccessorImpl.java:39)
	at sun.reflect.DelegatingMethodAccessorImpl.invoke(DelegatingMethodAccessorImpl.java:25)
	at java.lang.reflect.Method.invoke(Method.java:592)
	at org.codehaus.classworlds.Launcher.launchEnhanced(Launcher.java:315)
	at org.codehaus.classworlds.Launcher.launch(Launcher.java:255)
	at hudson.maven.agent.Main.launch(Main.java:165)
	at hudson.maven.MavenBuilder.call(MavenBuilder.java:165)
	at hudson.maven.MavenModuleSetBuild$Builder.call(MavenModuleSetBuild.java:750)
	at hudson.maven.MavenModuleSetBuild$Builder.call(MavenModuleSetBuild.java:694)
	at hudson.remoting.UserRequest.perform(UserRequest.java:114)
	at hudson.remoting.UserRequest.perform(UserRequest.java:48)
	at hudson.remoting.Request$2.run(Request.java:270)
	at java.util.concurrent.Executors$RunnableAdapter.call(Executors.java:417)
	at java.util.concurrent.FutureTask$Sync.innerRun(FutureTask.java:269)
	at java.util.concurrent.FutureTask.run(FutureTask.java:123)
	at java.util.concurrent.ThreadPoolExecutor$Worker.runTask(ThreadPoolExecutor.java:651)
	at java.util.concurrent.ThreadPoolExecutor$Worker.run(ThreadPoolExecutor.java:676)
	at java.lang.Thread.run(Thread.java:595)
[HUDSON] Archiving <https://hudson.apache.org/hudson/job/Synapse%20-%20Trunk/ws/java/modules/migrator/pom.xml>
to /home/hudson/hudson/jobs/Synapse - Trunk/modules/org.apache.synapse$synapse-config-migrator/builds/2011-01-05_19-13-47/archive/org.apache.synapse/synapse-config-migrator/2.1.0-SNAPSHOT/pom.xml
[HUDSON] Archiving <https://hudson.apache.org/hudson/job/Synapse%20-%20Trunk/ws/java/modules/migrator/target/synapse-config-migrator-2.1.0-SNAPSHOT.jar>
to /home/hudson/hudson/jobs/Synapse - Trunk/modules/org.apache.synapse$synapse-config-migrator/builds/2011-01-05_19-13-47/archive/org.apache.synapse/synapse-config-migrator/2.1.0-SNAPSHOT/synapse-config-migrator-2.1.0-SNAPSHOT.jar
[INFO] ------------------------------------------------------------------------
[INFO] Building Apache Synapse - Distribution
[INFO]    task-segment: [clean, install]
[INFO] ------------------------------------------------------------------------
[INFO] [clean:clean {execution: default-clean}]
[INFO] Deleting directory <https://hudson.apache.org/hudson/job/Synapse%20-%20Trunk/ws/java/modules/distribution/target>
[INFO] [remote-resources:process {execution: default}]
Downloading: http://repository.apache.org/snapshots/org/apache/sandesha2/sandesha2/SNAPSHOT/sandesha2-SNAPSHOT.pom
Downloading: http://people.apache.org/repo/m2-snapshot-repository//org/apache/ws/security/wss4j/1.5.11-SNAPSHOT/wss4j-1.5.11-SNAPSHOT.jar
[INFO] snapshot org.apache.synapse:synapse-config-migrator:2.1.0-SNAPSHOT: checking for updates
from apache-snapshots
[INFO] snapshot org.apache.synapse:synapse-config-migrator:2.1.0-SNAPSHOT: checking for updates
from wso2-m2-snapshots
[INFO] snapshot org.apache.synapse:synapse-config-migrator:2.1.0-SNAPSHOT: checking for updates
from apache.snapshots
[INFO] Unable to find resource 'org.apache.ws.security:wss4j:jar:1.5.11-SNAPSHOT' in repository
apache-snapshots (http://people.apache.org/repo/m2-snapshot-repository/)
Downloading: http://dist.wso2.org/snapshots/maven2//org/apache/ws/security/wss4j/1.5.11-SNAPSHOT/wss4j-1.5.11-SNAPSHOT.jar
[INFO] Unable to find resource 'org.apache.ws.security:wss4j:jar:1.5.11-SNAPSHOT' in repository
wso2-m2-snapshots (http://dist.wso2.org/snapshots/maven2/)
[INFO] [site:attach-descriptor {execution: default-attach-descriptor}]
[INFO] [assembly:single {execution: distribution-package}]
[INFO] Reading assembly descriptor: src/main/assembly/bin.xml
[INFO] Processing DependencySet (output=synapse-${synapse.version}/lib)
Downloading: http://people.apache.org/repo/m2-snapshot-repository//org/apache/ws/security/wss4j/1.5.11-SNAPSHOT/wss4j-1.5.11-SNAPSHOT.jar
[INFO] Unable to find resource 'org.apache.ws.security:wss4j:jar:1.5.11-SNAPSHOT' in repository
apache-snapshots (http://people.apache.org/repo/m2-snapshot-repository/)
Downloading: http://dist.wso2.org/snapshots/maven2//org/apache/ws/security/wss4j/1.5.11-SNAPSHOT/wss4j-1.5.11-SNAPSHOT.jar
[INFO] Unable to find resource 'org.apache.ws.security:wss4j:jar:1.5.11-SNAPSHOT' in repository
wso2-m2-snapshots (http://dist.wso2.org/snapshots/maven2/)
[INFO] Processing DependencySet (output=synapse-${synapse.version}/lib/patches)
Downloading: http://people.apache.org/repo/m2-snapshot-repository//org/apache/ws/security/wss4j/1.5.11-SNAPSHOT/wss4j-1.5.11-SNAPSHOT.jar
[INFO] Unable to find resource 'org.apache.ws.security:wss4j:jar:1.5.11-SNAPSHOT' in repository
apache-snapshots (http://people.apache.org/repo/m2-snapshot-repository/)
Downloading: http://dist.wso2.org/snapshots/maven2//org/apache/ws/security/wss4j/1.5.11-SNAPSHOT/wss4j-1.5.11-SNAPSHOT.jar
[INFO] Unable to find resource 'org.apache.ws.security:wss4j:jar:1.5.11-SNAPSHOT' in repository
wso2-m2-snapshots (http://dist.wso2.org/snapshots/maven2/)
[INFO] Processing DependencySet (output=synapse-${synapse.version}/lib/endorsed)
Downloading: http://people.apache.org/repo/m2-snapshot-repository//org/apache/ws/security/wss4j/1.5.11-SNAPSHOT/wss4j-1.5.11-SNAPSHOT.jar
[INFO] Unable to find resource 'org.apache.ws.security:wss4j:jar:1.5.11-SNAPSHOT' in repository
apache-snapshots (http://people.apache.org/repo/m2-snapshot-repository/)
Downloading: http://dist.wso2.org/snapshots/maven2//org/apache/ws/security/wss4j/1.5.11-SNAPSHOT/wss4j-1.5.11-SNAPSHOT.jar
[INFO] Unable to find resource 'org.apache.ws.security:wss4j:jar:1.5.11-SNAPSHOT' in repository
wso2-m2-snapshots (http://dist.wso2.org/snapshots/maven2/)
[INFO] Processing DependencySet (output=synapse-${synapse.version}/repository/modules)
Downloading: http://people.apache.org/repo/m2-snapshot-repository//org/apache/ws/security/wss4j/1.5.11-SNAPSHOT/wss4j-1.5.11-SNAPSHOT.jar
[INFO] Unable to find resource 'org.apache.ws.security:wss4j:jar:1.5.11-SNAPSHOT' in repository
apache-snapshots (http://people.apache.org/repo/m2-snapshot-repository/)
Downloading: http://dist.wso2.org/snapshots/maven2//org/apache/ws/security/wss4j/1.5.11-SNAPSHOT/wss4j-1.5.11-SNAPSHOT.jar
[INFO] Unable to find resource 'org.apache.ws.security:wss4j:jar:1.5.11-SNAPSHOT' in repository
wso2-m2-snapshots (http://dist.wso2.org/snapshots/maven2/)
[INFO] Processing DependencySet (output=synapse-${synapse.version}/samples/axis2Client/client_repo/modules)
Downloading: http://people.apache.org/repo/m2-snapshot-repository//org/apache/ws/security/wss4j/1.5.11-SNAPSHOT/wss4j-1.5.11-SNAPSHOT.jar
[INFO] Unable to find resource 'org.apache.ws.security:wss4j:jar:1.5.11-SNAPSHOT' in repository
apache-snapshots (http://people.apache.org/repo/m2-snapshot-repository/)
Downloading: http://dist.wso2.org/snapshots/maven2//org/apache/ws/security/wss4j/1.5.11-SNAPSHOT/wss4j-1.5.11-SNAPSHOT.jar
[INFO] Unable to find resource 'org.apache.ws.security:wss4j:jar:1.5.11-SNAPSHOT' in repository
wso2-m2-snapshots (http://dist.wso2.org/snapshots/maven2/)
[INFO] Processing DependencySet (output=synapse-${synapse.version}/samples/axis2Server/repository/modules)
Downloading: http://people.apache.org/repo/m2-snapshot-repository//org/apache/ws/security/wss4j/1.5.11-SNAPSHOT/wss4j-1.5.11-SNAPSHOT.jar
[INFO] Unable to find resource 'org.apache.ws.security:wss4j:jar:1.5.11-SNAPSHOT' in repository
apache-snapshots (http://people.apache.org/repo/m2-snapshot-repository/)
Downloading: http://dist.wso2.org/snapshots/maven2//org/apache/ws/security/wss4j/1.5.11-SNAPSHOT/wss4j-1.5.11-SNAPSHOT.jar
[INFO] Unable to find resource 'org.apache.ws.security:wss4j:jar:1.5.11-SNAPSHOT' in repository
wso2-m2-snapshots (http://dist.wso2.org/snapshots/maven2/)
[INFO] Processing DependencySet (output=synapse-${synapse.version}/samples/util)
Downloading: http://people.apache.org/repo/m2-snapshot-repository//org/apache/ws/security/wss4j/1.5.11-SNAPSHOT/wss4j-1.5.11-SNAPSHOT.jar
[INFO] Unable to find resource 'org.apache.ws.security:wss4j:jar:1.5.11-SNAPSHOT' in repository
apache-snapshots (http://people.apache.org/repo/m2-snapshot-repository/)
Downloading: http://dist.wso2.org/snapshots/maven2//org/apache/ws/security/wss4j/1.5.11-SNAPSHOT/wss4j-1.5.11-SNAPSHOT.jar
[INFO] Unable to find resource 'org.apache.ws.security:wss4j:jar:1.5.11-SNAPSHOT' in repository
wso2-m2-snapshots (http://dist.wso2.org/snapshots/maven2/)
[INFO] Building zip: <https://hudson.apache.org/hudson/job/Synapse%20-%20Trunk/ws/java/modules/distribution/target/synapse-2.1.0-SNAPSHOT-bin.zip>
[INFO] [install:install {execution: default-install}]
[INFO] Installing <https://hudson.apache.org/hudson/job/Synapse%20-%20Trunk/ws/java/modules/distribution/pom.xml>
to /home/hudson/.m2/repository/org/apache/synapse/synapse-distribution/2.1.0-SNAPSHOT/synapse-distribution-2.1.0-SNAPSHOT.pom
[INFO] Installing <https://hudson.apache.org/hudson/job/Synapse%20-%20Trunk/ws/java/modules/distribution/target/synapse-2.1.0-SNAPSHOT-bin.zip>
to /home/hudson/.m2/repository/org/apache/synapse/synapse-distribution/2.1.0-SNAPSHOT/synapse-distribution-2.1.0-SNAPSHOT-bin.zip
[HUDSON] Archiving <https://hudson.apache.org/hudson/job/Synapse%20-%20Trunk/ws/java/modules/distribution/pom.xml>
to /home/hudson/hudson/jobs/Synapse - Trunk/modules/org.apache.synapse$synapse-distribution/builds/2011-01-05_19-13-47/archive/org.apache.synapse/synapse-distribution/2.1.0-SNAPSHOT/pom.xml
[HUDSON] Archiving /home/hudson/.m2/repository/org/apache/synapse/synapse-distribution/2.1.0-SNAPSHOT/synapse-distribution-2.1.0-SNAPSHOT.pom
to /home/hudson/hudson/jobs/Synapse - Trunk/modules/org.apache.synapse$synapse-distribution/builds/2011-01-05_19-13-47/archive/org.apache.synapse/synapse-distribution/2.1.0-SNAPSHOT/synapse-distribution-2.1.0-SNAPSHOT.pom
[HUDSON] Archiving <https://hudson.apache.org/hudson/job/Synapse%20-%20Trunk/ws/java/modules/distribution/target/synapse-2.1.0-SNAPSHOT-bin.zip>
to /home/hudson/hudson/jobs/Synapse - Trunk/modules/org.apache.synapse$synapse-distribution/builds/2011-01-05_19-13-47/archive/org.apache.synapse/synapse-distribution/2.1.0-SNAPSHOT/synapse-2.1.0-SNAPSHOT-bin.zip
[INFO] ------------------------------------------------------------------------
[INFO] Building Apache Synapse - Package skeleton ZIP
[INFO]    task-segment: [clean, install]
[INFO] ------------------------------------------------------------------------
[INFO] [clean:clean {execution: default-clean}]
[INFO] Deleting directory <https://hudson.apache.org/hudson/job/Synapse%20-%20Trunk/ws/java/modules/packaging/package-skeleton/target>
[INFO] [remote-resources:process {execution: default}]
[INFO] [site:attach-descriptor {execution: default-attach-descriptor}]
[INFO] [assembly:single {execution: skeleton-package}]
[INFO] Reading assembly descriptor: src/main/assembly/skeleton.xml
[INFO] Building zip: <https://hudson.apache.org/hudson/job/Synapse%20-%20Trunk/ws/java/modules/packaging/package-skeleton/target/synapse-package-skeleton-2.1.0-SNAPSHOT.zip>
[INFO] [install:install {execution: default-install}]
[INFO] Installing <https://hudson.apache.org/hudson/job/Synapse%20-%20Trunk/ws/java/modules/packaging/package-skeleton/pom.xml>
to /home/hudson/.m2/repository/org/apache/synapse/synapse-package-skeleton/2.1.0-SNAPSHOT/synapse-package-skeleton-2.1.0-SNAPSHOT.pom
[INFO] Installing <https://hudson.apache.org/hudson/job/Synapse%20-%20Trunk/ws/java/modules/packaging/package-skeleton/target/synapse-package-skeleton-2.1.0-SNAPSHOT.zip>
to /home/hudson/.m2/repository/org/apache/synapse/synapse-package-skeleton/2.1.0-SNAPSHOT/synapse-package-skeleton-2.1.0-SNAPSHOT.zip
[HUDSON] Archiving <https://hudson.apache.org/hudson/job/Synapse%20-%20Trunk/ws/java/modules/packaging/package-skeleton/pom.xml>
to /home/hudson/hudson/jobs/Synapse - Trunk/modules/org.apache.synapse$synapse-package-skeleton/builds/2011-01-05_19-13-47/archive/org.apache.synapse/synapse-package-skeleton/2.1.0-SNAPSHOT/pom.xml
[HUDSON] Archiving /home/hudson/.m2/repository/org/apache/synapse/synapse-package-skeleton/2.1.0-SNAPSHOT/synapse-package-skeleton-2.1.0-SNAPSHOT.pom
to /home/hudson/hudson/jobs/Synapse - Trunk/modules/org.apache.synapse$synapse-package-skeleton/builds/2011-01-05_19-13-47/archive/org.apache.synapse/synapse-package-skeleton/2.1.0-SNAPSHOT/synapse-package-skeleton-2.1.0-SNAPSHOT.pom
[HUDSON] Archiving <https://hudson.apache.org/hudson/job/Synapse%20-%20Trunk/ws/java/modules/packaging/package-skeleton/target/synapse-package-skeleton-2.1.0-SNAPSHOT.zip>
to /home/hudson/hudson/jobs/Synapse - Trunk/modules/org.apache.synapse$synapse-package-skeleton/builds/2011-01-05_19-13-47/archive/org.apache.synapse/synapse-package-skeleton/2.1.0-SNAPSHOT/synapse-package-skeleton-2.1.0-SNAPSHOT.zip
[INFO] ------------------------------------------------------------------------
[INFO] Building Apache Synapse - Package archetype
[INFO]    task-segment: [clean, install]
[INFO] ------------------------------------------------------------------------
[INFO] [clean:clean {execution: default-clean}]
[INFO] Deleting directory <https://hudson.apache.org/hudson/job/Synapse%20-%20Trunk/ws/java/modules/packaging/package-archetype/target>
[INFO] [remote-resources:process {execution: default}]
[INFO] [resources:resources {execution: default-resources}]
[INFO] Using 'UTF-8' encoding to copy filtered resources.
[INFO] Copying 7 resources
[INFO] Copying 3 resources
[INFO] [resources:testResources {execution: default-testResources}]
[INFO] Using 'UTF-8' encoding to copy filtered resources.
[INFO] skip non existing resourceDirectory <https://hudson.apache.org/hudson/job/Synapse%20-%20Trunk/ws/java/modules/packaging/package-archetype/src/test/resources>
[INFO] Copying 3 resources
[INFO] Setting property: classpath.resource.loader.class => 'org.codehaus.plexus.velocity.ContextClassLoaderResourceLoader'.
[INFO] Setting property: velocimacro.messages.on => 'false'.
[INFO] Setting property: resource.loader => 'classpath'.
[INFO] Setting property: resource.manager.logwhenfound => 'false'.
[INFO] [archetype:jar {execution: default-jar}]
[INFO] [archetype:add-archetype-metadata {execution: default-add-archetype-metadata}]
[INFO] [archetype:integration-test {execution: default-integration-test}]
[INFO] [install:install {execution: default-install}]
[INFO] Installing <https://hudson.apache.org/hudson/job/Synapse%20-%20Trunk/ws/java/modules/packaging/package-archetype/target/synapse-package-archetype-2.1.0-SNAPSHOT.jar>
to /home/hudson/.m2/repository/org/apache/synapse/synapse-package-archetype/2.1.0-SNAPSHOT/synapse-package-archetype-2.1.0-SNAPSHOT.jar
[INFO] [archetype:update-local-catalog {execution: default-update-local-catalog}]
[HUDSON] Archiving <https://hudson.apache.org/hudson/job/Synapse%20-%20Trunk/ws/java/modules/packaging/package-archetype/pom.xml>
to /home/hudson/hudson/jobs/Synapse - Trunk/modules/org.apache.synapse$synapse-package-archetype/builds/2011-01-05_19-13-47/archive/org.apache.synapse/synapse-package-archetype/2.1.0-SNAPSHOT/pom.xml
[HUDSON] Archiving <https://hudson.apache.org/hudson/job/Synapse%20-%20Trunk/ws/java/modules/packaging/package-archetype/target/synapse-package-archetype-2.1.0-SNAPSHOT.jar>
to /home/hudson/hudson/jobs/Synapse - Trunk/modules/org.apache.synapse$synapse-package-archetype/builds/2011-01-05_19-13-47/archive/org.apache.synapse/synapse-package-archetype/2.1.0-SNAPSHOT/synapse-package-archetype-2.1.0-SNAPSHOT.jar
[INFO] 
[INFO] 
[INFO] ------------------------------------------------------------------------
[INFO] Reactor Summary:
[INFO] ------------------------------------------------------------------------
[INFO] Apache Synapse - Secure vault ......................... SUCCESS [10.869s]
[INFO] Apache Synapse ........................................ SUCCESS [2:14.561s]
[INFO] Apache Synapse - Commons classes ...................... SUCCESS [33.660s]
[INFO] Apache Synapse - Transports ........................... SUCCESS [13.290s]
[INFO] Apache Synapse - Non-blocking HTTP/s Transport ........ SUCCESS [37.557s]
[INFO] Apache Synapse - PIPE Transport ....................... SUCCESS [2.348s]
[INFO] Apache Synapse - VFS Transport ........................ SUCCESS [12.558s]
[INFO] Apache Synapse - Tasks classes ........................ SUCCESS [1.908s]
[INFO] Apache Synapse - Core ................................. SUCCESS [2:39.040s]
[INFO] Apache Synapse - FIX Transport ........................ SUCCESS [7.396s]
[INFO] Apache Synapse - Extensions ........................... SUCCESS [18.047s]
[INFO] Apache Synapse - Samples .............................. SUCCESS [25.729s]
[INFO] Apache Synapse - Patches .............................. SUCCESS [1.260s]
[INFO] Apache Synapse - Experimental code .................... SUCCESS [1.689s]
[INFO] Apache Synapse - Web Application ...................... SUCCESS [29.875s]
[INFO] Apache Synapse - Handler Module ....................... SUCCESS [2.652s]
[INFO] Apache Synapse - XAR Maven Plugin ..................... SUCCESS [3.058s]
[INFO] Apache Synapse - Configuration Migrator ............... SUCCESS [1.521s]
[INFO] Apache Synapse - Distribution ......................... SUCCESS [26.695s]
[INFO] Apache Synapse - Package skeleton ZIP ................. SUCCESS [0.793s]
[INFO] Apache Synapse - Package archetype .................... SUCCESS [0.653s]
[INFO] ------------------------------------------------------------------------
[INFO] ------------------------------------------------------------------------
[INFO] BUILD SUCCESSFUL
[INFO] ------------------------------------------------------------------------
[INFO] Total time: 19 minutes 30 seconds
[INFO] Finished at: Wed Jan 05 19:33:29 UTC 2011
[INFO] Final Memory: 80M/201M
[INFO] ------------------------------------------------------------------------
channel stopped
[locks-and-latches] Releasing all the locks
[locks-and-latches] All the locks released
Deploying artifacts to https://repository.apache.org/content/repositories/snapshots
Deploying the main artifact Apache-Synapse-2.1.0-SNAPSHOT.pom
[INFO ] Retrieving previous build number from apache.snapshots.https
ERROR: Error deploying artifact: Failed to transfer file: https://repository.apache.org/content/repositories/snapshots/org/apache/synapse/Apache-Synapse/2.1.0-SNAPSHOT/Apache-Synapse-2.1.0-SNAPSHOT.pom.
Return code is: 502
org.apache.maven.artifact.deployer.ArtifactDeploymentException: Error deploying artifact:
Failed to transfer file: https://repository.apache.org/content/repositories/snapshots/org/apache/synapse/Apache-Synapse/2.1.0-SNAPSHOT/Apache-Synapse-2.1.0-SNAPSHOT.pom.
Return code is: 502
	at org.apache.maven.artifact.deployer.DefaultArtifactDeployer.deploy(DefaultArtifactDeployer.java:94)
	at hudson.maven.reporters.MavenArtifactRecord.deploy(MavenArtifactRecord.java:119)
	at hudson.maven.reporters.MavenAggregatedArtifactRecord.deploy(MavenAggregatedArtifactRecord.java:79)
	at hudson.maven.RedeployPublisher.perform(RedeployPublisher.java:118)
	at hudson.tasks.BuildStepMonitor$1.perform(BuildStepMonitor.java:19)
	at hudson.model.AbstractBuild$AbstractRunner.perform(AbstractBuild.java:601)
	at hudson.model.AbstractBuild$AbstractRunner.performAllBuildSteps(AbstractBuild.java:580)
	at hudson.maven.MavenModuleSetBuild$RunnerImpl.post2(MavenModuleSetBuild.java:651)
	at hudson.model.AbstractBuild$AbstractRunner.post(AbstractBuild.java:528)
	at hudson.model.Run.run(Run.java:1348)
	at hudson.maven.MavenModuleSetBuild.run(MavenModuleSetBuild.java:349)
	at hudson.model.ResourceController.execute(ResourceController.java:88)
	at hudson.model.Executor.run(Executor.java:139)
Caused by: org.apache.maven.wagon.TransferFailedException: Failed to transfer file: https://repository.apache.org/content/repositories/snapshots/org/apache/synapse/Apache-Synapse/2.1.0-SNAPSHOT/Apache-Synapse-2.1.0-SNAPSHOT.pom.
Return code is: 502
	at org.apache.maven.wagon.providers.http.LightweightHttpWagon.put(LightweightHttpWagon.java:172)
	at org.apache.maven.artifact.manager.DefaultWagonManager.putRemoteFile(DefaultWagonManager.java:244)
	at org.apache.maven.artifact.manager.DefaultWagonManager.putArtifact(DefaultWagonManager.java:160)
	at org.apache.maven.artifact.deployer.DefaultArtifactDeployer.deploy(DefaultArtifactDeployer.java:80)
	... 12 more


---------------------------------------------------------------------
To unsubscribe, e-mail: dev-unsubscribe@synapse.apache.org
For additional commands, e-mail: dev-help@synapse.apache.org


Mime
View raw message