synapse-dev mailing list archives

Site index · List index
Message view « Date » · « Thread »
Top « Date » · « Thread »
From Apache Hudson Server <hud...@hudson.zones.apache.org>
Subject Build failed in Hudson: Synapse - Trunk » Apache Synapse - Non-blocking HTTP/s Transport #2457
Date Tue, 20 Jul 2010 06:03:54 GMT
See <http://hudson.zones.apache.org/hudson/job/Synapse%20-%20Trunk/org.apache.synapse$synapse-nhttp-transport/2457/>

------------------------------------------
[INFO] ------------------------------------------------------------------------
[INFO] Building Apache Synapse - Non-blocking HTTP/s Transport
[INFO]    task-segment: [clean, install]
[INFO] ------------------------------------------------------------------------
[INFO] [clean:clean {execution: default-clean}]
[INFO] Deleting directory <http://hudson.zones.apache.org/hudson/job/Synapse%20-%20Trunk/org.apache.synapse$synapse-nhttp-transport/ws/target>
[INFO] [remote-resources:process {execution: default}]
[INFO] snapshot org.apache.axis2:axis2-transport-http:SNAPSHOT: checking for updates from
apache-snapshots
[INFO] snapshot org.apache.axis2:axis2-transport-http:SNAPSHOT: checking for updates from
wso2-m2-snapshots
Downloading: http://people.apache.org/repo/m2-snapshot-repository//org/apache/axis2/axis2-transport-base/1.1.0-SNAPSHOT/axis2-transport-base-1.1.0-SNAPSHOT.jar
[INFO] Unable to find resource 'org.apache.axis2:axis2-transport-base:jar:1.1.0-SNAPSHOT'
in repository apache-snapshots (http://people.apache.org/repo/m2-snapshot-repository/)
Downloading: http://dist.wso2.org/snapshots/maven2//org/apache/axis2/axis2-transport-base/1.1.0-SNAPSHOT/axis2-transport-base-1.1.0-SNAPSHOT.jar
[INFO] Unable to find resource 'org.apache.axis2:axis2-transport-base:jar:1.1.0-SNAPSHOT'
in repository wso2-m2-snapshots (http://dist.wso2.org/snapshots/maven2/)
Downloading: http://people.apache.org/repo/m2-snapshot-repository//org/apache/axis2/axis2-transport-testkit/1.1.0-SNAPSHOT/axis2-transport-testkit-1.1.0-SNAPSHOT.jar
[INFO] Unable to find resource 'org.apache.axis2:axis2-transport-testkit:jar:1.1.0-SNAPSHOT'
in repository apache-snapshots (http://people.apache.org/repo/m2-snapshot-repository/)
Downloading: http://dist.wso2.org/snapshots/maven2//org/apache/axis2/axis2-transport-testkit/1.1.0-SNAPSHOT/axis2-transport-testkit-1.1.0-SNAPSHOT.jar
[INFO] Unable to find resource 'org.apache.axis2:axis2-transport-testkit:jar:1.1.0-SNAPSHOT'
in repository wso2-m2-snapshots (http://dist.wso2.org/snapshots/maven2/)
[INFO] [resources:resources {execution: default-resources}]
[INFO] Using encoding: 'UTF-8' to copy filtered resources.
Downloading: http://people.apache.org/repo/m2-snapshot-repository//org/apache/axis2/axis2-transport-base/1.1.0-SNAPSHOT/axis2-transport-base-1.1.0-SNAPSHOT.jar
[INFO] Unable to find resource 'org.apache.axis2:axis2-transport-base:jar:1.1.0-SNAPSHOT'
in repository apache-snapshots (http://people.apache.org/repo/m2-snapshot-repository/)
Downloading: http://dist.wso2.org/snapshots/maven2//org/apache/axis2/axis2-transport-base/1.1.0-SNAPSHOT/axis2-transport-base-1.1.0-SNAPSHOT.jar
[INFO] Unable to find resource 'org.apache.axis2:axis2-transport-base:jar:1.1.0-SNAPSHOT'
in repository wso2-m2-snapshots (http://dist.wso2.org/snapshots/maven2/)
Downloading: http://people.apache.org/repo/m2-snapshot-repository//org/apache/axis2/axis2-transport-base/1.1.0-SNAPSHOT/axis2-transport-base-1.1.0-SNAPSHOT.jar
[INFO] Unable to find resource 'org.apache.axis2:axis2-transport-base:jar:1.1.0-SNAPSHOT'
in repository apache-snapshots (http://people.apache.org/repo/m2-snapshot-repository/)
Downloading: http://dist.wso2.org/snapshots/maven2//org/apache/axis2/axis2-transport-base/1.1.0-SNAPSHOT/axis2-transport-base-1.1.0-SNAPSHOT.jar
[INFO] Unable to find resource 'org.apache.axis2:axis2-transport-base:jar:1.1.0-SNAPSHOT'
in repository wso2-m2-snapshots (http://dist.wso2.org/snapshots/maven2/)
[INFO] [compiler:compile {execution: default-compile}]
Compiling 39 source files to <http://hudson.zones.apache.org/hudson/job/Synapse%20-%20Trunk/org.apache.synapse$synapse-nhttp-transport/ws/target/classes>
[INFO] [dependency:copy {execution: copy}]
[INFO] Configured Artifact: org.aspectj:aspectjweaver:?:jar
[INFO] Copying aspectjweaver-1.6.1.jar to <http://hudson.zones.apache.org/hudson/job/Synapse%20-%20Trunk/org.apache.synapse$synapse-nhttp-transport/ws/target/lib/aspectjweaver.jar>
[INFO] [resources:testResources {execution: default-testResources}]
[INFO] Using encoding: 'UTF-8' to copy filtered resources.
Downloading: http://people.apache.org/repo/m2-snapshot-repository//org/apache/axis2/axis2-transport-base/1.1.0-SNAPSHOT/axis2-transport-base-1.1.0-SNAPSHOT.jar
[INFO] Unable to find resource 'org.apache.axis2:axis2-transport-base:jar:1.1.0-SNAPSHOT'
in repository apache-snapshots (http://people.apache.org/repo/m2-snapshot-repository/)
Downloading: http://dist.wso2.org/snapshots/maven2//org/apache/axis2/axis2-transport-base/1.1.0-SNAPSHOT/axis2-transport-base-1.1.0-SNAPSHOT.jar
[INFO] Unable to find resource 'org.apache.axis2:axis2-transport-base:jar:1.1.0-SNAPSHOT'
in repository wso2-m2-snapshots (http://dist.wso2.org/snapshots/maven2/)
Downloading: http://people.apache.org/repo/m2-snapshot-repository//org/apache/axis2/axis2-transport-testkit/1.1.0-SNAPSHOT/axis2-transport-testkit-1.1.0-SNAPSHOT.jar
[INFO] Unable to find resource 'org.apache.axis2:axis2-transport-testkit:jar:1.1.0-SNAPSHOT'
in repository apache-snapshots (http://people.apache.org/repo/m2-snapshot-repository/)
Downloading: http://dist.wso2.org/snapshots/maven2//org/apache/axis2/axis2-transport-testkit/1.1.0-SNAPSHOT/axis2-transport-testkit-1.1.0-SNAPSHOT.jar
[INFO] Unable to find resource 'org.apache.axis2:axis2-transport-testkit:jar:1.1.0-SNAPSHOT'
in repository wso2-m2-snapshots (http://dist.wso2.org/snapshots/maven2/)
Downloading: http://people.apache.org/repo/m2-snapshot-repository//org/apache/axis2/axis2-transport-base/1.1.0-SNAPSHOT/axis2-transport-base-1.1.0-SNAPSHOT.jar
[INFO] Unable to find resource 'org.apache.axis2:axis2-transport-base:jar:1.1.0-SNAPSHOT'
in repository apache-snapshots (http://people.apache.org/repo/m2-snapshot-repository/)
Downloading: http://dist.wso2.org/snapshots/maven2//org/apache/axis2/axis2-transport-base/1.1.0-SNAPSHOT/axis2-transport-base-1.1.0-SNAPSHOT.jar
[INFO] Unable to find resource 'org.apache.axis2:axis2-transport-base:jar:1.1.0-SNAPSHOT'
in repository wso2-m2-snapshots (http://dist.wso2.org/snapshots/maven2/)
Downloading: http://people.apache.org/repo/m2-snapshot-repository//org/apache/axis2/axis2-transport-testkit/1.1.0-SNAPSHOT/axis2-transport-testkit-1.1.0-SNAPSHOT.jar
[INFO] Unable to find resource 'org.apache.axis2:axis2-transport-testkit:jar:1.1.0-SNAPSHOT'
in repository apache-snapshots (http://people.apache.org/repo/m2-snapshot-repository/)
Downloading: http://dist.wso2.org/snapshots/maven2//org/apache/axis2/axis2-transport-testkit/1.1.0-SNAPSHOT/axis2-transport-testkit-1.1.0-SNAPSHOT.jar
[INFO] Unable to find resource 'org.apache.axis2:axis2-transport-testkit:jar:1.1.0-SNAPSHOT'
in repository wso2-m2-snapshots (http://dist.wso2.org/snapshots/maven2/)
[INFO] [compiler:testCompile {execution: default-testCompile}]
Compiling 3 source files to <http://hudson.zones.apache.org/hudson/job/Synapse%20-%20Trunk/org.apache.synapse$synapse-nhttp-transport/ws/target/test-classes>
Downloading: http://people.apache.org/repo/m2-snapshot-repository//org/apache/axis2/axis2-transport-base/1.1.0-SNAPSHOT/axis2-transport-base-1.1.0-SNAPSHOT.jar
[INFO] Unable to find resource 'org.apache.axis2:axis2-transport-base:jar:1.1.0-SNAPSHOT'
in repository apache-snapshots (http://people.apache.org/repo/m2-snapshot-repository/)
Downloading: http://dist.wso2.org/snapshots/maven2//org/apache/axis2/axis2-transport-base/1.1.0-SNAPSHOT/axis2-transport-base-1.1.0-SNAPSHOT.jar
[INFO] Unable to find resource 'org.apache.axis2:axis2-transport-base:jar:1.1.0-SNAPSHOT'
in repository wso2-m2-snapshots (http://dist.wso2.org/snapshots/maven2/)
Downloading: http://people.apache.org/repo/m2-snapshot-repository//org/apache/axis2/axis2-transport-testkit/1.1.0-SNAPSHOT/axis2-transport-testkit-1.1.0-SNAPSHOT.jar
[INFO] Unable to find resource 'org.apache.axis2:axis2-transport-testkit:jar:1.1.0-SNAPSHOT'
in repository apache-snapshots (http://people.apache.org/repo/m2-snapshot-repository/)
Downloading: http://dist.wso2.org/snapshots/maven2//org/apache/axis2/axis2-transport-testkit/1.1.0-SNAPSHOT/axis2-transport-testkit-1.1.0-SNAPSHOT.jar
[INFO] Unable to find resource 'org.apache.axis2:axis2-transport-testkit:jar:1.1.0-SNAPSHOT'
in repository wso2-m2-snapshots (http://dist.wso2.org/snapshots/maven2/)
Downloading: http://people.apache.org/repo/m2-snapshot-repository//org/apache/axis2/axis2-transport-base/1.1.0-SNAPSHOT/axis2-transport-base-1.1.0-SNAPSHOT.jar
[INFO] Unable to find resource 'org.apache.axis2:axis2-transport-base:jar:1.1.0-SNAPSHOT'
in repository apache-snapshots (http://people.apache.org/repo/m2-snapshot-repository/)
Downloading: http://dist.wso2.org/snapshots/maven2//org/apache/axis2/axis2-transport-base/1.1.0-SNAPSHOT/axis2-transport-base-1.1.0-SNAPSHOT.jar
[INFO] Unable to find resource 'org.apache.axis2:axis2-transport-base:jar:1.1.0-SNAPSHOT'
in repository wso2-m2-snapshots (http://dist.wso2.org/snapshots/maven2/)
Downloading: http://people.apache.org/repo/m2-snapshot-repository//org/apache/axis2/axis2-transport-testkit/1.1.0-SNAPSHOT/axis2-transport-testkit-1.1.0-SNAPSHOT.jar
[INFO] Unable to find resource 'org.apache.axis2:axis2-transport-testkit:jar:1.1.0-SNAPSHOT'
in repository apache-snapshots (http://people.apache.org/repo/m2-snapshot-repository/)
Downloading: http://dist.wso2.org/snapshots/maven2//org/apache/axis2/axis2-transport-testkit/1.1.0-SNAPSHOT/axis2-transport-testkit-1.1.0-SNAPSHOT.jar
[INFO] Unable to find resource 'org.apache.axis2:axis2-transport-testkit:jar:1.1.0-SNAPSHOT'
in repository wso2-m2-snapshots (http://dist.wso2.org/snapshots/maven2/)
[INFO] [surefire:test {execution: default-test}]
[INFO] Surefire report directory: <http://hudson.zones.apache.org/hudson/job/Synapse%20-%20Trunk/org.apache.synapse$synapse-nhttp-transport/ws/target/surefire-reports>
org.apache.maven.surefire.booter.SurefireExecutionException: org.apache.synapse.transport.nhttp.HttpCoreNIOListenerTest;
nested exception is java.lang.NoClassDefFoundError: javax/mail/internet/ParseException; nested
exception is org.apache.maven.surefire.testset.TestSetFailedException: org.apache.synapse.transport.nhttp.HttpCoreNIOListenerTest;
nested exception is java.lang.NoClassDefFoundError: javax/mail/internet/ParseException
org.apache.maven.surefire.testset.TestSetFailedException: org.apache.synapse.transport.nhttp.HttpCoreNIOListenerTest;
nested exception is java.lang.NoClassDefFoundError: javax/mail/internet/ParseException
java.lang.NoClassDefFoundError: javax/mail/internet/ParseException
	at org.apache.axis2.transport.testkit.http.HttpTransportTestSuiteBuilder.build(HttpTransportTestSuiteBuilder.java:72)
	at org.apache.synapse.transport.nhttp.HttpCoreNIOListenerTest.suite(HttpCoreNIOListenerTest.java:43)
	at sun.reflect.NativeMethodAccessorImpl.invoke0(Native Method)
	at sun.reflect.NativeMethodAccessorImpl.invoke(NativeMethodAccessorImpl.java:39)
	at sun.reflect.DelegatingMethodAccessorImpl.invoke(DelegatingMethodAccessorImpl.java:25)
	at java.lang.reflect.Method.invoke(Method.java:592)
	at org.apache.maven.surefire.junit.JUnitTestSet.createInstanceFromSuiteMethod(JUnitTestSet.java:180)
	at org.apache.maven.surefire.junit.JUnitTestSet.constructTestObject(JUnitTestSet.java:140)
	at org.apache.maven.surefire.junit.JUnitTestSet.getTestCount(JUnitTestSet.java:247)
	at org.apache.maven.surefire.suite.AbstractDirectoryTestSuite.locateTestSets(AbstractDirectoryTestSuite.java:104)
	at org.apache.maven.surefire.Surefire.createSuiteFromDefinition(Surefire.java:150)
	at org.apache.maven.surefire.Surefire.run(Surefire.java:111)
	at sun.reflect.NativeMethodAccessorImpl.invoke0(Native Method)
	at sun.reflect.NativeMethodAccessorImpl.invoke(NativeMethodAccessorImpl.java:39)
	at sun.reflect.DelegatingMethodAccessorImpl.invoke(DelegatingMethodAccessorImpl.java:25)
	at java.lang.reflect.Method.invoke(Method.java:592)
	at org.apache.maven.surefire.booter.SurefireBooter.runSuitesInProcess(SurefireBooter.java:290)
	at org.apache.maven.surefire.booter.SurefireBooter.main(SurefireBooter.java:818)
[ERROR] There are test failures.
Downloading: http://people.apache.org/repo/m2-snapshot-repository//org/apache/axis2/axis2-transport-base/1.1.0-SNAPSHOT/axis2-transport-base-1.1.0-SNAPSHOT.jar
[HUDSON] Recording test results[INFO] Unable to find resource 'org.apache.axis2:axis2-transport-base:jar:1.1.0-SNAPSHOT'
in repository apache-snapshots (http://people.apache.org/repo/m2-snapshot-repository/)
Downloading: http://dist.wso2.org/snapshots/maven2//org/apache/axis2/axis2-transport-base/1.1.0-SNAPSHOT/axis2-transport-base-1.1.0-SNAPSHOT.jar

[INFO] Unable to find resource 'org.apache.axis2:axis2-transport-base:jar:1.1.0-SNAPSHOT'
in repository wso2-m2-snapshots (http://dist.wso2.org/snapshots/maven2/)
Downloading: http://people.apache.org/repo/m2-snapshot-repository//org/apache/axis2/axis2-transport-base/1.1.0-SNAPSHOT/axis2-transport-base-1.1.0-SNAPSHOT.jar
[INFO] Unable to find resource 'org.apache.axis2:axis2-transport-base:jar:1.1.0-SNAPSHOT'
in repository apache-snapshots (http://people.apache.org/repo/m2-snapshot-repository/)
Downloading: http://dist.wso2.org/snapshots/maven2//org/apache/axis2/axis2-transport-base/1.1.0-SNAPSHOT/axis2-transport-base-1.1.0-SNAPSHOT.jar
[INFO] Unable to find resource 'org.apache.axis2:axis2-transport-base:jar:1.1.0-SNAPSHOT'
in repository wso2-m2-snapshots (http://dist.wso2.org/snapshots/maven2/)
[INFO] [bundle:bundle {execution: default-bundle}]
[INFO] [assembly:attached {execution: attach-testkit-logs}]
[INFO] Reading assembly descriptor: src/main/assembly/testkit-logs.xml
[HUDSON] Archiving <http://hudson.zones.apache.org/hudson/job/Synapse%20-%20Trunk/org.apache.synapse$synapse-nhttp-transport/ws/pom.xml>
to /export/home/hudson/hudson/jobs/Synapse - Trunk/modules/org.apache.synapse$synapse-nhttp-transport/builds/2010-07-20_06-02-50/archive/org.apache.synapse/synapse-nhttp-transport/2.0.0-SNAPSHOT/pom.xml
[HUDSON] Archiving <http://hudson.zones.apache.org/hudson/job/Synapse%20-%20Trunk/org.apache.synapse$synapse-nhttp-transport/ws/target/synapse-nhttp-transport-2.0.0-SNAPSHOT.jar>
to /export/home/hudson/hudson/jobs/Synapse - Trunk/modules/org.apache.synapse$synapse-nhttp-transport/builds/2010-07-20_06-02-50/archive/org.apache.synapse/synapse-nhttp-transport/2.0.0-SNAPSHOT/synapse-nhttp-transport-2.0.0-SNAPSHOT.jar
[INFO] ------------------------------------------------------------------------
[ERROR] BUILD ERROR
[INFO] ------------------------------------------------------------------------
[INFO] Failed to create assembly: Error creating assembly archive testkit-logs: You must set
at least one file.

[INFO] ------------------------------------------------------------------------
[INFO] For more information, run Maven with the -e switch
[INFO] ------------------------------------------------------------------------
[INFO] Total time: 53 seconds
[INFO] Finished at: Tue Jul 20 06:03:53 UTC 2010
[INFO] Final Memory: 49M/213M
[INFO] ------------------------------------------------------------------------
Waiting for Hudson to finish collecting data


---------------------------------------------------------------------
To unsubscribe, e-mail: dev-unsubscribe@synapse.apache.org
For additional commands, e-mail: dev-help@synapse.apache.org


Mime
View raw message