synapse-dev mailing list archives

Site index · List index
Message view « Date » · « Thread »
Top « Date » · « Thread »
From Apache Hudson Server <hud...@hudson.zones.apache.org>
Subject Build failed in Hudson: Synapse - Trunk #2416
Date Thu, 08 Jul 2010 14:04:14 GMT
See <http://hudson.zones.apache.org/hudson/job/Synapse%20-%20Trunk/2416/>

------------------------------------------
[...truncated 1053 lines...]
[INFO] ------------------------------------------------------------------------
[INFO] Building Apache Synapse - Samples
[INFO]    task-segment: [clean, install]
[INFO] ------------------------------------------------------------------------
[INFO] [clean:clean {execution: default-clean}]
[INFO] Deleting directory <http://hudson.zones.apache.org/hudson/job/Synapse%20-%20Trunk/ws/java/modules/samples/target>
[INFO] [remote-resources:process {execution: default}]
[INFO] snapshot org.apache.rampart:rampart-core:SNAPSHOT: checking for updates from apache-snapshots
[INFO] snapshot org.apache.rampart:rampart-core:SNAPSHOT: checking for updates from wso2-m2-snapshots
[INFO] snapshot org.apache.rampart:rampart-core:SNAPSHOT: checking for updates from apache.snapshots
[INFO] snapshot org.apache.rampart:rampart-project:SNAPSHOT: checking for updates from apache-snapshots
[INFO] snapshot org.apache.rampart:rampart-project:SNAPSHOT: checking for updates from wso2-m2-snapshots
[INFO] snapshot org.apache.rampart:rampart-project:SNAPSHOT: checking for updates from apache.snapshots
[INFO] snapshot org.apache.rampart:rampart-policy:SNAPSHOT: checking for updates from apache-snapshots
[INFO] snapshot org.apache.rampart:rampart-policy:SNAPSHOT: checking for updates from wso2-m2-snapshots
[INFO] snapshot org.apache.rampart:rampart-policy:SNAPSHOT: checking for updates from apache.snapshots
[INFO] snapshot org.apache.axis2:mex:SNAPSHOT: checking for updates from apache-snapshots
[INFO] snapshot org.apache.axis2:mex:SNAPSHOT: checking for updates from wso2-m2-snapshots
[INFO] snapshot org.apache.axis2:mex:SNAPSHOT: checking for updates from apache.snapshots
[INFO] snapshot org.apache.rampart:rampart-trust:SNAPSHOT: checking for updates from apache-snapshots
[INFO] snapshot org.apache.rampart:rampart-trust:SNAPSHOT: checking for updates from wso2-m2-snapshots
[INFO] snapshot org.apache.rampart:rampart-trust:SNAPSHOT: checking for updates from apache.snapshots
[INFO] snapshot org.apache.synapse:synapse-extensions:2.0.0-SNAPSHOT: checking for updates
from apache-snapshots
[INFO] snapshot org.apache.synapse:synapse-extensions:2.0.0-SNAPSHOT: checking for updates
from wso2-m2-snapshots
[INFO] snapshot org.apache.synapse:synapse-extensions:2.0.0-SNAPSHOT: checking for updates
from apache.snapshots
Downloading: http://repository.apache.org/snapshots/org/apache/axis2/mex/20100706.200205-3/mex-20100706.200205-3.pom
[INFO] Unable to find resource 'org.apache.axis2:mex:pom:20100706.200205-3' in repository
apache-snapshots (http://people.apache.org/repo/m2-snapshot-repository/)
Downloading: http://dist.wso2.org/maven2//org/apache/axis2/mex/20100706.200205-3/mex-20100706.200205-3.pom
[INFO] Unable to find resource 'org.apache.axis2:mex:pom:20100706.200205-3' in repository
wso2-m2 (http://dist.wso2.org/maven2/)
Downloading: http://repo1.maven.org/maven2/org/apache/axis2/mex/20100706.200205-3/mex-20100706.200205-3.pom
[INFO] Unable to find resource 'org.apache.axis2:mex:pom:20100706.200205-3' in repository
central (http://repo1.maven.org/maven2)
[INFO] [resources:resources {execution: default-resources}]
[INFO] Using encoding: 'UTF-8' to copy filtered resources.
[INFO] [compiler:compile {execution: default-compile}]
Compiling 20 source files to <http://hudson.zones.apache.org/hudson/job/Synapse%20-%20Trunk/ws/java/modules/samples/target/classes>
[INFO] [resources:testResources {execution: default-testResources}]
[INFO] Using encoding: 'UTF-8' to copy filtered resources.
[INFO] [compiler:testCompile {execution: default-testCompile}]
Compiling 38 source files to <http://hudson.zones.apache.org/hudson/job/Synapse%20-%20Trunk/ws/java/modules/samples/target/test-classes>
[INFO] [surefire:test {execution: default-test}]
[INFO] Surefire report directory: <http://hudson.zones.apache.org/hudson/job/Synapse%20-%20Trunk/ws/java/modules/samples/target/surefire-reports>

-------------------------------------------------------
 T E S T S
-------------------------------------------------------
There are no tests to run.

Results :

Tests run: 0, Failures: 0, Errors: 0, Skipped: 0

[INFO] [bundle:bundle {execution: default-bundle}]
[HUDSON] Recording test results[INFO] [install:install {execution: default-install}]
[INFO] Installing <http://hudson.zones.apache.org/hudson/job/Synapse%20-%20Trunk/ws/java/modules/samples/target/synapse-samples-2.0.0-SNAPSHOT.jar>
to /export/home/hudson/.m2/repository/org/apache/synapse/synapse-samples/2.0.0-SNAPSHOT/synapse-samples-2.0.0-SNAPSHOT.jar
[INFO] [bundle:install {execution: default-install}]
[INFO] Parsing file:/export/home/hudson/.m2/repository/repository.xml
[INFO] Installing org/apache/synapse/synapse-samples/2.0.0-SNAPSHOT/synapse-samples-2.0.0-SNAPSHOT.jar
[INFO] Writing OBR metadata

[HUDSON] Archiving <http://hudson.zones.apache.org/hudson/job/Synapse%20-%20Trunk/ws/java/modules/samples/pom.xml>
to /export/home/hudson/hudson/jobs/Synapse - Trunk/modules/org.apache.synapse$synapse-samples/builds/2010-07-08_12-02-50/archive/org.apache.synapse/synapse-samples/2.0.0-SNAPSHOT/pom.xml
[HUDSON] Archiving <http://hudson.zones.apache.org/hudson/job/Synapse%20-%20Trunk/ws/java/modules/samples/target/synapse-samples-2.0.0-SNAPSHOT.jar>
to /export/home/hudson/hudson/jobs/Synapse - Trunk/modules/org.apache.synapse$synapse-samples/builds/2010-07-08_12-02-50/archive/org.apache.synapse/synapse-samples/2.0.0-SNAPSHOT/synapse-samples-2.0.0-SNAPSHOT.jar
[INFO] ------------------------------------------------------------------------
[INFO] Building Apache Synapse - Patches
[INFO]    task-segment: [clean, install]
[INFO] ------------------------------------------------------------------------
[INFO] [clean:clean {execution: default-clean}]
[INFO] Deleting directory <http://hudson.zones.apache.org/hudson/job/Synapse%20-%20Trunk/ws/java/modules/patches/target>
[INFO] [remote-resources:process {execution: default}]
[INFO] [resources:resources {execution: default-resources}]
[INFO] Using encoding: 'UTF-8' to copy filtered resources.
[INFO] [compiler:compile {execution: default-compile}]
[INFO] No sources to compile
[INFO] [antrun:run {execution: default}]
[INFO] Executing tasks
    [unjar] Expanding: <http://hudson.zones.apache.org/hudson/job/Synapse%20-%20Trunk/ws/java/modules/patches/jars/httpcore-nio-4.0-patch-httpcore-193.jar>
into <http://hudson.zones.apache.org/hudson/job/Synapse%20-%20Trunk/ws/java/modules/patches/target/classes>
[INFO] Executed tasks
[INFO] [resources:testResources {execution: default-testResources}]
[INFO] Using encoding: 'UTF-8' to copy filtered resources.
[INFO] [compiler:testCompile {execution: default-testCompile}]
[INFO] No sources to compile
[INFO] [surefire:test {execution: default-test}]
[INFO] Surefire report directory: <http://hudson.zones.apache.org/hudson/job/Synapse%20-%20Trunk/ws/java/modules/patches/target/surefire-reports>

-------------------------------------------------------
 T E S T S
-------------------------------------------------------
There are no tests to run.

Results :

Tests run: 0, Failures: 0, Errors: 0, Skipped: 0

[HUDSON] Recording test results
[INFO] [jar:jar {execution: default-jar}]
[INFO] Building jar: <http://hudson.zones.apache.org/hudson/job/Synapse%20-%20Trunk/ws/java/modules/patches/target/synapse-patches-2.0.0-SNAPSHOT.jar>
[INFO] [assembly:single {execution: default}]
[INFO] Reading assembly descriptor: src/main/assembly/jars.xml
[INFO] Building zip: <http://hudson.zones.apache.org/hudson/job/Synapse%20-%20Trunk/ws/java/modules/patches/target/synapse-patches-2.0.0-SNAPSHOT-jars.zip>
[INFO] [install:install {execution: default-install}]
[INFO] Installing <http://hudson.zones.apache.org/hudson/job/Synapse%20-%20Trunk/ws/java/modules/patches/target/synapse-patches-2.0.0-SNAPSHOT.jar>
to /export/home/hudson/.m2/repository/org/apache/synapse/synapse-patches/2.0.0-SNAPSHOT/synapse-patches-2.0.0-SNAPSHOT.jar
[INFO] Installing <http://hudson.zones.apache.org/hudson/job/Synapse%20-%20Trunk/ws/java/modules/patches/target/synapse-patches-2.0.0-SNAPSHOT-jars.zip>
to /export/home/hudson/.m2/repository/org/apache/synapse/synapse-patches/2.0.0-SNAPSHOT/synapse-patches-2.0.0-SNAPSHOT-jars.zip
[HUDSON] Archiving <http://hudson.zones.apache.org/hudson/job/Synapse%20-%20Trunk/ws/java/modules/patches/pom.xml>
to /export/home/hudson/hudson/jobs/Synapse - Trunk/modules/org.apache.synapse$synapse-patches/builds/2010-07-08_12-02-50/archive/org.apache.synapse/synapse-patches/2.0.0-SNAPSHOT/pom.xml
[HUDSON] Archiving <http://hudson.zones.apache.org/hudson/job/Synapse%20-%20Trunk/ws/java/modules/patches/target/synapse-patches-2.0.0-SNAPSHOT.jar>
to /export/home/hudson/hudson/jobs/Synapse - Trunk/modules/org.apache.synapse$synapse-patches/builds/2010-07-08_12-02-50/archive/org.apache.synapse/synapse-patches/2.0.0-SNAPSHOT/synapse-patches-2.0.0-SNAPSHOT.jar
[HUDSON] Archiving <http://hudson.zones.apache.org/hudson/job/Synapse%20-%20Trunk/ws/java/modules/patches/target/synapse-patches-2.0.0-SNAPSHOT-jars.zip>
to /export/home/hudson/hudson/jobs/Synapse - Trunk/modules/org.apache.synapse$synapse-patches/builds/2010-07-08_12-02-50/archive/org.apache.synapse/synapse-patches/2.0.0-SNAPSHOT/synapse-patches-2.0.0-SNAPSHOT-jars.zip
[INFO] ------------------------------------------------------------------------
[INFO] Building Apache Synapse - Experimental code
[INFO]    task-segment: [clean, install]
[INFO] ------------------------------------------------------------------------
[INFO] [clean:clean {execution: default-clean}]
[INFO] Deleting directory <http://hudson.zones.apache.org/hudson/job/Synapse%20-%20Trunk/ws/java/modules/experimental/target>
[INFO] [remote-resources:process {execution: default}]
[INFO] [resources:resources {execution: default-resources}]
[INFO] Using encoding: 'UTF-8' to copy filtered resources.
[INFO] [compiler:compile {execution: default-compile}]
Compiling 16 source files to <http://hudson.zones.apache.org/hudson/job/Synapse%20-%20Trunk/ws/java/modules/experimental/target/classes>
[INFO] [resources:testResources {execution: default-testResources}]
[INFO] Using encoding: 'UTF-8' to copy filtered resources.
[INFO] [compiler:testCompile {execution: default-testCompile}]
[INFO] No sources to compile
[INFO] [surefire:test {execution: default-test}]
[INFO] Surefire report directory: <http://hudson.zones.apache.org/hudson/job/Synapse%20-%20Trunk/ws/java/modules/experimental/target/surefire-reports>

-------------------------------------------------------
 T E S T S
-------------------------------------------------------
There are no tests to run.

Results :

Tests run: 0, Failures: 0, Errors: 0, Skipped: 0

[HUDSON] Recording test results
[INFO] [bundle:bundle {execution: default-bundle}]
[INFO] [install:install {execution: default-install}]
[INFO] Installing <http://hudson.zones.apache.org/hudson/job/Synapse%20-%20Trunk/ws/java/modules/experimental/target/synapse-experimental-2.0.0-SNAPSHOT.jar>
to /export/home/hudson/.m2/repository/org/apache/synapse/synapse-experimental/2.0.0-SNAPSHOT/synapse-experimental-2.0.0-SNAPSHOT.jar
[INFO] [bundle:install {execution: default-install}]
[INFO] Parsing file:/export/home/hudson/.m2/repository/repository.xml
[INFO] Installing org/apache/synapse/synapse-experimental/2.0.0-SNAPSHOT/synapse-experimental-2.0.0-SNAPSHOT.jar
[INFO] Writing OBR metadata
[HUDSON] Archiving <http://hudson.zones.apache.org/hudson/job/Synapse%20-%20Trunk/ws/java/modules/experimental/pom.xml>
to /export/home/hudson/hudson/jobs/Synapse - Trunk/modules/org.apache.synapse$synapse-experimental/builds/2010-07-08_12-02-50/archive/org.apache.synapse/synapse-experimental/2.0.0-SNAPSHOT/pom.xml
[HUDSON] Archiving <http://hudson.zones.apache.org/hudson/job/Synapse%20-%20Trunk/ws/java/modules/experimental/target/synapse-experimental-2.0.0-SNAPSHOT.jar>
to /export/home/hudson/hudson/jobs/Synapse - Trunk/modules/org.apache.synapse$synapse-experimental/builds/2010-07-08_12-02-50/archive/org.apache.synapse/synapse-experimental/2.0.0-SNAPSHOT/synapse-experimental-2.0.0-SNAPSHOT.jar
[INFO] ------------------------------------------------------------------------
[INFO] Building Apache Synapse - Web Application
[INFO]    task-segment: [clean, install]
[INFO] ------------------------------------------------------------------------
[INFO] [clean:clean {execution: default-clean}]
[INFO] Deleting directory <http://hudson.zones.apache.org/hudson/job/Synapse%20-%20Trunk/ws/java/modules/war/target>
[INFO] [dependency:copy {execution: copy}]
[INFO] Configured Artifact: org.apache.axis2:addressing:1.5:mar
[INFO] Configured Artifact: org.apache.sandesha2:sandesha2:SNAPSHOT:mar
[INFO] snapshot org.apache.sandesha2:sandesha2:SNAPSHOT: checking for updates from apache-snapshots
[INFO] snapshot org.apache.sandesha2:sandesha2:SNAPSHOT: checking for updates from wso2-m2-snapshots
[INFO] snapshot org.apache.sandesha2:sandesha2:SNAPSHOT: checking for updates from apache.snapshots
[INFO] Configured Artifact: org.apache.rampart:rampart:SNAPSHOT:mar
[INFO] snapshot org.apache.rampart:rampart:SNAPSHOT: checking for updates from apache-snapshots
[INFO] snapshot org.apache.rampart:rampart:SNAPSHOT: checking for updates from wso2-m2-snapshots
[INFO] snapshot org.apache.rampart:rampart:SNAPSHOT: checking for updates from apache.snapshots
[INFO] Copying addressing-1.5.mar to <http://hudson.zones.apache.org/hudson/job/Synapse%20-%20Trunk/ws/java/modules/war/target/temp/lib/addressing-1.5.mar>
[INFO] Copying sandesha2-SNAPSHOT.mar to <http://hudson.zones.apache.org/hudson/job/Synapse%20-%20Trunk/ws/java/modules/war/target/temp/lib/sandesha2-SNAPSHOT.mar>
[INFO] Copying rampart-SNAPSHOT.mar to <http://hudson.zones.apache.org/hudson/job/Synapse%20-%20Trunk/ws/java/modules/war/target/temp/lib/rampart-SNAPSHOT.mar>
[INFO] [remote-resources:process {execution: default}]
[INFO] snapshot org.apache.synapse:synapse-samples:2.0.0-SNAPSHOT: checking for updates from
apache-snapshots
[INFO] snapshot org.apache.synapse:synapse-samples:2.0.0-SNAPSHOT: checking for updates from
wso2-m2-snapshots
[INFO] snapshot org.apache.synapse:synapse-samples:2.0.0-SNAPSHOT: checking for updates from
apache.snapshots
[INFO] snapshot org.apache.synapse:synapse-experimental:2.0.0-SNAPSHOT: checking for updates
from apache-snapshots
[INFO] snapshot org.apache.synapse:synapse-experimental:2.0.0-SNAPSHOT: checking for updates
from wso2-m2-snapshots
[INFO] snapshot org.apache.synapse:synapse-experimental:2.0.0-SNAPSHOT: checking for updates
from apache.snapshots
[INFO] [resources:resources {execution: default-resources}]
[INFO] Using encoding: 'UTF-8' to copy filtered resources.
[INFO] [compiler:compile {execution: default-compile}]
[INFO] No sources to compile
[INFO] [dependency:unpack-dependencies {execution: unpack-patches}]
[INFO] Unpacking <http://hudson.zones.apache.org/hudson/job/Synapse%20-%20Trunk/ws/java/modules/patches/target/synapse-patches-2.0.0-SNAPSHOT.jar>
to
  <http://hudson.zones.apache.org/hudson/job/Synapse%20-%20Trunk/ws/java/modules/war/target/classes>
   with includes null and excludes:META-INF/**/*
[INFO] [resources:testResources {execution: default-testResources}]
[INFO] Using encoding: 'UTF-8' to copy filtered resources.
[INFO] [compiler:testCompile {execution: default-testCompile}]
[INFO] No sources to compile
[INFO] [surefire:test {execution: default-test}]
[INFO] Surefire report directory: <http://hudson.zones.apache.org/hudson/job/Synapse%20-%20Trunk/ws/java/modules/war/target/surefire-reports>

-------------------------------------------------------
 T E S T S
-------------------------------------------------------
There are no tests to run.

Results :

Tests run: 0, Failures: 0, Errors: 0, Skipped: 0

[HUDSON] Recording test results
[INFO] [war:war {execution: default-war}]
[INFO] Packaging webapp
[INFO] Assembling webapp[synapse-war] in [<http://hudson.zones.apache.org/hudson/job/Synapse%20-%20Trunk/ws/java/modules/war/target/synapse]>
[INFO] Processing war project
[INFO] Copying webapp webResources[<http://hudson.zones.apache.org/hudson/job/Synapse%20-%20Trunk/ws/java/modules/war/../../repository]>
to[<http://hudson.zones.apache.org/hudson/job/Synapse%20-%20Trunk/ws/java/modules/war/target/synapse]>
[INFO] Copying webapp webResources[<http://hudson.zones.apache.org/hudson/job/Synapse%20-%20Trunk/ws/java/modules/war/../core/src/main/resources]>
to[<http://hudson.zones.apache.org/hudson/job/Synapse%20-%20Trunk/ws/java/modules/war/target/synapse]>
[INFO] Copying webapp webResources[<http://hudson.zones.apache.org/hudson/job/Synapse%20-%20Trunk/ws/java/modules/war/target/temp/lib]>
to[<http://hudson.zones.apache.org/hudson/job/Synapse%20-%20Trunk/ws/java/modules/war/target/synapse]>
[INFO] Copying webapp webResources[<http://hudson.zones.apache.org/hudson/job/Synapse%20-%20Trunk/ws/java/modules/war/../distribution/src/main/release/docs]>
to[<http://hudson.zones.apache.org/hudson/job/Synapse%20-%20Trunk/ws/java/modules/war/target/synapse]>
[INFO] Copying webapp webResources[<http://hudson.zones.apache.org/hudson/job/Synapse%20-%20Trunk/ws/java/modules/war/../../src/site/resources]>
to[<http://hudson.zones.apache.org/hudson/job/Synapse%20-%20Trunk/ws/java/modules/war/target/synapse]>
[INFO] Copying webapp webResources[<http://hudson.zones.apache.org/hudson/job/Synapse%20-%20Trunk/ws/java/modules/war/../../repository/conf]>
to[<http://hudson.zones.apache.org/hudson/job/Synapse%20-%20Trunk/ws/java/modules/war/target/synapse]>
[INFO] Copying webapp webResources[<http://hudson.zones.apache.org/hudson/job/Synapse%20-%20Trunk/ws/java/modules/war/../../repository/conf]>
to[<http://hudson.zones.apache.org/hudson/job/Synapse%20-%20Trunk/ws/java/modules/war/target/synapse]>
[INFO] Webapp assembled in[5929 msecs]
[INFO] Building war: <http://hudson.zones.apache.org/hudson/job/Synapse%20-%20Trunk/ws/java/target/synapse.war>
[INFO] [install:install {execution: default-install}]
[INFO] Installing target/synapse.war to /export/home/hudson/.m2/repository/org/apache/synapse/synapse-war/2.0.0-SNAPSHOT/synapse-war-2.0.0-SNAPSHOT.war
[HUDSON] Archiving <http://hudson.zones.apache.org/hudson/job/Synapse%20-%20Trunk/ws/java/modules/war/pom.xml>
to /export/home/hudson/hudson/jobs/Synapse - Trunk/modules/org.apache.synapse$synapse-war/builds/2010-07-08_12-02-50/archive/org.apache.synapse/synapse-war/2.0.0-SNAPSHOT/pom.xml
[HUDSON] Archiving target/synapse.war to /export/home/hudson/hudson/jobs/Synapse - Trunk/modules/org.apache.synapse$synapse-war/builds/2010-07-08_12-02-50/archive/org.apache.synapse/synapse-war/2.0.0-SNAPSHOT/synapse.war
[locks-and-latches] Releasing all the locks
[locks-and-latches] All the locks released
ERROR: Failed to parse POMs
hudson.util.IOException2: Failed to join the process
	at hudson.Proc$RemoteProc.join(Proc.java:355)
	at hudson.maven.ProcessCache$MavenProcess.call(ProcessCache.java:164)
	at hudson.maven.MavenModuleSetBuild$RunnerImpl.doRun(MavenModuleSetBuild.java:483)
	at hudson.model.AbstractBuild$AbstractRunner.run(AbstractBuild.java:416)
	at hudson.model.Run.run(Run.java:1257)
	at hudson.maven.MavenModuleSetBuild.run(MavenModuleSetBuild.java:306)
	at hudson.model.ResourceController.execute(ResourceController.java:88)
	at hudson.model.Executor.run(Executor.java:127)
Caused by: java.util.concurrent.ExecutionException: hudson.remoting.RequestAbortedException:
java.io.IOException: Unexpected termination of the channel
	at hudson.remoting.Request$1.get(Request.java:218)
	at hudson.remoting.Request$1.get(Request.java:172)
	at hudson.remoting.FutureAdapter.get(FutureAdapter.java:55)
	at hudson.Proc$RemoteProc.join(Proc.java:347)
	... 7 more
Caused by: hudson.remoting.RequestAbortedException: java.io.IOException: Unexpected termination
of the channel
	at hudson.remoting.Request.abort(Request.java:257)
	at hudson.remoting.Channel.terminate(Channel.java:602)
	at hudson.remoting.Channel$ReaderThread.run(Channel.java:893)
Caused by: java.io.IOException: Unexpected termination of the channel
	at hudson.remoting.Channel$ReaderThread.run(Channel.java:875)
Caused by: java.io.EOFException
	at java.io.ObjectInputStream$BlockDataInputStream.peekByte(ObjectInputStream.java:2554)
	at java.io.ObjectInputStream.readObject0(ObjectInputStream.java:1297)
	at java.io.ObjectInputStream.readObject(ObjectInputStream.java:351)
	at hudson.remoting.Channel$ReaderThread.run(Channel.java:869)
FATAL: channel is already closed
hudson.remoting.ChannelClosedException: channel is already closed
	at hudson.remoting.Channel.send(Channel.java:412)
	at hudson.remoting.Request.call(Request.java:105)
	at hudson.remoting.Channel.call(Channel.java:555)
	at hudson.Launcher$RemoteLauncher.kill(Launcher.java:744)
	at hudson.model.AbstractBuild$AbstractRunner.run(AbstractBuild.java:421)
	at hudson.model.Run.run(Run.java:1257)
	at hudson.maven.MavenModuleSetBuild.run(MavenModuleSetBuild.java:306)
	at hudson.model.ResourceController.execute(ResourceController.java:88)
	at hudson.model.Executor.run(Executor.java:127)


---------------------------------------------------------------------
To unsubscribe, e-mail: dev-unsubscribe@synapse.apache.org
For additional commands, e-mail: dev-help@synapse.apache.org


Mime
View raw message