synapse-dev mailing list archives

Site index · List index
Message view « Date » · « Thread »
Top « Date » · « Thread »
From Apache Hudson Server <hud...@hudson.zones.apache.org>
Subject Build failed in Hudson: Synapse - Trunk #2457
Date Tue, 20 Jul 2010 06:04:03 GMT
See <http://hudson.zones.apache.org/hudson/job/Synapse%20-%20Trunk/2457/>

------------------------------------------
[...truncated 317 lines...]
Tests run: 5, Failures: 0, Errors: 0, Skipped: 0, Time elapsed: 0.278 sec
Running org.apache.synapse.commons.executors.MultiPriorityBlockingQueueTest
Tests run: 8, Failures: 0, Errors: 0, Skipped: 0, Time elapsed: 0.212 sec

Results :
Tests run: 24, Failures: 0, Errors: 0, Skipped: 0

[HUDSON] Recording test results
Downloading: http://people.apache.org/repo/m2-snapshot-repository//org/apache/axis2/axis2-transport-base/1.1.0-SNAPSHOT/axis2-transport-base-1.1.0-SNAPSHOT.jar
[INFO] Unable to find resource 'org.apache.axis2:axis2-transport-base:jar:1.1.0-SNAPSHOT'
in repository apache-snapshots (http://people.apache.org/repo/m2-snapshot-repository/)
Downloading: http://dist.wso2.org/snapshots/maven2//org/apache/axis2/axis2-transport-base/1.1.0-SNAPSHOT/axis2-transport-base-1.1.0-SNAPSHOT.jar
[INFO] Unable to find resource 'org.apache.axis2:axis2-transport-base:jar:1.1.0-SNAPSHOT'
in repository wso2-m2-snapshots (http://dist.wso2.org/snapshots/maven2/)
Downloading: http://people.apache.org/repo/m2-snapshot-repository//org/apache/axis2/axis2-transport-base/1.1.0-SNAPSHOT/axis2-transport-base-1.1.0-SNAPSHOT.jar
[INFO] Unable to find resource 'org.apache.axis2:axis2-transport-base:jar:1.1.0-SNAPSHOT'
in repository apache-snapshots (http://people.apache.org/repo/m2-snapshot-repository/)
Downloading: http://dist.wso2.org/snapshots/maven2//org/apache/axis2/axis2-transport-base/1.1.0-SNAPSHOT/axis2-transport-base-1.1.0-SNAPSHOT.jar
[INFO] Unable to find resource 'org.apache.axis2:axis2-transport-base:jar:1.1.0-SNAPSHOT'
in repository wso2-m2-snapshots (http://dist.wso2.org/snapshots/maven2/)
[INFO] [bundle:bundle {execution: default-bundle}]
[INFO] [install:install {execution: default-install}]
[INFO] Installing <http://hudson.zones.apache.org/hudson/job/Synapse%20-%20Trunk/ws/java/modules/commons/target/synapse-commons-2.0.0-SNAPSHOT.jar>
to /home/hudson/.m2/repository/org/apache/synapse/synapse-commons/2.0.0-SNAPSHOT/synapse-commons-2.0.0-SNAPSHOT.jar
[INFO] [bundle:install {execution: default-install}]
[INFO] Parsing file:/home/hudson/.m2/repository/repository.xml
[Fatal Error] :-1:-1: Premature end of file.
org.xml.sax.SAXParseException: Premature end of file.
	at com.sun.org.apache.xerces.internal.parsers.DOMParser.parse(DOMParser.java:264)
	at com.sun.org.apache.xerces.internal.jaxp.DocumentBuilderImpl.parse(DocumentBuilderImpl.java:292)
	at javax.xml.parsers.DocumentBuilder.parse(DocumentBuilder.java:172)
	at org.apache.felix.obrplugin.ObrUpdate.parseFile(ObrUpdate.java:347)
	at org.apache.felix.obrplugin.ObrUpdate.parseRepositoryXml(ObrUpdate.java:324)
	at org.apache.felix.obrplugin.ObrInstall.execute(ObrInstall.java:136)
	at org.apache.maven.plugin.DefaultPluginManager.executeMojo(DefaultPluginManager.java:490)
	at hudson.maven.agent.PluginManagerInterceptor.executeMojo(PluginManagerInterceptor.java:182)
	at org.apache.maven.lifecycle.DefaultLifecycleExecutor.executeGoals(DefaultLifecycleExecutor.java:694)
	at org.apache.maven.lifecycle.DefaultLifecycleExecutor.executeGoalWithLifecycle(DefaultLifecycleExecutor.java:556)
	at org.apache.maven.lifecycle.DefaultLifecycleExecutor.executeGoal(DefaultLifecycleExecutor.java:535)
	at org.apache.maven.lifecycle.DefaultLifecycleExecutor.executeGoalAndHandleFailures(DefaultLifecycleExecutor.java:387)
	at org.apache.maven.lifecycle.DefaultLifecycleExecutor.executeTaskSegments(DefaultLifecycleExecutor.java:348)
	at org.apache.maven.lifecycle.DefaultLifecycleExecutor.execute(DefaultLifecycleExecutor.java:180)
	at org.apache.maven.lifecycle.LifecycleExecutorInterceptor.execute(LifecycleExecutorInterceptor.java:65)
	at org.apache.maven.DefaultMaven.doExecute(DefaultMaven.java:328)
	at org.apache.maven.DefaultMaven.execute(DefaultMaven.java:138)
	at org.apache.maven.cli.MavenCli.main(MavenCli.java:362)
	at sun.reflect.NativeMethodAccessorImpl.invoke0(Native Method)
	at sun.reflect.NativeMethodAccessorImpl.invoke(NativeMethodAccessorImpl.java:39)
	at sun.reflect.DelegatingMethodAccessorImpl.invoke(DelegatingMethodAccessorImpl.java:25)
	at java.lang.reflect.Method.invoke(Method.java:592)
	at org.codehaus.classworlds.Launcher.launchEnhanced(Launcher.java:315)
	at org.codehaus.classworlds.Launcher.launch(Launcher.java:255)
	at hudson.maven.agent.Main.launch(Main.java:165)
	at hudson.maven.MavenBuilder.call(MavenBuilder.java:165)
	at hudson.maven.MavenModuleSetBuild$Builder.call(MavenModuleSetBuild.java:696)
	at hudson.maven.MavenModuleSetBuild$Builder.call(MavenModuleSetBuild.java:640)
	at hudson.remoting.UserRequest.perform(UserRequest.java:114)
	at hudson.remoting.UserRequest.perform(UserRequest.java:48)
	at hudson.remoting.Request$2.run(Request.java:270)
	at java.util.concurrent.Executors$RunnableAdapter.call(Executors.java:417)
	at java.util.concurrent.FutureTask$Sync.innerRun(FutureTask.java:269)
	at java.util.concurrent.FutureTask.run(FutureTask.java:123)
	at java.util.concurrent.ThreadPoolExecutor$Worker.runTask(ThreadPoolExecutor.java:651)
	at java.util.concurrent.ThreadPoolExecutor$Worker.run(ThreadPoolExecutor.java:676)
	at java.lang.Thread.run(Thread.java:595)
[INFO] Writing OBR metadata
[WARNING] Exception while updating local OBR: null
java.lang.NullPointerException
	at org.apache.felix.obrplugin.ObrUpdate.writeRepositoryXml(ObrUpdate.java:268)
	at org.apache.felix.obrplugin.ObrInstall.execute(ObrInstall.java:144)
	at org.apache.maven.plugin.DefaultPluginManager.executeMojo(DefaultPluginManager.java:490)
	at hudson.maven.agent.PluginManagerInterceptor.executeMojo(PluginManagerInterceptor.java:182)
	at org.apache.maven.lifecycle.DefaultLifecycleExecutor.executeGoals(DefaultLifecycleExecutor.java:694)
	at org.apache.maven.lifecycle.DefaultLifecycleExecutor.executeGoalWithLifecycle(DefaultLifecycleExecutor.java:556)
	at org.apache.maven.lifecycle.DefaultLifecycleExecutor.executeGoal(DefaultLifecycleExecutor.java:535)
	at org.apache.maven.lifecycle.DefaultLifecycleExecutor.executeGoalAndHandleFailures(DefaultLifecycleExecutor.java:387)
	at org.apache.maven.lifecycle.DefaultLifecycleExecutor.executeTaskSegments(DefaultLifecycleExecutor.java:348)
	at org.apache.maven.lifecycle.DefaultLifecycleExecutor.execute(DefaultLifecycleExecutor.java:180)
	at org.apache.maven.lifecycle.LifecycleExecutorInterceptor.execute(LifecycleExecutorInterceptor.java:65)
	at org.apache.maven.DefaultMaven.doExecute(DefaultMaven.java:328)
	at org.apache.maven.DefaultMaven.execute(DefaultMaven.java:138)
	at org.apache.maven.cli.MavenCli.main(MavenCli.java:362)
	at sun.reflect.NativeMethodAccessorImpl.invoke0(Native Method)
	at sun.reflect.NativeMethodAccessorImpl.invoke(NativeMethodAccessorImpl.java:39)
	at sun.reflect.DelegatingMethodAccessorImpl.invoke(DelegatingMethodAccessorImpl.java:25)
	at java.lang.reflect.Method.invoke(Method.java:592)
	at org.codehaus.classworlds.Launcher.launchEnhanced(Launcher.java:315)
	at org.codehaus.classworlds.Launcher.launch(Launcher.java:255)
	at hudson.maven.agent.Main.launch(Main.java:165)
	at hudson.maven.MavenBuilder.call(MavenBuilder.java:165)
	at hudson.maven.MavenModuleSetBuild$Builder.call(MavenModuleSetBuild.java:696)
	at hudson.maven.MavenModuleSetBuild$Builder.call(MavenModuleSetBuild.java:640)
	at hudson.remoting.UserRequest.perform(UserRequest.java:114)
	at hudson.remoting.UserRequest.perform(UserRequest.java:48)
	at hudson.remoting.Request$2.run(Request.java:270)
	at java.util.concurrent.Executors$RunnableAdapter.call(Executors.java:417)
	at java.util.concurrent.FutureTask$Sync.innerRun(FutureTask.java:269)
	at java.util.concurrent.FutureTask.run(FutureTask.java:123)
	at java.util.concurrent.ThreadPoolExecutor$Worker.runTask(ThreadPoolExecutor.java:651)
	at java.util.concurrent.ThreadPoolExecutor$Worker.run(ThreadPoolExecutor.java:676)
	at java.lang.Thread.run(Thread.java:595)
[HUDSON] Archiving <http://hudson.zones.apache.org/hudson/job/Synapse%20-%20Trunk/ws/java/modules/commons/pom.xml>
to /export/home/hudson/hudson/jobs/Synapse - Trunk/modules/org.apache.synapse$synapse-commons/builds/2010-07-20_06-02-50/archive/org.apache.synapse/synapse-commons/2.0.0-SNAPSHOT/pom.xml
[HUDSON] Archiving <http://hudson.zones.apache.org/hudson/job/Synapse%20-%20Trunk/ws/java/modules/commons/target/synapse-commons-2.0.0-SNAPSHOT.jar>
to /export/home/hudson/hudson/jobs/Synapse - Trunk/modules/org.apache.synapse$synapse-commons/builds/2010-07-20_06-02-50/archive/org.apache.synapse/synapse-commons/2.0.0-SNAPSHOT/synapse-commons-2.0.0-SNAPSHOT.jar
[INFO] ------------------------------------------------------------------------
[INFO] Building Apache Synapse - Transports
[INFO]    task-segment: [clean, install]
[INFO] ------------------------------------------------------------------------
[INFO] [clean:clean {execution: default-clean}]
[INFO] Deleting directory <http://hudson.zones.apache.org/hudson/job/Synapse%20-%20Trunk/ws/java/modules/transports/target>
[INFO] [remote-resources:process {execution: default}]
[INFO] snapshot org.apache.axis2:axis2-transport-testkit:1.1.0-SNAPSHOT: checking for updates
from apache-snapshots
[INFO] snapshot org.apache.axis2:axis2-transport-testkit:1.1.0-SNAPSHOT: checking for updates
from wso2-m2-snapshots
Downloading: http://people.apache.org/repo/m2-snapshot-repository//org/apache/axis2/axis2-transport-testkit/1.1.0-SNAPSHOT/axis2-transport-testkit-1.1.0-SNAPSHOT.pom
[INFO] Unable to find resource 'org.apache.axis2:axis2-transport-testkit:pom:1.1.0-SNAPSHOT'
in repository apache-snapshots (http://people.apache.org/repo/m2-snapshot-repository/)
Downloading: http://dist.wso2.org/snapshots/maven2//org/apache/axis2/axis2-transport-testkit/1.1.0-SNAPSHOT/axis2-transport-testkit-1.1.0-SNAPSHOT.pom
[INFO] Unable to find resource 'org.apache.axis2:axis2-transport-testkit:pom:1.1.0-SNAPSHOT'
in repository wso2-m2-snapshots (http://dist.wso2.org/snapshots/maven2/)
[INFO] snapshot org.apache.synapse:synapse-commons:2.0.0-SNAPSHOT: checking for updates from
apache-snapshots
Downloading: http://people.apache.org/repo/m2-snapshot-repository//org/apache/axis2/axis2-transport-base/1.1.0-SNAPSHOT/axis2-transport-base-1.1.0-SNAPSHOT.jar
[INFO] snapshot org.apache.synapse:synapse-commons:2.0.0-SNAPSHOT: checking for updates from
wso2-m2-snapshots
[INFO] Unable to find resource 'org.apache.axis2:axis2-transport-base:jar:1.1.0-SNAPSHOT'
in repository apache-snapshots (http://people.apache.org/repo/m2-snapshot-repository/)
Downloading: http://dist.wso2.org/snapshots/maven2//org/apache/axis2/axis2-transport-base/1.1.0-SNAPSHOT/axis2-transport-base-1.1.0-SNAPSHOT.jar
[INFO] Unable to find resource 'org.apache.axis2:axis2-transport-base:jar:1.1.0-SNAPSHOT'
in repository wso2-m2-snapshots (http://dist.wso2.org/snapshots/maven2/)
Downloading: http://people.apache.org/repo/m2-snapshot-repository//org/apache/axis2/axis2-transport-testkit/1.1.0-SNAPSHOT/axis2-transport-testkit-1.1.0-SNAPSHOT.jar
[INFO] Unable to find resource 'org.apache.axis2:axis2-transport-testkit:jar:1.1.0-SNAPSHOT'
in repository apache-snapshots (http://people.apache.org/repo/m2-snapshot-repository/)
Downloading: http://dist.wso2.org/snapshots/maven2//org/apache/axis2/axis2-transport-testkit/1.1.0-SNAPSHOT/axis2-transport-testkit-1.1.0-SNAPSHOT.jar
[INFO] Unable to find resource 'org.apache.axis2:axis2-transport-testkit:jar:1.1.0-SNAPSHOT'
in repository wso2-m2-snapshots (http://dist.wso2.org/snapshots/maven2/)
[INFO] [site:attach-descriptor {execution: default-attach-descriptor}]
[INFO] [install:install {execution: default-install}]
[INFO] Installing <http://hudson.zones.apache.org/hudson/job/Synapse%20-%20Trunk/ws/java/modules/transports/pom.xml>
to /home/hudson/.m2/repository/org/apache/synapse/synapse-transports/2.0.0-SNAPSHOT/synapse-transports-2.0.0-SNAPSHOT.pom
[HUDSON] Archiving <http://hudson.zones.apache.org/hudson/job/Synapse%20-%20Trunk/ws/java/modules/transports/pom.xml>
to /export/home/hudson/hudson/jobs/Synapse - Trunk/modules/org.apache.synapse$synapse-transports/builds/2010-07-20_06-02-50/archive/org.apache.synapse/synapse-transports/2.0.0-SNAPSHOT/pom.xml
[HUDSON] Archiving /home/hudson/.m2/repository/org/apache/synapse/synapse-transports/2.0.0-SNAPSHOT/synapse-transports-2.0.0-SNAPSHOT.pom
to /export/home/hudson/hudson/jobs/Synapse - Trunk/modules/org.apache.synapse$synapse-transports/builds/2010-07-20_06-02-50/archive/org.apache.synapse/synapse-transports/2.0.0-SNAPSHOT/synapse-transports-2.0.0-SNAPSHOT.pom
[INFO] ------------------------------------------------------------------------
[INFO] Building Apache Synapse - Non-blocking HTTP/s Transport
[INFO]    task-segment: [clean, install]
[INFO] ------------------------------------------------------------------------
[INFO] [clean:clean {execution: default-clean}]
[INFO] Deleting directory <http://hudson.zones.apache.org/hudson/job/Synapse%20-%20Trunk/ws/java/modules/transports/core/nhttp/target>
[INFO] [remote-resources:process {execution: default}]
[INFO] snapshot org.apache.axis2:axis2-transport-http:SNAPSHOT: checking for updates from
apache-snapshots
[INFO] snapshot org.apache.axis2:axis2-transport-http:SNAPSHOT: checking for updates from
wso2-m2-snapshots
Downloading: http://people.apache.org/repo/m2-snapshot-repository//org/apache/axis2/axis2-transport-base/1.1.0-SNAPSHOT/axis2-transport-base-1.1.0-SNAPSHOT.jar
[INFO] Unable to find resource 'org.apache.axis2:axis2-transport-base:jar:1.1.0-SNAPSHOT'
in repository apache-snapshots (http://people.apache.org/repo/m2-snapshot-repository/)
Downloading: http://dist.wso2.org/snapshots/maven2//org/apache/axis2/axis2-transport-base/1.1.0-SNAPSHOT/axis2-transport-base-1.1.0-SNAPSHOT.jar
[INFO] Unable to find resource 'org.apache.axis2:axis2-transport-base:jar:1.1.0-SNAPSHOT'
in repository wso2-m2-snapshots (http://dist.wso2.org/snapshots/maven2/)
Downloading: http://people.apache.org/repo/m2-snapshot-repository//org/apache/axis2/axis2-transport-testkit/1.1.0-SNAPSHOT/axis2-transport-testkit-1.1.0-SNAPSHOT.jar
[INFO] Unable to find resource 'org.apache.axis2:axis2-transport-testkit:jar:1.1.0-SNAPSHOT'
in repository apache-snapshots (http://people.apache.org/repo/m2-snapshot-repository/)
Downloading: http://dist.wso2.org/snapshots/maven2//org/apache/axis2/axis2-transport-testkit/1.1.0-SNAPSHOT/axis2-transport-testkit-1.1.0-SNAPSHOT.jar
[INFO] Unable to find resource 'org.apache.axis2:axis2-transport-testkit:jar:1.1.0-SNAPSHOT'
in repository wso2-m2-snapshots (http://dist.wso2.org/snapshots/maven2/)
[INFO] [resources:resources {execution: default-resources}]
[INFO] Using encoding: 'UTF-8' to copy filtered resources.
Downloading: http://people.apache.org/repo/m2-snapshot-repository//org/apache/axis2/axis2-transport-base/1.1.0-SNAPSHOT/axis2-transport-base-1.1.0-SNAPSHOT.jar
[INFO] Unable to find resource 'org.apache.axis2:axis2-transport-base:jar:1.1.0-SNAPSHOT'
in repository apache-snapshots (http://people.apache.org/repo/m2-snapshot-repository/)
Downloading: http://dist.wso2.org/snapshots/maven2//org/apache/axis2/axis2-transport-base/1.1.0-SNAPSHOT/axis2-transport-base-1.1.0-SNAPSHOT.jar
[INFO] Unable to find resource 'org.apache.axis2:axis2-transport-base:jar:1.1.0-SNAPSHOT'
in repository wso2-m2-snapshots (http://dist.wso2.org/snapshots/maven2/)
Downloading: http://people.apache.org/repo/m2-snapshot-repository//org/apache/axis2/axis2-transport-base/1.1.0-SNAPSHOT/axis2-transport-base-1.1.0-SNAPSHOT.jar
[INFO] Unable to find resource 'org.apache.axis2:axis2-transport-base:jar:1.1.0-SNAPSHOT'
in repository apache-snapshots (http://people.apache.org/repo/m2-snapshot-repository/)
Downloading: http://dist.wso2.org/snapshots/maven2//org/apache/axis2/axis2-transport-base/1.1.0-SNAPSHOT/axis2-transport-base-1.1.0-SNAPSHOT.jar
[INFO] Unable to find resource 'org.apache.axis2:axis2-transport-base:jar:1.1.0-SNAPSHOT'
in repository wso2-m2-snapshots (http://dist.wso2.org/snapshots/maven2/)
[INFO] [compiler:compile {execution: default-compile}]
Compiling 39 source files to <http://hudson.zones.apache.org/hudson/job/Synapse%20-%20Trunk/ws/java/modules/transports/core/nhttp/target/classes>
[INFO] [dependency:copy {execution: copy}]
[INFO] Configured Artifact: org.aspectj:aspectjweaver:?:jar
[INFO] Copying aspectjweaver-1.6.1.jar to <http://hudson.zones.apache.org/hudson/job/Synapse%20-%20Trunk/ws/java/modules/transports/core/nhttp/target/lib/aspectjweaver.jar>
[INFO] [resources:testResources {execution: default-testResources}]
[INFO] Using encoding: 'UTF-8' to copy filtered resources.
Downloading: http://people.apache.org/repo/m2-snapshot-repository//org/apache/axis2/axis2-transport-base/1.1.0-SNAPSHOT/axis2-transport-base-1.1.0-SNAPSHOT.jar
[INFO] Unable to find resource 'org.apache.axis2:axis2-transport-base:jar:1.1.0-SNAPSHOT'
in repository apache-snapshots (http://people.apache.org/repo/m2-snapshot-repository/)
Downloading: http://dist.wso2.org/snapshots/maven2//org/apache/axis2/axis2-transport-base/1.1.0-SNAPSHOT/axis2-transport-base-1.1.0-SNAPSHOT.jar
[INFO] Unable to find resource 'org.apache.axis2:axis2-transport-base:jar:1.1.0-SNAPSHOT'
in repository wso2-m2-snapshots (http://dist.wso2.org/snapshots/maven2/)
Downloading: http://people.apache.org/repo/m2-snapshot-repository//org/apache/axis2/axis2-transport-testkit/1.1.0-SNAPSHOT/axis2-transport-testkit-1.1.0-SNAPSHOT.jar
[INFO] Unable to find resource 'org.apache.axis2:axis2-transport-testkit:jar:1.1.0-SNAPSHOT'
in repository apache-snapshots (http://people.apache.org/repo/m2-snapshot-repository/)
Downloading: http://dist.wso2.org/snapshots/maven2//org/apache/axis2/axis2-transport-testkit/1.1.0-SNAPSHOT/axis2-transport-testkit-1.1.0-SNAPSHOT.jar
[INFO] Unable to find resource 'org.apache.axis2:axis2-transport-testkit:jar:1.1.0-SNAPSHOT'
in repository wso2-m2-snapshots (http://dist.wso2.org/snapshots/maven2/)
Downloading: http://people.apache.org/repo/m2-snapshot-repository//org/apache/axis2/axis2-transport-base/1.1.0-SNAPSHOT/axis2-transport-base-1.1.0-SNAPSHOT.jar
[INFO] Unable to find resource 'org.apache.axis2:axis2-transport-base:jar:1.1.0-SNAPSHOT'
in repository apache-snapshots (http://people.apache.org/repo/m2-snapshot-repository/)
Downloading: http://dist.wso2.org/snapshots/maven2//org/apache/axis2/axis2-transport-base/1.1.0-SNAPSHOT/axis2-transport-base-1.1.0-SNAPSHOT.jar
[INFO] Unable to find resource 'org.apache.axis2:axis2-transport-base:jar:1.1.0-SNAPSHOT'
in repository wso2-m2-snapshots (http://dist.wso2.org/snapshots/maven2/)
Downloading: http://people.apache.org/repo/m2-snapshot-repository//org/apache/axis2/axis2-transport-testkit/1.1.0-SNAPSHOT/axis2-transport-testkit-1.1.0-SNAPSHOT.jar
[INFO] Unable to find resource 'org.apache.axis2:axis2-transport-testkit:jar:1.1.0-SNAPSHOT'
in repository apache-snapshots (http://people.apache.org/repo/m2-snapshot-repository/)
Downloading: http://dist.wso2.org/snapshots/maven2//org/apache/axis2/axis2-transport-testkit/1.1.0-SNAPSHOT/axis2-transport-testkit-1.1.0-SNAPSHOT.jar
[INFO] Unable to find resource 'org.apache.axis2:axis2-transport-testkit:jar:1.1.0-SNAPSHOT'
in repository wso2-m2-snapshots (http://dist.wso2.org/snapshots/maven2/)
[INFO] [compiler:testCompile {execution: default-testCompile}]
Compiling 3 source files to <http://hudson.zones.apache.org/hudson/job/Synapse%20-%20Trunk/ws/java/modules/transports/core/nhttp/target/test-classes>
Downloading: http://people.apache.org/repo/m2-snapshot-repository//org/apache/axis2/axis2-transport-base/1.1.0-SNAPSHOT/axis2-transport-base-1.1.0-SNAPSHOT.jar
[INFO] Unable to find resource 'org.apache.axis2:axis2-transport-base:jar:1.1.0-SNAPSHOT'
in repository apache-snapshots (http://people.apache.org/repo/m2-snapshot-repository/)
Downloading: http://dist.wso2.org/snapshots/maven2//org/apache/axis2/axis2-transport-base/1.1.0-SNAPSHOT/axis2-transport-base-1.1.0-SNAPSHOT.jar
[INFO] Unable to find resource 'org.apache.axis2:axis2-transport-base:jar:1.1.0-SNAPSHOT'
in repository wso2-m2-snapshots (http://dist.wso2.org/snapshots/maven2/)
Downloading: http://people.apache.org/repo/m2-snapshot-repository//org/apache/axis2/axis2-transport-testkit/1.1.0-SNAPSHOT/axis2-transport-testkit-1.1.0-SNAPSHOT.jar
[INFO] Unable to find resource 'org.apache.axis2:axis2-transport-testkit:jar:1.1.0-SNAPSHOT'
in repository apache-snapshots (http://people.apache.org/repo/m2-snapshot-repository/)
Downloading: http://dist.wso2.org/snapshots/maven2//org/apache/axis2/axis2-transport-testkit/1.1.0-SNAPSHOT/axis2-transport-testkit-1.1.0-SNAPSHOT.jar
[INFO] Unable to find resource 'org.apache.axis2:axis2-transport-testkit:jar:1.1.0-SNAPSHOT'
in repository wso2-m2-snapshots (http://dist.wso2.org/snapshots/maven2/)
Downloading: http://people.apache.org/repo/m2-snapshot-repository//org/apache/axis2/axis2-transport-base/1.1.0-SNAPSHOT/axis2-transport-base-1.1.0-SNAPSHOT.jar
[INFO] Unable to find resource 'org.apache.axis2:axis2-transport-base:jar:1.1.0-SNAPSHOT'
in repository apache-snapshots (http://people.apache.org/repo/m2-snapshot-repository/)
Downloading: http://dist.wso2.org/snapshots/maven2//org/apache/axis2/axis2-transport-base/1.1.0-SNAPSHOT/axis2-transport-base-1.1.0-SNAPSHOT.jar
[INFO] Unable to find resource 'org.apache.axis2:axis2-transport-base:jar:1.1.0-SNAPSHOT'
in repository wso2-m2-snapshots (http://dist.wso2.org/snapshots/maven2/)
Downloading: http://people.apache.org/repo/m2-snapshot-repository//org/apache/axis2/axis2-transport-testkit/1.1.0-SNAPSHOT/axis2-transport-testkit-1.1.0-SNAPSHOT.jar
[INFO] Unable to find resource 'org.apache.axis2:axis2-transport-testkit:jar:1.1.0-SNAPSHOT'
in repository apache-snapshots (http://people.apache.org/repo/m2-snapshot-repository/)
Downloading: http://dist.wso2.org/snapshots/maven2//org/apache/axis2/axis2-transport-testkit/1.1.0-SNAPSHOT/axis2-transport-testkit-1.1.0-SNAPSHOT.jar
[INFO] Unable to find resource 'org.apache.axis2:axis2-transport-testkit:jar:1.1.0-SNAPSHOT'
in repository wso2-m2-snapshots (http://dist.wso2.org/snapshots/maven2/)
[INFO] [surefire:test {execution: default-test}]
[INFO] Surefire report directory: <http://hudson.zones.apache.org/hudson/job/Synapse%20-%20Trunk/ws/java/modules/transports/core/nhttp/target/surefire-reports>
org.apache.maven.surefire.booter.SurefireExecutionException: org.apache.synapse.transport.nhttp.HttpCoreNIOListenerTest;
nested exception is java.lang.NoClassDefFoundError: javax/mail/internet/ParseException; nested
exception is org.apache.maven.surefire.testset.TestSetFailedException: org.apache.synapse.transport.nhttp.HttpCoreNIOListenerTest;
nested exception is java.lang.NoClassDefFoundError: javax/mail/internet/ParseException
org.apache.maven.surefire.testset.TestSetFailedException: org.apache.synapse.transport.nhttp.HttpCoreNIOListenerTest;
nested exception is java.lang.NoClassDefFoundError: javax/mail/internet/ParseException
java.lang.NoClassDefFoundError: javax/mail/internet/ParseException
	at org.apache.axis2.transport.testkit.http.HttpTransportTestSuiteBuilder.build(HttpTransportTestSuiteBuilder.java:72)
	at org.apache.synapse.transport.nhttp.HttpCoreNIOListenerTest.suite(HttpCoreNIOListenerTest.java:43)
	at sun.reflect.NativeMethodAccessorImpl.invoke0(Native Method)
	at sun.reflect.NativeMethodAccessorImpl.invoke(NativeMethodAccessorImpl.java:39)
	at sun.reflect.DelegatingMethodAccessorImpl.invoke(DelegatingMethodAccessorImpl.java:25)
	at java.lang.reflect.Method.invoke(Method.java:592)
	at org.apache.maven.surefire.junit.JUnitTestSet.createInstanceFromSuiteMethod(JUnitTestSet.java:180)
	at org.apache.maven.surefire.junit.JUnitTestSet.constructTestObject(JUnitTestSet.java:140)
	at org.apache.maven.surefire.junit.JUnitTestSet.getTestCount(JUnitTestSet.java:247)
	at org.apache.maven.surefire.suite.AbstractDirectoryTestSuite.locateTestSets(AbstractDirectoryTestSuite.java:104)
	at org.apache.maven.surefire.Surefire.createSuiteFromDefinition(Surefire.java:150)
	at org.apache.maven.surefire.Surefire.run(Surefire.java:111)
	at sun.reflect.NativeMethodAccessorImpl.invoke0(Native Method)
	at sun.reflect.NativeMethodAccessorImpl.invoke(NativeMethodAccessorImpl.java:39)
	at sun.reflect.DelegatingMethodAccessorImpl.invoke(DelegatingMethodAccessorImpl.java:25)
	at java.lang.reflect.Method.invoke(Method.java:592)
	at org.apache.maven.surefire.booter.SurefireBooter.runSuitesInProcess(SurefireBooter.java:290)
	at org.apache.maven.surefire.booter.SurefireBooter.main(SurefireBooter.java:818)
[ERROR] There are test failures.
Downloading: http://people.apache.org/repo/m2-snapshot-repository//org/apache/axis2/axis2-transport-base/1.1.0-SNAPSHOT/axis2-transport-base-1.1.0-SNAPSHOT.jar
[HUDSON] Recording test results[INFO] Unable to find resource 'org.apache.axis2:axis2-transport-base:jar:1.1.0-SNAPSHOT'
in repository apache-snapshots (http://people.apache.org/repo/m2-snapshot-repository/)
Downloading: http://dist.wso2.org/snapshots/maven2//org/apache/axis2/axis2-transport-base/1.1.0-SNAPSHOT/axis2-transport-base-1.1.0-SNAPSHOT.jar

[INFO] Unable to find resource 'org.apache.axis2:axis2-transport-base:jar:1.1.0-SNAPSHOT'
in repository wso2-m2-snapshots (http://dist.wso2.org/snapshots/maven2/)
Downloading: http://people.apache.org/repo/m2-snapshot-repository//org/apache/axis2/axis2-transport-base/1.1.0-SNAPSHOT/axis2-transport-base-1.1.0-SNAPSHOT.jar
[INFO] Unable to find resource 'org.apache.axis2:axis2-transport-base:jar:1.1.0-SNAPSHOT'
in repository apache-snapshots (http://people.apache.org/repo/m2-snapshot-repository/)
Downloading: http://dist.wso2.org/snapshots/maven2//org/apache/axis2/axis2-transport-base/1.1.0-SNAPSHOT/axis2-transport-base-1.1.0-SNAPSHOT.jar
[INFO] Unable to find resource 'org.apache.axis2:axis2-transport-base:jar:1.1.0-SNAPSHOT'
in repository wso2-m2-snapshots (http://dist.wso2.org/snapshots/maven2/)
[INFO] [bundle:bundle {execution: default-bundle}]
[INFO] [assembly:attached {execution: attach-testkit-logs}]
[INFO] Reading assembly descriptor: src/main/assembly/testkit-logs.xml
[HUDSON] Archiving <http://hudson.zones.apache.org/hudson/job/Synapse%20-%20Trunk/ws/java/modules/transports/core/nhttp/pom.xml>
to /export/home/hudson/hudson/jobs/Synapse - Trunk/modules/org.apache.synapse$synapse-nhttp-transport/builds/2010-07-20_06-02-50/archive/org.apache.synapse/synapse-nhttp-transport/2.0.0-SNAPSHOT/pom.xml
[HUDSON] Archiving <http://hudson.zones.apache.org/hudson/job/Synapse%20-%20Trunk/ws/java/modules/transports/core/nhttp/target/synapse-nhttp-transport-2.0.0-SNAPSHOT.jar>
to /export/home/hudson/hudson/jobs/Synapse - Trunk/modules/org.apache.synapse$synapse-nhttp-transport/builds/2010-07-20_06-02-50/archive/org.apache.synapse/synapse-nhttp-transport/2.0.0-SNAPSHOT/synapse-nhttp-transport-2.0.0-SNAPSHOT.jar
[INFO] ------------------------------------------------------------------------
[ERROR] BUILD ERROR
[INFO] ------------------------------------------------------------------------
[INFO] Failed to create assembly: Error creating assembly archive testkit-logs: You must set
at least one file.

[INFO] ------------------------------------------------------------------------
[INFO] For more information, run Maven with the -e switch
[INFO] ------------------------------------------------------------------------
[INFO] Total time: 53 seconds
[INFO] Finished at: Tue Jul 20 06:03:53 UTC 2010
[INFO] Final Memory: 49M/213M
[INFO] ------------------------------------------------------------------------
Waiting for Hudson to finish collecting data
Sending e-mails to: dev@synapse.apache.org
channel stopped
[locks-and-latches] Releasing all the locks
[locks-and-latches] All the locks released


---------------------------------------------------------------------
To unsubscribe, e-mail: dev-unsubscribe@synapse.apache.org
For additional commands, e-mail: dev-help@synapse.apache.org


Mime
View raw message