synapse-dev mailing list archives

Site index · List index
Message view « Date » · « Thread »
Top « Date » · « Thread »
From Kasun Indrasiri <kasun...@gmail.com>
Subject Re: Synapse - Test failures on trunk
Date Wed, 28 Apr 2010 16:20:25 GMT
Hi Hiranya,

I tried with a fresh checkout, but got some test failures on extensions.


---------
Running org.apache.synapse.mediators.bsf.ScriptMediatorTest
28 Apr, 2010 2:59:46 PM org.apache.synapse.mediators.AbstractMediator
handleException
SEVERE: The script engine returned an error executing the inlined js script
function mediate
com.sun.phobos.script.util.ExtendedScriptException:
org.mozilla.javascript.EvaluatorException: Constructor for "XML" not found.
(<Unknown Source>#1) in <Unknown Source> at line number 1
...
...

Tests run: 100, Failures: 0, Errors: 100, Skipped: 0, Time elapsed: 5.718
sec <<< FAILURE!
----------


regards,
On Wed, Apr 28, 2010 at 11:13 AM, Hiranya Jayathilaka
<hiranya911@gmail.com>wrote:

> Test cases in Synapse-Extensions module are all all passing now.
>
> Thanks,
> Hiranya
>
>
> On Tue, Apr 27, 2010 at 1:50 PM, Kasun Indrasiri <kasun147@gmail.com>wrote:
>
>> Yeah, now all the tests in synapse/core are passed and this also resolves
>> the test compilation failures on synapse/extensions.
>>
>> thanks,
>> Kasun
>>
>> On Tue, Apr 27, 2010 at 1:44 PM, Hiranya Jayathilaka <
>> hiranya911@gmail.com> wrote:
>>
>>> Ok. With my latest commits, all the test failures in Synapse core has
>>> been fixed. There were issues wrt to endpoint serialization and XML
>>> comparisons. Can somebody please verify?
>>>
>>> Thanks,
>>> Hiranya
>>>
>>>
>>> On Mon, Apr 26, 2010 at 2:59 PM, Kasun Indrasiri <kasun147@gmail.com>wrote:
>>>
>>>> Yeah, I'll start working on failing test cases on synapse/core.
>>>>
>>>> thanks,
>>>>
>>>> On Mon, Apr 26, 2010 at 2:50 PM, Ruwan Linton <ruwan.linton@gmail.com>wrote:
>>>>
>>>>> +1
>>>>>
>>>>> Will you be able to look at, at least a few test cases which are
>>>>> failing??
>>>>>
>>>>> Thanks,
>>>>> Ruwan
>>>>>
>>>>>
>>>>> On Mon, Apr 26, 2010 at 1:35 PM, Kasun Indrasiri <kasun147@gmail.com>wrote:
>>>>>
>>>>>> Hi,
>>>>>>
>>>>>> Since we are preparing for a new release of Synapse, I guess we should
>>>>>> start looking in to Synapse unit tests.
>>>>>> Currently there are test failure on Synapse trunk.
>>>>>>
>>>>>>
>>>>>> -------------------------
>>>>>> Results :
>>>>>>
>>>>>> Failed tests:
>>>>>>
>>>>>> Tests run: 181, Failures: 7, Errors: 0, Skipped: 0
>>>>>>
>>>>>> [INFO]
>>>>>> ------------------------------------------------------------------------
>>>>>> [ERROR] BUILD FAILURE
>>>>>> [INFO]
>>>>>> ------------------------------------------------------------------------
>>>>>> [INFO] There are test failures.
>>>>>> [INFO] ------------------------------------------
>>>>>> --------------------
>>>>>>
>>>>>> regards,
>>>>>>
>>>>>> --
>>>>>> Kasun Indrasiri
>>>>>> Senior Software Engineer,
>>>>>> WSO2 Inc. - "Lean . Enterprise . Middleware" - http://www.wso2.com/
>>>>>> Blog : http://kasunpanorama.blogspot.com/
>>>>>>
>>>>>>
>>>>>
>>>>>
>>>>> --
>>>>> Ruwan Linton
>>>>> Technical Lead & Product Manager; WSO2 ESB; http://wso2.org/esb
>>>>> WSO2 Inc.; http://wso2.org
>>>>> email: ruwan@wso2.com; cell: +94 77 341 3097
>>>>> blog: http://ruwansblog.blogspot.com
>>>>>
>>>>
>>>>
>>>>
>>>> --
>>>> Kasun Indrasiri
>>>> Senior Software Engineer,
>>>> WSO2 Inc. - "Lean . Enterprise . Middleware" - http://www.wso2.com/
>>>> Blog : http://kasunpanorama.blogspot.com/
>>>>
>>>>
>>>
>>>
>>> --
>>> Hiranya Jayathilaka
>>> Software Engineer;
>>>
>>> WSO2 Inc.;  http://wso2.org
>>> E-mail: hiranya@wso2.com;  Mobile: +94 77 633 3491
>>> Blog: http://techfeast-hiranya.blogspot.com
>>>
>>
>>
>
>
> --
> Hiranya Jayathilaka
> Software Engineer;
> WSO2 Inc.;  http://wso2.org
> E-mail: hiranya@wso2.com;  Mobile: +94 77 633 3491
> Blog: http://techfeast-hiranya.blogspot.com
>



-- 
Kasun Indrasiri
Senior Software Engineer,
WSO2 Inc. - "Lean . Enterprise . Middleware" - http://www.wso2.com/
Blog : http://kasunpanorama.blogspot.com/

Mime
View raw message