synapse-dev mailing list archives

Site index · List index
Message view « Date » · « Thread »
Top « Date » · « Thread »
From Apache Hudson Server <hud...@hudson.zones.apache.org>
Subject Build failed in Hudson: Synapse - 1.3 - SNAPSHOT #250
Date Fri, 15 Jan 2010 06:20:43 GMT
See <http://hudson.zones.apache.org/hudson/job/Synapse%20-%201.3%20-%20SNAPSHOT/250/>

------------------------------------------
[...truncated 1657 lines...]
Running org.apache.synapse.config.xml.DropMediatorSerializationTest
Tests run: 1, Failures: 0, Errors: 0, Skipped: 0, Time elapsed: 0.938 sec
Running org.apache.synapse.config.xml.LogMediatorSerializationTest
Tests run: 2, Failures: 0, Errors: 0, Skipped: 0, Time elapsed: 0.855 sec
Running org.apache.synapse.config.xml.TestMediator
Tests run: 0, Failures: 0, Errors: 0, Skipped: 0, Time elapsed: 0.02 sec
Running org.apache.synapse.mediators.db.DBLookupMediatorTest
Jan 15, 2010 6:18:59 AM org.apache.synapse.mediators.db.AbstractDBMediator createCustomDataSource
INFO: Sunccessfully created data source for jdbc:derby:<http://hudson.zones.apache.org/hudson/job/Synapse%20-%201.3%20-%20SNAPSHOT/ws/java/modules/core/target/derbyDB;create=true.>
Tests run: 2, Failures: 0, Errors: 0, Skipped: 0, Time elapsed: 6.09 sec
Running org.apache.synapse.mediators.builtin.PropertyMediatorTest
All property values are correctly in place - Test SUCCESSFUL
Tests run: 5, Failures: 0, Errors: 0, Skipped: 0, Time elapsed: 0.396 sec
Running org.apache.synapse.util.MessageHelperTest
Tests run: 2, Failures: 0, Errors: 0, Skipped: 0, Time elapsed: 0.167 sec
Running org.apache.synapse.core.axis2.Axis2MessageContextTest
Tests run: 2, Failures: 0, Errors: 0, Skipped: 0, Time elapsed: 0.367 sec
Running org.apache.synapse.config.xml.ProxyServiceSerializationTest
Tests run: 6, Failures: 0, Errors: 0, Skipped: 0, Time elapsed: 1.713 sec
Running org.apache.synapse.config.xml.SwitchMediatorSerializationTest
Tests run: 2, Failures: 0, Errors: 0, Skipped: 0, Time elapsed: 0.953 sec
Running org.apache.synapse.TestMessageContext
Tests run: 0, Failures: 0, Errors: 0, Skipped: 0, Time elapsed: 0.019 sec
Running org.apache.synapse.mediators.transform.HeaderMediatorTest
Tests run: 3, Failures: 0, Errors: 0, Skipped: 0, Time elapsed: 0.605 sec
Running org.apache.synapse.mediators.builtin.ValidateMediatorTest
Tests run: 8, Failures: 0, Errors: 0, Skipped: 0, Time elapsed: 2.203 sec
Running org.apache.synapse.config.xml.FaultMediatorSerializationTest
Tests run: 5, Failures: 0, Errors: 0, Skipped: 0, Time elapsed: 0.741 sec
Running org.apache.synapse.mediators.filters.SwitchMediatorTest
Tests run: 3, Failures: 0, Errors: 0, Skipped: 0, Time elapsed: 0.516 sec
Running org.apache.synapse.mediators.ext.POJOCommandMediatorTest
Tests run: 8, Failures: 0, Errors: 0, Skipped: 0, Time elapsed: 0.505 sec

Results :

Tests in error: 

Tests run: 181, Failures: 0, Errors: 1, Skipped: 0

[ERROR] There are test failures.
[HUDSON] Recording test results
[INFO] [bundle:bundle]
[INFO] [jar:test-jar {execution: default}]
[INFO] Building jar: <http://hudson.zones.apache.org/hudson/job/Synapse%20-%201.3%20-%20SNAPSHOT/ws/java/modules/core/target/synapse-core-1.3.0-SNAPSHOT-tests.jar>
[INFO] [install:install]
[INFO] Installing <http://hudson.zones.apache.org/hudson/job/Synapse%20-%201.3%20-%20SNAPSHOT/ws/java/modules/core/target/synapse-core-1.3.0-SNAPSHOT.jar>
to /export/home/hudson/.m2/repository/org/apache/synapse/synapse-core/1.3.0-SNAPSHOT/synapse-core-1.3.0-SNAPSHOT.jar
[INFO] Installing <http://hudson.zones.apache.org/hudson/job/Synapse%20-%201.3%20-%20SNAPSHOT/ws/java/modules/core/target/synapse-core-1.3.0-SNAPSHOT-tests.jar>
to /export/home/hudson/.m2/repository/org/apache/synapse/synapse-core/1.3.0-SNAPSHOT/synapse-core-1.3.0-SNAPSHOT-tests.jar
[INFO] [bundle:install]
[INFO] Parsing file:/export/home/hudson/.m2/repository/repository.xml
[INFO] Installing org/apache/synapse/synapse-core/1.3.0-SNAPSHOT/synapse-core-1.3.0-SNAPSHOT.jar
[INFO] Writing OBR metadata
[HUDSON] Archiving <http://hudson.zones.apache.org/hudson/job/Synapse%20-%201.3%20-%20SNAPSHOT/ws/java/modules/core/pom.xml>
to /export/home/hudson/hudson/jobs/Synapse - 1.3 - SNAPSHOT/modules/org.apache.synapse$synapse-core/builds/2010-01-15_06-02-22/archive/org.apache.synapse/synapse-core/1.3.0-SNAPSHOT/pom.xml
[HUDSON] Archiving <http://hudson.zones.apache.org/hudson/job/Synapse%20-%201.3%20-%20SNAPSHOT/ws/java/modules/core/target/synapse-core-1.3.0-SNAPSHOT.jar>
to /export/home/hudson/hudson/jobs/Synapse - 1.3 - SNAPSHOT/modules/org.apache.synapse$synapse-core/builds/2010-01-15_06-02-22/archive/org.apache.synapse/synapse-core/1.3.0-SNAPSHOT/synapse-core-1.3.0-SNAPSHOT.jar
[HUDSON] Archiving <http://hudson.zones.apache.org/hudson/job/Synapse%20-%201.3%20-%20SNAPSHOT/ws/java/modules/core/target/synapse-core-1.3.0-SNAPSHOT-tests.jar>
to /export/home/hudson/hudson/jobs/Synapse - 1.3 - SNAPSHOT/modules/org.apache.synapse$synapse-core/builds/2010-01-15_06-02-22/archive/org.apache.synapse/synapse-core/1.3.0-SNAPSHOT/synapse-core-1.3.0-SNAPSHOT-tests.jar
[INFO] ------------------------------------------------------------------------
[INFO] Building Apache Synapse - Extensions
[INFO]    task-segment: [clean, install]
[INFO] ------------------------------------------------------------------------
[INFO] [clean:clean]
[INFO] Deleting directory <http://hudson.zones.apache.org/hudson/job/Synapse%20-%201.3%20-%20SNAPSHOT/ws/java/modules/extensions/target>
[INFO] [resources:resources]
[INFO] Using default encoding to copy filtered resources.
[INFO] snapshot org.apache.synapse:synapse-core:1.3.0-SNAPSHOT: checking for updates from
apache-snapshots
[INFO] snapshot org.apache.synapse:synapse-core:1.3.0-SNAPSHOT: checking for updates from
wso2-m2
[INFO] snapshot org.apache.synapse:synapse-core:1.3.0-SNAPSHOT: checking for updates from
apache.snapshots
[INFO] [compiler:compile]
Compiling 27 source files to <http://hudson.zones.apache.org/hudson/job/Synapse%20-%201.3%20-%20SNAPSHOT/ws/java/modules/extensions/target/classes>
[INFO] [resources:testResources]
[INFO] Using default encoding to copy filtered resources.
[INFO] [compiler:testCompile]
Compiling 18 source files to <http://hudson.zones.apache.org/hudson/job/Synapse%20-%201.3%20-%20SNAPSHOT/ws/java/modules/extensions/target/test-classes>
[INFO] [surefire:test]
[INFO] Surefire report directory: <http://hudson.zones.apache.org/hudson/job/Synapse%20-%201.3%20-%20SNAPSHOT/ws/java/modules/extensions/target/surefire-reports>

-------------------------------------------------------
 T E S T S
-------------------------------------------------------
Running org.apache.synapse.mediators.bsf.ScriptMediatorTest
Tests run: 100, Failures: 0, Errors: 0, Skipped: 0, Time elapsed: 5.135 sec
Running org.apache.synapse.mediators.xquery.XQueryMediatorSerializationTest
Tests run: 1, Failures: 0, Errors: 0, Skipped: 0, Time elapsed: 0.55 sec
Running org.apache.synapse.mediators.xquery.XQueryMediatorTest
Tests run: 7, Failures: 0, Errors: 0, Skipped: 0, Time elapsed: 0.606 sec
Running org.apache.synapse.mediators.spring.SpringMediatorTest
Jan 15, 2010 6:20:03 AM org.apache.synapse.config.xml.XMLConfigurationBuilder getConfiguration
INFO: Generating the Synapse configuration model by parsing the XML configuration
Jan 15, 2010 6:20:04 AM org.apache.synapse.config.SynapseConfigUtils getURLFromPath
WARNING: IO Error reading from URL : /./../../repository/mainjava.io.FileNotFoundException:
/./../../repository/main (No such file or directory)
Jan 15, 2010 6:20:04 AM org.apache.synapse.config.SynapseConfigurationBuilder getConfiguration
INFO: Loaded Synapse configuration from : ./../../repository/conf/sample/resources/spring/synapse_spring_unittest.xml
Jan 15, 2010 6:20:04 AM org.apache.synapse.config.SynapseConfigUtils getURLFromPath
WARNING: IO Error reading from URL : /./../../repository/faultjava.io.FileNotFoundException:
/./../../repository/fault (No such file or directory)
Jan 15, 2010 6:20:04 AM org.springframework.core.CollectionFactory <clinit>
INFO: JDK 1.4+ collections available
Jan 15, 2010 6:20:04 AM org.springframework.core.CollectionFactory <clinit>
INFO: Commons Collections 3.x available
Jan 15, 2010 6:20:04 AM org.springframework.beans.factory.xml.XmlBeanDefinitionReader loadBeanDefinitions
INFO: Loading XML bean definitions from resource loaded through InputStream
Jan 15, 2010 6:20:04 AM org.springframework.context.support.AbstractApplicationContext refresh
INFO: 2 beans defined in application context [org.springframework.context.support.GenericApplicationContext;hashCode=20099128]
Jan 15, 2010 6:20:04 AM org.springframework.context.support.AbstractApplicationContext initMessageSource
INFO: Unable to locate MessageSource with name 'messageSource': using default [org.springframework.context.support.DelegatingMessageSource@baf4ae]
Jan 15, 2010 6:20:04 AM org.springframework.context.support.AbstractApplicationContext initApplicationEventMulticaster
INFO: Unable to locate ApplicationEventMulticaster with name 'applicationEventMulticaster':
using default [org.springframework.context.event.SimpleApplicationEventMulticaster@118317f]
Jan 15, 2010 6:20:04 AM org.springframework.beans.factory.support.DefaultListableBeanFactory
preInstantiateSingletons
INFO: Pre-instantiating singletons in factory [org.springframework.beans.factory.support.DefaultListableBeanFactory
defining beans [springtest,handler]; root of BeanFactory hierarchy]
Jan 15, 2010 6:20:04 AM org.springframework.beans.factory.xml.XmlBeanDefinitionReader loadBeanDefinitions
INFO: Loading XML bean definitions from resource loaded through InputStream
Jan 15, 2010 6:20:04 AM org.springframework.context.support.AbstractApplicationContext refresh
INFO: 2 beans defined in application context [org.springframework.context.support.GenericApplicationContext;hashCode=32122282]
Jan 15, 2010 6:20:04 AM org.springframework.context.support.AbstractApplicationContext initMessageSource
INFO: Unable to locate MessageSource with name 'messageSource': using default [org.springframework.context.support.DelegatingMessageSource@14ef239]
Jan 15, 2010 6:20:04 AM org.springframework.context.support.AbstractApplicationContext initApplicationEventMulticaster
INFO: Unable to locate ApplicationEventMulticaster with name 'applicationEventMulticaster':
using default [org.springframework.context.event.SimpleApplicationEventMulticaster@81fb]
Jan 15, 2010 6:20:04 AM org.springframework.beans.factory.support.DefaultListableBeanFactory
preInstantiateSingletons
INFO: Pre-instantiating singletons in factory [org.springframework.beans.factory.support.DefaultListableBeanFactory
defining beans [springtest,handler]; root of BeanFactory hierarchy]
Tests run: 1, Failures: 0, Errors: 0, Skipped: 0, Time elapsed: 1.023 sec
Running org.apache.synapse.TestMediator
Tests run: 0, Failures: 0, Errors: 0, Skipped: 0, Time elapsed: 0.005 sec
Running org.apache.synapse.mediators.throttle.ThrottleMediatorTest
Jan 15, 2010 6:20:07 AM org.wso2.throttle.AccessRateController canAccess
INFO: You cannot access this service since you have exceeded the allocated quota.
Jan 15, 2010 6:20:07 AM org.wso2.throttle.AccessRateController canAccess
INFO: You cannot access this service since you have exceeded the allocated quota.
Jan 15, 2010 6:20:07 AM org.wso2.throttle.AccessRateController canAccess
INFO: You cannot access this service since you have exceeded the allocated quota.
Jan 15, 2010 6:20:10 AM org.wso2.throttle.AccessRateController canAccess
INFO: You cannot access this service since you have exceeded the allocated quota.
Jan 15, 2010 6:20:10 AM org.wso2.throttle.AccessRateController canAccess
INFO: You cannot access this service since you have exceeded the allocated quota.
Jan 15, 2010 6:20:10 AM org.wso2.throttle.AccessRateController canAccess
INFO: You cannot access this service since you have exceeded the allocated quota.
Tests run: 2, Failures: 0, Errors: 0, Skipped: 0, Time elapsed: 6.12 sec
Running org.apache.synapse.mediators.bsf.ScriptMediatorFactoryTest
Tests run: 3, Failures: 0, Errors: 0, Skipped: 0, Time elapsed: 0.034 sec
Running org.apache.synapse.format.hessian.HessianMessageBuilderTest
Tests run: 5, Failures: 0, Errors: 0, Skipped: 0, Time elapsed: 0.028 sec
Running org.apache.synapse.format.hessian.HessianMessageFormatterTest
Tests run: 4, Failures: 0, Errors: 0, Skipped: 0, Time elapsed: 0.019 sec
Running org.apache.synapse.mediators.bsf.javascript.JavaScriptMediatorTest
Tests run: 2, Failures: 0, Errors: 0, Skipped: 0, Time elapsed: 0.037 sec
Running org.apache.synapse.format.syslog.SyslogMessageBuilderTest
Tests run: 3, Failures: 0, Errors: 0, Skipped: 0, Time elapsed: 0.205 sec
Running org.apache.synapse.mediators.bsf.ScriptMediatorSerializationTest
Tests run: 3, Failures: 0, Errors: 0, Skipped: 0, Time elapsed: 0.263 sec
Running org.apache.synapse.mediators.bsf.GroovyScriptMediatorTest
Tests run: 1, Failures: 0, Errors: 0, Skipped: 0, Time elapsed: 0.003 sec
Running org.apache.synapse.mediators.throttle.ThrottleMediatorSerializationTest
Tests run: 1, Failures: 0, Errors: 0, Skipped: 0, Time elapsed: 0.016 sec
Running org.apache.synapse.mediators.spring.TestMediateHandlerImpl
Tests run: 0, Failures: 0, Errors: 0, Skipped: 0, Time elapsed: 0.002 sec

Results :

Tests run: 133, Failures: 0, Errors: 0, Skipped: 0

[HUDSON] Recording test results
[INFO] [bundle:bundle]
[INFO] [install:install]
[INFO] Installing <http://hudson.zones.apache.org/hudson/job/Synapse%20-%201.3%20-%20SNAPSHOT/ws/java/modules/extensions/target/synapse-extensions-1.3.0-SNAPSHOT.jar>
to /export/home/hudson/.m2/repository/org/apache/synapse/synapse-extensions/1.3.0-SNAPSHOT/synapse-extensions-1.3.0-SNAPSHOT.jar
[INFO] [bundle:install]
[INFO] Parsing file:/export/home/hudson/.m2/repository/repository.xml
[INFO] Installing org/apache/synapse/synapse-extensions/1.3.0-SNAPSHOT/synapse-extensions-1.3.0-SNAPSHOT.jar
[INFO] Writing OBR metadata
[HUDSON] Archiving <http://hudson.zones.apache.org/hudson/job/Synapse%20-%201.3%20-%20SNAPSHOT/ws/java/modules/extensions/pom.xml>
to /export/home/hudson/hudson/jobs/Synapse - 1.3 - SNAPSHOT/modules/org.apache.synapse$synapse-extensions/builds/2010-01-15_06-02-22/archive/org.apache.synapse/synapse-extensions/1.3.0-SNAPSHOT/pom.xml
[HUDSON] Archiving <http://hudson.zones.apache.org/hudson/job/Synapse%20-%201.3%20-%20SNAPSHOT/ws/java/modules/extensions/target/synapse-extensions-1.3.0-SNAPSHOT.jar>
to /export/home/hudson/hudson/jobs/Synapse - 1.3 - SNAPSHOT/modules/org.apache.synapse$synapse-extensions/builds/2010-01-15_06-02-22/archive/org.apache.synapse/synapse-extensions/1.3.0-SNAPSHOT/synapse-extensions-1.3.0-SNAPSHOT.jar
[INFO] ------------------------------------------------------------------------
[INFO] Building Apache Synapse - Samples
[INFO]    task-segment: [clean, install]
[INFO] ------------------------------------------------------------------------
[INFO] [clean:clean]
[INFO] Deleting directory <http://hudson.zones.apache.org/hudson/job/Synapse%20-%201.3%20-%20SNAPSHOT/ws/java/modules/samples/target>
[INFO] [resources:resources]
[INFO] Using default encoding to copy filtered resources.
[WARNING] POM for 'org.jruby:jruby-complete:pom:0.9.9:compile' is invalid. It will be ignored
for artifact resolution. Reason: The POM expression: ${java.specification.version} could not
be evaluated. Reason: Expression value '${java.specification.version}' references itself in
'org.jruby:jruby-complete:jar:0.9.9'. for project org.jruby:jruby-complete at Artifact [org.jruby:jruby-complete:pom:0.9.9:compile]
[INFO] snapshot org.apache.rampart:rampart-core:SNAPSHOT: checking for updates from apache-snapshots
[INFO] snapshot org.apache.rampart:rampart-core:SNAPSHOT: checking for updates from wso2-m2
[INFO] snapshot org.apache.rampart:rampart-core:SNAPSHOT: checking for updates from apache.snapshots
2K downloaded
[INFO] snapshot org.apache.rampart:rampart-project:SNAPSHOT: checking for updates from apache-snapshots
[INFO] snapshot org.apache.rampart:rampart-project:SNAPSHOT: checking for updates from wso2-m2
[INFO] snapshot org.apache.rampart:rampart-project:SNAPSHOT: checking for updates from apache.snapshots
13K downloaded
[INFO] snapshot org.apache.rampart:rampart-policy:SNAPSHOT: checking for updates from apache-snapshots
[WARNING] *** CHECKSUM FAILED - Invalid checksum file - RETRYING
[INFO] snapshot org.apache.rampart:rampart-policy:SNAPSHOT: checking for updates from wso2-m2
[INFO] snapshot org.apache.rampart:rampart-policy:SNAPSHOT: checking for updates from apache.snapshots
1K downloaded
[INFO] snapshot org.apache.rampart:rampart-trust:SNAPSHOT: checking for updates from apache-snapshots
[INFO] snapshot org.apache.rampart:rampart-trust:SNAPSHOT: checking for updates from wso2-m2
[INFO] snapshot org.apache.rampart:rampart-trust:SNAPSHOT: checking for updates from apache.snapshots
1K downloaded
Downloading: http://repository.apache.org/snapshots/opensaml/opensaml/1.1/opensaml-1.1.pom
Downloading: http://dist.wso2.org/maven2//opensaml/opensaml/1.1/opensaml-1.1.pom
Downloading: http://people.apache.org/~asankha/repository/opensaml/opensaml/1.1/opensaml-1.1.pom
Downloading: http://repo1.maven.org/maven2/opensaml/opensaml/1.1/opensaml-1.1.pom
[INFO] snapshot org.apache.synapse:synapse-extensions:1.3.0-SNAPSHOT: checking for updates
from apache-snapshots
[INFO] snapshot org.apache.synapse:synapse-extensions:1.3.0-SNAPSHOT: checking for updates
from wso2-m2
[INFO] snapshot org.apache.synapse:synapse-extensions:1.3.0-SNAPSHOT: checking for updates
from apache.snapshots
144K downloaded
147K downloaded
97K downloaded
[HUDSON] Archiving <http://hudson.zones.apache.org/hudson/job/Synapse%20-%201.3%20-%20SNAPSHOT/ws/java/modules/samples/pom.xml>
to /export/home/hudson/hudson/jobs/Synapse - 1.3 - SNAPSHOT/modules/org.apache.synapse$synapse-samples/builds/2010-01-15_06-02-22/archive/org.apache.synapse/synapse-samples/1.3.0-SNAPSHOT/pom.xml
[INFO] ------------------------------------------------------------------------
[ERROR] BUILD ERROR
[INFO] ------------------------------------------------------------------------
[INFO] Failed to resolve artifact.

Missing:
----------
1) org.apache.rampart:rampart-policy:jar:SNAPSHOT

  Try downloading the file manually from the project website.

  Then, install it using the command: 
      mvn install:install-file -DgroupId=org.apache.rampart -DartifactId=rampart-policy -Dversion=SNAPSHOT
-Dpackaging=jar -Dfile=/path/to/file

  Alternatively, if you host your own repository you can deploy the file there: 
      mvn deploy:deploy-file -DgroupId=org.apache.rampart -DartifactId=rampart-policy -Dversion=SNAPSHOT
-Dpackaging=jar -Dfile=/path/to/file -Durl=[url] -DrepositoryId=[id]

  Path to dependency: 
  	1) org.apache.synapse:synapse-samples:bundle:1.3.0-SNAPSHOT
  	2) org.apache.rampart:rampart-core:jar:SNAPSHOT
  	3) org.apache.rampart:rampart-policy:jar:SNAPSHOT

----------
1 required artifact is missing.

for artifact: 
  org.apache.synapse:synapse-samples:bundle:1.3.0-SNAPSHOT

from the specified remote repositories:
  central (http://repo1.maven.org/maven2),
  wso2-m2 (http://dist.wso2.org/maven2/),
  asankha (http://people.apache.org/~asankha/repository),
  Nexus (http://repository.apache.org/snapshots)


[INFO] ------------------------------------------------------------------------
[INFO] For more information, run Maven with the -e switch
[INFO] ------------------------------------------------------------------------
[INFO] Total time: 17 minutes 53 seconds
[INFO] Finished at: Fri Jan 15 06:20:27 UTC 2010
[INFO] Final Memory: 50M/149M
[INFO] ------------------------------------------------------------------------
Sending e-mails to: dev@synapse.apache.org
Sending e-mails to: dev@synapse.apache.org
channel stopped


---------------------------------------------------------------------
To unsubscribe, e-mail: dev-unsubscribe@synapse.apache.org
For additional commands, e-mail: dev-help@synapse.apache.org


Mime
View raw message