synapse-dev mailing list archives

Site index · List index
Message view « Date » · « Thread »
Top « Date » · « Thread »
From Apache Hudson Server <hud...@hudson.zones.apache.org>
Subject Build failed in Hudson: Synapse - 1.3 - SNAPSHOT #216
Date Wed, 06 Jan 2010 18:21:06 GMT
See <http://hudson.zones.apache.org/hudson/job/Synapse%20-%201.3%20-%20SNAPSHOT/216/>

------------------------------------------
[...truncated 2126 lines...]
[INFO] Writing OBR metadata
[HUDSON] Archiving <http://hudson.zones.apache.org/hudson/job/Synapse%20-%201.3%20-%20SNAPSHOT/ws/java/modules/core/pom.xml>
to /export/home/hudson/hudson/jobs/Synapse - 1.3 - SNAPSHOT/modules/org.apache.synapse$synapse-core/builds/2010-01-06_18-02-11/archive/org.apache.synapse/synapse-core/1.3.0-SNAPSHOT/pom.xml
[HUDSON] Archiving <http://hudson.zones.apache.org/hudson/job/Synapse%20-%201.3%20-%20SNAPSHOT/ws/java/modules/core/target/synapse-core-1.3.0-SNAPSHOT.jar>
to /export/home/hudson/hudson/jobs/Synapse - 1.3 - SNAPSHOT/modules/org.apache.synapse$synapse-core/builds/2010-01-06_18-02-11/archive/org.apache.synapse/synapse-core/1.3.0-SNAPSHOT/synapse-core-1.3.0-SNAPSHOT.jar
[HUDSON] Archiving <http://hudson.zones.apache.org/hudson/job/Synapse%20-%201.3%20-%20SNAPSHOT/ws/java/modules/core/target/synapse-core-1.3.0-SNAPSHOT-tests.jar>
to /export/home/hudson/hudson/jobs/Synapse - 1.3 - SNAPSHOT/modules/org.apache.synapse$synapse-core/builds/2010-01-06_18-02-11/archive/org.apache.synapse/synapse-core/1.3.0-SNAPSHOT/synapse-core-1.3.0-SNAPSHOT-tests.jar
[INFO] ------------------------------------------------------------------------
[INFO] Building Apache Synapse - Extensions
[INFO]    task-segment: [clean, install]
[INFO] ------------------------------------------------------------------------
[INFO] [clean:clean]
[INFO] Deleting directory <http://hudson.zones.apache.org/hudson/job/Synapse%20-%201.3%20-%20SNAPSHOT/ws/java/modules/extensions/target>
[INFO] [resources:resources]
[INFO] Using default encoding to copy filtered resources.
[INFO] snapshot org.apache.synapse:synapse-core:1.3.0-SNAPSHOT: checking for updates from
apache-snapshots
[INFO] snapshot org.apache.synapse:synapse-core:1.3.0-SNAPSHOT: checking for updates from
wso2-m2
[INFO] snapshot org.apache.synapse:synapse-core:1.3.0-SNAPSHOT: checking for updates from
asankha
[INFO] snapshot org.apache.synapse:synapse-core:1.3.0-SNAPSHOT: checking for updates from
apache.snapshots
[INFO] [compiler:compile]
Compiling 27 source files to <http://hudson.zones.apache.org/hudson/job/Synapse%20-%201.3%20-%20SNAPSHOT/ws/java/modules/extensions/target/classes>
[INFO] [resources:testResources]
[INFO] Using default encoding to copy filtered resources.
[INFO] [compiler:testCompile]
Compiling 18 source files to <http://hudson.zones.apache.org/hudson/job/Synapse%20-%201.3%20-%20SNAPSHOT/ws/java/modules/extensions/target/test-classes>
[INFO] [surefire:test]
[INFO] Surefire report directory: <http://hudson.zones.apache.org/hudson/job/Synapse%20-%201.3%20-%20SNAPSHOT/ws/java/modules/extensions/target/surefire-reports>

-------------------------------------------------------
 T E S T S
-------------------------------------------------------
Running org.apache.synapse.mediators.bsf.ScriptMediatorTest
Tests run: 100, Failures: 0, Errors: 0, Skipped: 0, Time elapsed: 5.518 sec
Running org.apache.synapse.mediators.xquery.XQueryMediatorTest
Tests run: 7, Failures: 0, Errors: 0, Skipped: 0, Time elapsed: 0.813 sec
Running org.apache.synapse.mediators.xquery.XQueryMediatorSerializationTest
Tests run: 1, Failures: 0, Errors: 0, Skipped: 0, Time elapsed: 0.174 sec
Running org.apache.synapse.mediators.spring.SpringMediatorTest
Jan 6, 2010 6:20:20 PM org.apache.synapse.config.xml.XMLConfigurationBuilder getConfiguration
INFO: Generating the Synapse configuration model by parsing the XML configuration
Jan 6, 2010 6:20:20 PM org.apache.synapse.config.SynapseConfigUtils getURLFromPath
WARNING: IO Error reading from URL : /./../../repository/mainjava.io.FileNotFoundException:
/./../../repository/main (No such file or directory)
Jan 6, 2010 6:20:20 PM org.apache.synapse.config.SynapseConfigurationBuilder getConfiguration
INFO: Loaded Synapse configuration from : ./../../repository/conf/sample/resources/spring/synapse_spring_unittest.xml
Jan 6, 2010 6:20:20 PM org.apache.synapse.config.SynapseConfigUtils getURLFromPath
WARNING: IO Error reading from URL : /./../../repository/faultjava.io.FileNotFoundException:
/./../../repository/fault (No such file or directory)
Jan 6, 2010 6:20:20 PM org.springframework.core.CollectionFactory <clinit>
INFO: JDK 1.4+ collections available
Jan 6, 2010 6:20:20 PM org.springframework.core.CollectionFactory <clinit>
INFO: Commons Collections 3.x available
Jan 6, 2010 6:20:21 PM org.springframework.beans.factory.xml.XmlBeanDefinitionReader loadBeanDefinitions
INFO: Loading XML bean definitions from resource loaded through InputStream
Jan 6, 2010 6:20:21 PM org.springframework.context.support.AbstractApplicationContext refresh
INFO: 2 beans defined in application context [org.springframework.context.support.GenericApplicationContext;hashCode=10386758]
Jan 6, 2010 6:20:21 PM org.springframework.context.support.AbstractApplicationContext initMessageSource
INFO: Unable to locate MessageSource with name 'messageSource': using default [org.springframework.context.support.DelegatingMessageSource@11ce012]
Jan 6, 2010 6:20:21 PM org.springframework.context.support.AbstractApplicationContext initApplicationEventMulticaster
INFO: Unable to locate ApplicationEventMulticaster with name 'applicationEventMulticaster':
using default [org.springframework.context.event.SimpleApplicationEventMulticaster@1d3633c]
Jan 6, 2010 6:20:21 PM org.springframework.beans.factory.support.DefaultListableBeanFactory
preInstantiateSingletons
INFO: Pre-instantiating singletons in factory [org.springframework.beans.factory.support.DefaultListableBeanFactory
defining beans [springtest,handler]; root of BeanFactory hierarchy]
Jan 6, 2010 6:20:21 PM org.springframework.beans.factory.xml.XmlBeanDefinitionReader loadBeanDefinitions
INFO: Loading XML bean definitions from resource loaded through InputStream
Jan 6, 2010 6:20:21 PM org.springframework.context.support.AbstractApplicationContext refresh
INFO: 2 beans defined in application context [org.springframework.context.support.GenericApplicationContext;hashCode=7578460]
Jan 6, 2010 6:20:21 PM org.springframework.context.support.AbstractApplicationContext initMessageSource
INFO: Unable to locate MessageSource with name 'messageSource': using default [org.springframework.context.support.DelegatingMessageSource@1ea25aa]
Jan 6, 2010 6:20:21 PM org.springframework.context.support.AbstractApplicationContext initApplicationEventMulticaster
INFO: Unable to locate ApplicationEventMulticaster with name 'applicationEventMulticaster':
using default [org.springframework.context.event.SimpleApplicationEventMulticaster@14ef239]
Jan 6, 2010 6:20:21 PM org.springframework.beans.factory.support.DefaultListableBeanFactory
preInstantiateSingletons
INFO: Pre-instantiating singletons in factory [org.springframework.beans.factory.support.DefaultListableBeanFactory
defining beans [springtest,handler]; root of BeanFactory hierarchy]
Tests run: 1, Failures: 0, Errors: 0, Skipped: 0, Time elapsed: 1.283 sec
Running org.apache.synapse.TestMediator
Tests run: 0, Failures: 0, Errors: 0, Skipped: 0, Time elapsed: 0.003 sec
Running org.apache.synapse.mediators.throttle.ThrottleMediatorTest
Jan 6, 2010 6:20:24 PM org.wso2.throttle.AccessRateController canAccess
INFO: You cannot access this service since you have exceeded the allocated quota.
Jan 6, 2010 6:20:24 PM org.wso2.throttle.AccessRateController canAccess
INFO: You cannot access this service since you have exceeded the allocated quota.
Jan 6, 2010 6:20:24 PM org.wso2.throttle.AccessRateController canAccess
INFO: You cannot access this service since you have exceeded the allocated quota.
Jan 6, 2010 6:20:27 PM org.wso2.throttle.AccessRateController canAccess
INFO: You cannot access this service since you have exceeded the allocated quota.
Jan 6, 2010 6:20:27 PM org.wso2.throttle.AccessRateController canAccess
INFO: You cannot access this service since you have exceeded the allocated quota.
Jan 6, 2010 6:20:27 PM org.wso2.throttle.AccessRateController canAccess
INFO: You cannot access this service since you have exceeded the allocated quota.
Tests run: 2, Failures: 0, Errors: 0, Skipped: 0, Time elapsed: 6.153 sec
Running org.apache.synapse.mediators.bsf.ScriptMediatorFactoryTest
Tests run: 3, Failures: 0, Errors: 0, Skipped: 0, Time elapsed: 0.033 sec
Running org.apache.synapse.format.hessian.HessianMessageFormatterTest
Tests run: 4, Failures: 0, Errors: 0, Skipped: 0, Time elapsed: 0.05 sec
Running org.apache.synapse.format.hessian.HessianMessageBuilderTest
Tests run: 5, Failures: 0, Errors: 0, Skipped: 0, Time elapsed: 0.023 sec
Running org.apache.synapse.format.syslog.SyslogMessageBuilderTest
Tests run: 3, Failures: 0, Errors: 0, Skipped: 0, Time elapsed: 0.264 sec
Running org.apache.synapse.mediators.bsf.javascript.JavaScriptMediatorTest
Tests run: 2, Failures: 0, Errors: 0, Skipped: 0, Time elapsed: 0.121 sec
Running org.apache.synapse.mediators.bsf.ScriptMediatorSerializationTest
Tests run: 3, Failures: 0, Errors: 0, Skipped: 0, Time elapsed: 0.219 sec
Running org.apache.synapse.mediators.bsf.GroovyScriptMediatorTest
Tests run: 1, Failures: 0, Errors: 0, Skipped: 0, Time elapsed: 0.002 sec
Running org.apache.synapse.mediators.throttle.ThrottleMediatorSerializationTest
Tests run: 1, Failures: 0, Errors: 0, Skipped: 0, Time elapsed: 0.053 sec
Running org.apache.synapse.mediators.spring.TestMediateHandlerImpl
Tests run: 0, Failures: 0, Errors: 0, Skipped: 0, Time elapsed: 0.001 sec

Results :

Tests run: 133, Failures: 0, Errors: 0, Skipped: 0

[HUDSON] Recording test results
[INFO] [bundle:bundle]
[INFO] [install:install]
[INFO] Installing <http://hudson.zones.apache.org/hudson/job/Synapse%20-%201.3%20-%20SNAPSHOT/ws/java/modules/extensions/target/synapse-extensions-1.3.0-SNAPSHOT.jar>
to /export/home/hudson/.m2/repository/org/apache/synapse/synapse-extensions/1.3.0-SNAPSHOT/synapse-extensions-1.3.0-SNAPSHOT.jar
[INFO] [bundle:install]
[INFO] Parsing file:/export/home/hudson/.m2/repository/repository.xml
[Fatal Error] repository.xml:6205:5: XML document structures must start and end within the
same entity.
org.xml.sax.SAXParseException: XML document structures must start and end within the same
entity.
	at com.sun.org.apache.xerces.internal.parsers.DOMParser.parse(DOMParser.java:264)
	at com.sun.org.apache.xerces.internal.jaxp.DocumentBuilderImpl.parse(DocumentBuilderImpl.java:292)
	at javax.xml.parsers.DocumentBuilder.parse(DocumentBuilder.java:172)
	at org.apache.felix.obrplugin.ObrUpdate.parseFile(ObrUpdate.java:347)
	at org.apache.felix.obrplugin.ObrUpdate.parseRepositoryXml(ObrUpdate.java:324)
	at org.apache.felix.obrplugin.ObrInstall.execute(ObrInstall.java:136)
	at org.apache.maven.plugin.DefaultPluginManager.executeMojo(DefaultPluginManager.java:451)
	at hudson.maven.agent.PluginManagerInterceptor.executeMojo(PluginManagerInterceptor.java:182)
	at org.apache.maven.lifecycle.DefaultLifecycleExecutor.executeGoals(DefaultLifecycleExecutor.java:558)
	at org.apache.maven.lifecycle.DefaultLifecycleExecutor.executeGoalWithLifecycle(DefaultLifecycleExecutor.java:499)
	at org.apache.maven.lifecycle.DefaultLifecycleExecutor.executeGoal(DefaultLifecycleExecutor.java:478)
	at org.apache.maven.lifecycle.DefaultLifecycleExecutor.executeGoalAndHandleFailures(DefaultLifecycleExecutor.java:330)
	at org.apache.maven.lifecycle.DefaultLifecycleExecutor.executeTaskSegments(DefaultLifecycleExecutor.java:291)
	at org.apache.maven.lifecycle.DefaultLifecycleExecutor.execute(DefaultLifecycleExecutor.java:142)
	at org.apache.maven.lifecycle.LifecycleExecutorInterceptor.execute(LifecycleExecutorInterceptor.java:65)
	at org.apache.maven.DefaultMaven.doExecute(DefaultMaven.java:336)
	at org.apache.maven.DefaultMaven.execute(DefaultMaven.java:129)
	at org.apache.maven.cli.MavenCli.main(MavenCli.java:287)
	at sun.reflect.NativeMethodAccessorImpl.invoke0(Native Method)
	at sun.reflect.NativeMethodAccessorImpl.invoke(NativeMethodAccessorImpl.java:39)
	at sun.reflect.DelegatingMethodAccessorImpl.invoke(DelegatingMethodAccessorImpl.java:25)
	at java.lang.reflect.Method.invoke(Method.java:585)
	at org.codehaus.classworlds.Launcher.launchEnhanced(Launcher.java:315)
	at org.codehaus.classworlds.Launcher.launch(Launcher.java:255)
	at hudson.maven.agent.Main.launch(Main.java:165)
	at hudson.maven.MavenBuilder.call(MavenBuilder.java:159)
	at hudson.maven.MavenModuleSetBuild$Builder.call(MavenModuleSetBuild.java:688)
	at hudson.maven.MavenModuleSetBuild$Builder.call(MavenModuleSetBuild.java:632)
	at hudson.remoting.UserRequest.perform(UserRequest.java:104)
	at hudson.remoting.UserRequest.perform(UserRequest.java:48)
	at hudson.remoting.Request$2.run(Request.java:270)
	at java.util.concurrent.Executors$RunnableAdapter.call(Executors.java:417)
	at java.util.concurrent.FutureTask$Sync.innerRun(FutureTask.java:269)
	at java.util.concurrent.FutureTask.run(FutureTask.java:123)
	at java.util.concurrent.ThreadPoolExecutor$Worker.runTask(ThreadPoolExecutor.java:650)
	at java.util.concurrent.ThreadPoolExecutor$Worker.run(ThreadPoolExecutor.java:675)
	at java.lang.Thread.run(Thread.java:595)
[INFO] Writing OBR metadata
[WARNING] Exception while updating local OBR: null
java.lang.NullPointerException
	at org.apache.felix.obrplugin.ObrUpdate.writeRepositoryXml(ObrUpdate.java:268)
	at org.apache.felix.obrplugin.ObrInstall.execute(ObrInstall.java:144)
	at org.apache.maven.plugin.DefaultPluginManager.executeMojo(DefaultPluginManager.java:451)
	at hudson.maven.agent.PluginManagerInterceptor.executeMojo(PluginManagerInterceptor.java:182)
	at org.apache.maven.lifecycle.DefaultLifecycleExecutor.executeGoals(DefaultLifecycleExecutor.java:558)
	at org.apache.maven.lifecycle.DefaultLifecycleExecutor.executeGoalWithLifecycle(DefaultLifecycleExecutor.java:499)
	at org.apache.maven.lifecycle.DefaultLifecycleExecutor.executeGoal(DefaultLifecycleExecutor.java:478)
	at org.apache.maven.lifecycle.DefaultLifecycleExecutor.executeGoalAndHandleFailures(DefaultLifecycleExecutor.java:330)
	at org.apache.maven.lifecycle.DefaultLifecycleExecutor.executeTaskSegments(DefaultLifecycleExecutor.java:291)
	at org.apache.maven.lifecycle.DefaultLifecycleExecutor.execute(DefaultLifecycleExecutor.java:142)
	at org.apache.maven.lifecycle.LifecycleExecutorInterceptor.execute(LifecycleExecutorInterceptor.java:65)
	at org.apache.maven.DefaultMaven.doExecute(DefaultMaven.java:336)
	at org.apache.maven.DefaultMaven.execute(DefaultMaven.java:129)
	at org.apache.maven.cli.MavenCli.main(MavenCli.java:287)
	at sun.reflect.NativeMethodAccessorImpl.invoke0(Native Method)
	at sun.reflect.NativeMethodAccessorImpl.invoke(NativeMethodAccessorImpl.java:39)
	at sun.reflect.DelegatingMethodAccessorImpl.invoke(DelegatingMethodAccessorImpl.java:25)
	at java.lang.reflect.Method.invoke(Method.java:585)
	at org.codehaus.classworlds.Launcher.launchEnhanced(Launcher.java:315)
	at org.codehaus.classworlds.Launcher.launch(Launcher.java:255)
	at hudson.maven.agent.Main.launch(Main.java:165)
	at hudson.maven.MavenBuilder.call(MavenBuilder.java:159)
	at hudson.maven.MavenModuleSetBuild$Builder.call(MavenModuleSetBuild.java:688)
	at hudson.maven.MavenModuleSetBuild$Builder.call(MavenModuleSetBuild.java:632)
	at hudson.remoting.UserRequest.perform(UserRequest.java:104)
	at hudson.remoting.UserRequest.perform(UserRequest.java:48)
	at hudson.remoting.Request$2.run(Request.java:270)
	at java.util.concurrent.Executors$RunnableAdapter.call(Executors.java:417)
	at java.util.concurrent.FutureTask$Sync.innerRun(FutureTask.java:269)
	at java.util.concurrent.FutureTask.run(FutureTask.java:123)
	at java.util.concurrent.ThreadPoolExecutor$Worker.runTask(ThreadPoolExecutor.java:650)
	at java.util.concurrent.ThreadPoolExecutor$Worker.run(ThreadPoolExecutor.java:675)
	at java.lang.Thread.run(Thread.java:595)
[HUDSON] Archiving <http://hudson.zones.apache.org/hudson/job/Synapse%20-%201.3%20-%20SNAPSHOT/ws/java/modules/extensions/pom.xml>
to /export/home/hudson/hudson/jobs/Synapse - 1.3 - SNAPSHOT/modules/org.apache.synapse$synapse-extensions/builds/2010-01-06_18-02-11/archive/org.apache.synapse/synapse-extensions/1.3.0-SNAPSHOT/pom.xml
[HUDSON] Archiving <http://hudson.zones.apache.org/hudson/job/Synapse%20-%201.3%20-%20SNAPSHOT/ws/java/modules/extensions/target/synapse-extensions-1.3.0-SNAPSHOT.jar>
to /export/home/hudson/hudson/jobs/Synapse - 1.3 - SNAPSHOT/modules/org.apache.synapse$synapse-extensions/builds/2010-01-06_18-02-11/archive/org.apache.synapse/synapse-extensions/1.3.0-SNAPSHOT/synapse-extensions-1.3.0-SNAPSHOT.jar
[INFO] ------------------------------------------------------------------------
[INFO] Building Apache Synapse - Samples
[INFO]    task-segment: [clean, install]
[INFO] ------------------------------------------------------------------------
[INFO] [clean:clean]
[INFO] Deleting directory <http://hudson.zones.apache.org/hudson/job/Synapse%20-%201.3%20-%20SNAPSHOT/ws/java/modules/samples/target>
[INFO] [resources:resources]
[INFO] Using default encoding to copy filtered resources.
[WARNING] POM for 'org.jruby:jruby-complete:pom:0.9.9:compile' is invalid. It will be ignored
for artifact resolution. Reason: The POM expression: ${java.specification.version} could not
be evaluated. Reason: Expression value '${java.specification.version}' references itself in
'org.jruby:jruby-complete:jar:0.9.9'. for project org.jruby:jruby-complete at Artifact [org.jruby:jruby-complete:pom:0.9.9:compile]
[INFO] snapshot org.apache.rampart:rampart-core:SNAPSHOT: checking for updates from apache-snapshots
[INFO] snapshot org.apache.rampart:rampart-core:SNAPSHOT: checking for updates from wso2-m2
2K downloaded
[INFO] snapshot org.apache.synapse:synapse-extensions:1.3.0-SNAPSHOT: checking for updates
from apache-snapshots
[INFO] snapshot org.apache.synapse:synapse-extensions:1.3.0-SNAPSHOT: checking for updates
from wso2-m2
[INFO] snapshot org.apache.synapse:synapse-extensions:1.3.0-SNAPSHOT: checking for updates
from asankha
[INFO] snapshot org.apache.synapse:synapse-extensions:1.3.0-SNAPSHOT: checking for updates
from apache.snapshots
144K downloaded
[INFO] [compiler:compile]
Compiling 20 source files to <http://hudson.zones.apache.org/hudson/job/Synapse%20-%201.3%20-%20SNAPSHOT/ws/java/modules/samples/target/classes>
[HUDSON] Archiving <http://hudson.zones.apache.org/hudson/job/Synapse%20-%201.3%20-%20SNAPSHOT/ws/java/modules/samples/pom.xml>
to /export/home/hudson/hudson/jobs/Synapse - 1.3 - SNAPSHOT/modules/org.apache.synapse$synapse-samples/builds/2010-01-06_18-02-11/archive/org.apache.synapse/synapse-samples/1.3.0-SNAPSHOT/pom.xml
[INFO] ------------------------------------------------------------------------
[ERROR] BUILD FAILURE
[INFO] ------------------------------------------------------------------------
[INFO] Compilation failure

<http://hudson.zones.apache.org/hudson/job/Synapse%20-%201.3%20-%20SNAPSHOT/ws/java/modules/samples/src/main/java/samples/userguide/PWCallback.java>:[22,30]
package org.apache.ws.security does not exist

<http://hudson.zones.apache.org/hudson/job/Synapse%20-%201.3%20-%20SNAPSHOT/ws/java/modules/samples/src/main/java/samples/userguide/PWCallback.java>:[76,40]
cannot find symbol
symbol  : class WSPasswordCallback
location: class samples.userguide.PWCallback

<http://hudson.zones.apache.org/hudson/job/Synapse%20-%201.3%20-%20SNAPSHOT/ws/java/modules/samples/src/main/java/samples/userguide/PWCallback.java>:[78,16]
cannot find symbol
symbol  : class WSPasswordCallback
location: class samples.userguide.PWCallback

<http://hudson.zones.apache.org/hudson/job/Synapse%20-%201.3%20-%20SNAPSHOT/ws/java/modules/samples/src/main/java/samples/userguide/PWCallback.java>:[78,41]
cannot find symbol
symbol  : class WSPasswordCallback
location: class samples.userguide.PWCallback

<http://hudson.zones.apache.org/hudson/job/Synapse%20-%201.3%20-%20SNAPSHOT/ws/java/modules/samples/src/main/java/samples/userguide/PWCallback.java>:[102,37]
cannot find symbol
symbol  : variable WSPasswordCallback
location: class samples.userguide.PWCallback

<http://hudson.zones.apache.org/hudson/job/Synapse%20-%201.3%20-%20SNAPSHOT/ws/java/modules/samples/src/main/java/samples/userguide/PWCallback.java>:[140,37]
cannot find symbol
symbol  : variable WSPasswordCallback
location: class samples.userguide.PWCallback


[INFO] ------------------------------------------------------------------------
[INFO] For more information, run Maven with the -e switch
[INFO] ------------------------------------------------------------------------
[INFO] Total time: 18 minutes 21 seconds
[INFO] Finished at: Wed Jan 06 18:20:44 UTC 2010
[INFO] Final Memory: 49M/161M
[INFO] ------------------------------------------------------------------------
Sending e-mails to: dev@synapse.apache.org
Sending e-mails to: dev@synapse.apache.org
Sending e-mails to: dev@synapse.apache.org
channel stopped


---------------------------------------------------------------------
To unsubscribe, e-mail: dev-unsubscribe@synapse.apache.org
For additional commands, e-mail: dev-help@synapse.apache.org


Mime
View raw message