synapse-dev mailing list archives

Site index · List index
Message view « Date » · « Thread »
Top « Date » · « Thread »
From Apache Hudson Server <hud...@hudson.zones.apache.org>
Subject Build failed in Hudson: Synapse - 1.3 - SNAPSHOT #88
Date Sat, 05 Dec 2009 06:06:12 GMT
See <http://hudson.zones.apache.org/hudson/job/Synapse%20-%201.3%20-%20SNAPSHOT/88/>

------------------------------------------
[...truncated 331 lines...]
	at org.apache.axis2.engine.Phase.invoke(Phase.java:334)
	at org.apache.axis2.engine.AxisEngine.invoke(AxisEngine.java:251)
	at org.apache.axis2.engine.AxisEngine.receive(AxisEngine.java:160)
	at org.apache.axis2.transport.http.HTTPTransportUtils.processHTTPPostRequest(HTTPTransportUtils.java:167)
	at org.apache.synapse.transport.nhttp.ServerWorker.processEntityEnclosingMethod(ServerWorker.java:349)
	at org.apache.synapse.transport.nhttp.ServerWorker.run(ServerWorker.java:241)
	at org.apache.axis2.transport.base.threads.NativeWorkerPool$1.run(NativeWorkerPool.java:58)
	at java.util.concurrent.ThreadPoolExecutor$Worker.runTask(ThreadPoolExecutor.java:650)
	at java.util.concurrent.ThreadPoolExecutor$Worker.run(ThreadPoolExecutor.java:675)
	at java.lang.Thread.run(Thread.java:595)
ERROR [HttpServerWorker-17] AxisEngine The service cannot be found for the endpoint reference
(EPR) /services/TestService-347c1d21-9d7a-4f24-ab77-7de9d9b64c62
org.apache.axis2.AxisFault: The service cannot be found for the endpoint reference (EPR) /services/TestService-347c1d21-9d7a-4f24-ab77-7de9d9b64c62
	at org.apache.axis2.engine.DispatchPhase.checkPostConditions(DispatchPhase.java:65)
	at org.apache.axis2.engine.Phase.invoke(Phase.java:334)
	at org.apache.axis2.engine.AxisEngine.invoke(AxisEngine.java:251)
	at org.apache.axis2.engine.AxisEngine.receive(AxisEngine.java:160)
	at org.apache.axis2.transport.http.HTTPTransportUtils.processHTTPPostRequest(HTTPTransportUtils.java:167)
	at org.apache.synapse.transport.nhttp.ServerWorker.processEntityEnclosingMethod(ServerWorker.java:349)
	at org.apache.synapse.transport.nhttp.ServerWorker.run(ServerWorker.java:241)
	at org.apache.axis2.transport.base.threads.NativeWorkerPool$1.run(NativeWorkerPool.java:58)
	at java.util.concurrent.ThreadPoolExecutor$Worker.runTask(ThreadPoolExecutor.java:650)
	at java.util.concurrent.ThreadPoolExecutor$Worker.run(ThreadPoolExecutor.java:675)
	at java.lang.Thread.run(Thread.java:595)
ERROR [HttpServerWorker-17] ServerWorker Error processing POST request 
org.apache.axis2.AxisFault: The service cannot be found for the endpoint reference (EPR) /services/TestService-347c1d21-9d7a-4f24-ab77-7de9d9b64c62
	at org.apache.axis2.engine.DispatchPhase.checkPostConditions(DispatchPhase.java:65)
	at org.apache.axis2.engine.Phase.invoke(Phase.java:334)
	at org.apache.axis2.engine.AxisEngine.invoke(AxisEngine.java:251)
	at org.apache.axis2.engine.AxisEngine.receive(AxisEngine.java:160)
	at org.apache.axis2.transport.http.HTTPTransportUtils.processHTTPPostRequest(HTTPTransportUtils.java:167)
	at org.apache.synapse.transport.nhttp.ServerWorker.processEntityEnclosingMethod(ServerWorker.java:349)
	at org.apache.synapse.transport.nhttp.ServerWorker.run(ServerWorker.java:241)
	at org.apache.axis2.transport.base.threads.NativeWorkerPool$1.run(NativeWorkerPool.java:58)
	at java.util.concurrent.ThreadPoolExecutor$Worker.runTask(ThreadPoolExecutor.java:650)
	at java.util.concurrent.ThreadPoolExecutor$Worker.run(ThreadPoolExecutor.java:675)
	at java.lang.Thread.run(Thread.java:595)
ERROR [HttpServerWorker-18] AxisEngine The service cannot be found for the endpoint reference
(EPR) /services/TestService-347c1d21-9d7a-4f24-ab77-7de9d9b64c62
org.apache.axis2.AxisFault: The service cannot be found for the endpoint reference (EPR) /services/TestService-347c1d21-9d7a-4f24-ab77-7de9d9b64c62
	at org.apache.axis2.engine.DispatchPhase.checkPostConditions(DispatchPhase.java:65)
	at org.apache.axis2.engine.Phase.invoke(Phase.java:334)
	at org.apache.axis2.engine.AxisEngine.invoke(AxisEngine.java:251)
	at org.apache.axis2.engine.AxisEngine.receive(AxisEngine.java:160)
	at org.apache.axis2.transport.http.HTTPTransportUtils.processHTTPPostRequest(HTTPTransportUtils.java:167)
	at org.apache.synapse.transport.nhttp.ServerWorker.processEntityEnclosingMethod(ServerWorker.java:349)
	at org.apache.synapse.transport.nhttp.ServerWorker.run(ServerWorker.java:241)
	at org.apache.axis2.transport.base.threads.NativeWorkerPool$1.run(NativeWorkerPool.java:58)
	at java.util.concurrent.ThreadPoolExecutor$Worker.runTask(ThreadPoolExecutor.java:650)
	at java.util.concurrent.ThreadPoolExecutor$Worker.run(ThreadPoolExecutor.java:675)
	at java.lang.Thread.run(Thread.java:595)
ERROR [HttpServerWorker-18] ServerWorker Error processing POST request 
org.apache.axis2.AxisFault: The service cannot be found for the endpoint reference (EPR) /services/TestService-347c1d21-9d7a-4f24-ab77-7de9d9b64c62
	at org.apache.axis2.engine.DispatchPhase.checkPostConditions(DispatchPhase.java:65)
	at org.apache.axis2.engine.Phase.invoke(Phase.java:334)
	at org.apache.axis2.engine.AxisEngine.invoke(AxisEngine.java:251)
	at org.apache.axis2.engine.AxisEngine.receive(AxisEngine.java:160)
	at org.apache.axis2.transport.http.HTTPTransportUtils.processHTTPPostRequest(HTTPTransportUtils.java:167)
	at org.apache.synapse.transport.nhttp.ServerWorker.processEntityEnclosingMethod(ServerWorker.java:349)
	at org.apache.synapse.transport.nhttp.ServerWorker.run(ServerWorker.java:241)
	at org.apache.axis2.transport.base.threads.NativeWorkerPool$1.run(NativeWorkerPool.java:58)
	at java.util.concurrent.ThreadPoolExecutor$Worker.runTask(ThreadPoolExecutor.java:650)
	at java.util.concurrent.ThreadPoolExecutor$Worker.run(ThreadPoolExecutor.java:675)
	at java.lang.Thread.run(Thread.java:595)
ERROR [HttpServerWorker-2] AxisEngine The service cannot be found for the endpoint reference
(EPR) /services/TestService-347c1d21-9d7a-4f24-ab77-7de9d9b64c62
org.apache.axis2.AxisFault: The service cannot be found for the endpoint reference (EPR) /services/TestService-347c1d21-9d7a-4f24-ab77-7de9d9b64c62
	at org.apache.axis2.engine.DispatchPhase.checkPostConditions(DispatchPhase.java:65)
	at org.apache.axis2.engine.Phase.invoke(Phase.java:334)
	at org.apache.axis2.engine.AxisEngine.invoke(AxisEngine.java:251)
	at org.apache.axis2.engine.AxisEngine.receive(AxisEngine.java:160)
	at org.apache.axis2.transport.http.HTTPTransportUtils.processHTTPPostRequest(HTTPTransportUtils.java:167)
	at org.apache.synapse.transport.nhttp.ServerWorker.processEntityEnclosingMethod(ServerWorker.java:349)
	at org.apache.synapse.transport.nhttp.ServerWorker.run(ServerWorker.java:241)
	at org.apache.axis2.transport.base.threads.NativeWorkerPool$1.run(NativeWorkerPool.java:58)
	at java.util.concurrent.ThreadPoolExecutor$Worker.runTask(ThreadPoolExecutor.java:650)
	at java.util.concurrent.ThreadPoolExecutor$Worker.run(ThreadPoolExecutor.java:675)
	at java.lang.Thread.run(Thread.java:595)
ERROR [HttpServerWorker-2] ServerWorker Error processing POST request 
org.apache.axis2.AxisFault: The service cannot be found for the endpoint reference (EPR) /services/TestService-347c1d21-9d7a-4f24-ab77-7de9d9b64c62
	at org.apache.axis2.engine.DispatchPhase.checkPostConditions(DispatchPhase.java:65)
	at org.apache.axis2.engine.Phase.invoke(Phase.java:334)
	at org.apache.axis2.engine.AxisEngine.invoke(AxisEngine.java:251)
	at org.apache.axis2.engine.AxisEngine.receive(AxisEngine.java:160)
	at org.apache.axis2.transport.http.HTTPTransportUtils.processHTTPPostRequest(HTTPTransportUtils.java:167)
	at org.apache.synapse.transport.nhttp.ServerWorker.processEntityEnclosingMethod(ServerWorker.java:349)
	at org.apache.synapse.transport.nhttp.ServerWorker.run(ServerWorker.java:241)
	at org.apache.axis2.transport.base.threads.NativeWorkerPool$1.run(NativeWorkerPool.java:58)
	at java.util.concurrent.ThreadPoolExecutor$Worker.runTask(ThreadPoolExecutor.java:650)
	at java.util.concurrent.ThreadPoolExecutor$Worker.run(ThreadPoolExecutor.java:675)
	at java.lang.Thread.run(Thread.java:595)
ERROR [HttpServerWorker-1] AxisEngine The service cannot be found for the endpoint reference
(EPR) /services/TestService-347c1d21-9d7a-4f24-ab77-7de9d9b64c62
org.apache.axis2.AxisFault: The service cannot be found for the endpoint reference (EPR) /services/TestService-347c1d21-9d7a-4f24-ab77-7de9d9b64c62
	at org.apache.axis2.engine.DispatchPhase.checkPostConditions(DispatchPhase.java:65)
	at org.apache.axis2.engine.Phase.invoke(Phase.java:334)
	at org.apache.axis2.engine.AxisEngine.invoke(AxisEngine.java:251)
	at org.apache.axis2.engine.AxisEngine.receive(AxisEngine.java:160)
	at org.apache.axis2.transport.http.HTTPTransportUtils.processHTTPPostRequest(HTTPTransportUtils.java:167)
	at org.apache.synapse.transport.nhttp.ServerWorker.processEntityEnclosingMethod(ServerWorker.java:349)
	at org.apache.synapse.transport.nhttp.ServerWorker.run(ServerWorker.java:241)
	at org.apache.axis2.transport.base.threads.NativeWorkerPool$1.run(NativeWorkerPool.java:58)
	at java.util.concurrent.ThreadPoolExecutor$Worker.runTask(ThreadPoolExecutor.java:650)
	at java.util.concurrent.ThreadPoolExecutor$Worker.run(ThreadPoolExecutor.java:675)
	at java.lang.Thread.run(Thread.java:595)
ERROR [HttpServerWorker-1] ServerWorker Error processing POST request 
org.apache.axis2.AxisFault: The service cannot be found for the endpoint reference (EPR) /services/TestService-347c1d21-9d7a-4f24-ab77-7de9d9b64c62
	at org.apache.axis2.engine.DispatchPhase.checkPostConditions(DispatchPhase.java:65)
	at org.apache.axis2.engine.Phase.invoke(Phase.java:334)
	at org.apache.axis2.engine.AxisEngine.invoke(AxisEngine.java:251)
	at org.apache.axis2.engine.AxisEngine.receive(AxisEngine.java:160)
	at org.apache.axis2.transport.http.HTTPTransportUtils.processHTTPPostRequest(HTTPTransportUtils.java:167)
	at org.apache.synapse.transport.nhttp.ServerWorker.processEntityEnclosingMethod(ServerWorker.java:349)
	at org.apache.synapse.transport.nhttp.ServerWorker.run(ServerWorker.java:241)
	at org.apache.axis2.transport.base.threads.NativeWorkerPool$1.run(NativeWorkerPool.java:58)
	at java.util.concurrent.ThreadPoolExecutor$Worker.runTask(ThreadPoolExecutor.java:650)
	at java.util.concurrent.ThreadPoolExecutor$Worker.run(ThreadPoolExecutor.java:675)
	at java.lang.Thread.run(Thread.java:595)
[IsolatedClassLoader@b82368] weaveinfo Join point 'method-call(void org.apache.axis2.transport.MessageFormatter.writeTo(org.apache.axis2.context.MessageContext,
org.apache.axiom.om.OMOutputFormat, java.io.OutputStream, boolean))' in Type 'org.apache.synapse.transport.nhttp.Axis2HttpRequest'
(Axis2HttpRequest.java:167) advised by around advice from 'org.apache.axis2.transport.testkit.axis2.LogAspect'
(LogAspect.java)
[IsolatedClassLoader@b82368] weaveinfo Join point 'method-call(void org.apache.axis2.transport.MessageFormatter.writeTo(org.apache.axis2.context.MessageContext,
org.apache.axiom.om.OMOutputFormat, java.io.OutputStream, boolean))' in Type 'org.apache.synapse.transport.nhttp.Axis2HttpRequest'
(Axis2HttpRequest.java:287) advised by around advice from 'org.apache.axis2.transport.testkit.axis2.LogAspect'
(LogAspect.java)
ERROR [HttpServerWorker-5] AxisEngine The service cannot be found for the endpoint reference
(EPR) /services/TestService-347c1d21-9d7a-4f24-ab77-7de9d9b64c62
org.apache.axis2.AxisFault: The service cannot be found for the endpoint reference (EPR) /services/TestService-347c1d21-9d7a-4f24-ab77-7de9d9b64c62
	at org.apache.axis2.engine.DispatchPhase.checkPostConditions(DispatchPhase.java:65)
	at org.apache.axis2.engine.Phase.invoke(Phase.java:334)
	at org.apache.axis2.engine.AxisEngine.invoke(AxisEngine.java:251)
	at org.apache.axis2.engine.AxisEngine.receive(AxisEngine.java:160)
	at org.apache.axis2.transport.http.HTTPTransportUtils.processHTTPPostRequest(HTTPTransportUtils.java:167)
	at org.apache.synapse.transport.nhttp.ServerWorker.processEntityEnclosingMethod(ServerWorker.java:349)
	at org.apache.synapse.transport.nhttp.ServerWorker.run(ServerWorker.java:241)
	at org.apache.axis2.transport.base.threads.NativeWorkerPool$1.run(NativeWorkerPool.java:58)
	at java.util.concurrent.ThreadPoolExecutor$Worker.runTask(ThreadPoolExecutor.java:650)
	at java.util.concurrent.ThreadPoolExecutor$Worker.run(ThreadPoolExecutor.java:675)
	at java.lang.Thread.run(Thread.java:595)
ERROR [HttpServerWorker-5] ServerWorker Error processing POST request 
org.apache.axis2.AxisFault: The service cannot be found for the endpoint reference (EPR) /services/TestService-347c1d21-9d7a-4f24-ab77-7de9d9b64c62
	at org.apache.axis2.engine.DispatchPhase.checkPostConditions(DispatchPhase.java:65)
	at org.apache.axis2.engine.Phase.invoke(Phase.java:334)
	at org.apache.axis2.engine.AxisEngine.invoke(AxisEngine.java:251)
	at org.apache.axis2.engine.AxisEngine.receive(AxisEngine.java:160)
	at org.apache.axis2.transport.http.HTTPTransportUtils.processHTTPPostRequest(HTTPTransportUtils.java:167)
	at org.apache.synapse.transport.nhttp.ServerWorker.processEntityEnclosingMethod(ServerWorker.java:349)
	at org.apache.synapse.transport.nhttp.ServerWorker.run(ServerWorker.java:241)
	at org.apache.axis2.transport.base.threads.NativeWorkerPool$1.run(NativeWorkerPool.java:58)
	at java.util.concurrent.ThreadPoolExecutor$Worker.runTask(ThreadPoolExecutor.java:650)
	at java.util.concurrent.ThreadPoolExecutor$Worker.run(ThreadPoolExecutor.java:675)
	at java.lang.Thread.run(Thread.java:595)
log4j:ERROR Failed to flush writer,
java.io.InterruptedIOException
	at java.io.FileOutputStream.writeBytes(Native Method)
	at java.io.FileOutputStream.write(FileOutputStream.java:260)
	at sun.nio.cs.StreamEncoder$CharsetSE.writeBytes(StreamEncoder.java:336)
	at sun.nio.cs.StreamEncoder$CharsetSE.implFlushBuffer(StreamEncoder.java:404)
	at sun.nio.cs.StreamEncoder$CharsetSE.implFlush(StreamEncoder.java:408)
	at sun.nio.cs.StreamEncoder.flush(StreamEncoder.java:152)
	at java.io.OutputStreamWriter.flush(OutputStreamWriter.java:213)
	at org.apache.log4j.helpers.QuietWriter.flush(QuietWriter.java:57)
	at org.apache.log4j.WriterAppender.subAppend(WriterAppender.java:315)
	at org.apache.log4j.WriterAppender.append(WriterAppender.java:159)
	at org.apache.log4j.AppenderSkeleton.doAppend(AppenderSkeleton.java:230)
	at org.apache.log4j.helpers.AppenderAttachableImpl.appendLoopOnAppenders(AppenderAttachableImpl.java:65)
	at org.apache.log4j.Category.callAppenders(Category.java:203)
	at org.apache.log4j.Category.forcedLog(Category.java:388)
	at org.apache.log4j.Category.log(Category.java:853)
	at org.apache.commons.logging.impl.Log4JLogger.info(Log4JLogger.java:199)
	at org.mortbay.util.ThreadedServer$Acceptor.run(ThreadedServer.java:659)
ERROR [HttpServerWorker-1] AxisEngine The service cannot be found for the endpoint reference
(EPR) /services/TestService-347c1d21-9d7a-4f24-ab77-7de9d9b64c62
org.apache.axis2.AxisFault: The service cannot be found for the endpoint reference (EPR) /services/TestService-347c1d21-9d7a-4f24-ab77-7de9d9b64c62
	at org.apache.axis2.engine.DispatchPhase.checkPostConditions(DispatchPhase.java:65)
	at org.apache.axis2.engine.Phase.invoke(Phase.java:334)
	at org.apache.axis2.engine.AxisEngine.invoke(AxisEngine.java:251)
	at org.apache.axis2.engine.AxisEngine.receive(AxisEngine.java:160)
	at org.apache.axis2.transport.http.HTTPTransportUtils.processHTTPPostRequest(HTTPTransportUtils.java:167)
	at org.apache.synapse.transport.nhttp.ServerWorker.processEntityEnclosingMethod(ServerWorker.java:349)
	at org.apache.synapse.transport.nhttp.ServerWorker.run(ServerWorker.java:241)
	at org.apache.axis2.transport.base.threads.NativeWorkerPool$1.run(NativeWorkerPool.java:58)
	at java.util.concurrent.ThreadPoolExecutor$Worker.runTask(ThreadPoolExecutor.java:650)
	at java.util.concurrent.ThreadPoolExecutor$Worker.run(ThreadPoolExecutor.java:675)
	at java.lang.Thread.run(Thread.java:595)
ERROR [HttpServerWorker-1] ServerWorker Error processing POST request 
org.apache.axis2.AxisFault: The service cannot be found for the endpoint reference (EPR) /services/TestService-347c1d21-9d7a-4f24-ab77-7de9d9b64c62
	at org.apache.axis2.engine.DispatchPhase.checkPostConditions(DispatchPhase.java:65)
	at org.apache.axis2.engine.Phase.invoke(Phase.java:334)
	at org.apache.axis2.engine.AxisEngine.invoke(AxisEngine.java:251)
	at org.apache.axis2.engine.AxisEngine.receive(AxisEngine.java:160)
	at org.apache.axis2.transport.http.HTTPTransportUtils.processHTTPPostRequest(HTTPTransportUtils.java:167)
	at org.apache.synapse.transport.nhttp.ServerWorker.processEntityEnclosingMethod(ServerWorker.java:349)
	at org.apache.synapse.transport.nhttp.ServerWorker.run(ServerWorker.java:241)
	at org.apache.axis2.transport.base.threads.NativeWorkerPool$1.run(NativeWorkerPool.java:58)
	at java.util.concurrent.ThreadPoolExecutor$Worker.runTask(ThreadPoolExecutor.java:650)
	at java.util.concurrent.ThreadPoolExecutor$Worker.run(ThreadPoolExecutor.java:675)
	at java.lang.Thread.run(Thread.java:595)
Tests run: 77, Failures: 1, Errors: 6, Skipped: 0, Time elapsed: 69.347 sec <<< FAILURE!

Results :

Failed tests: 
  0074:test=AsyncBinary,forceHTTP10=true,client=axis,endpoint=axis(org.apache.synapse.transport.nhttp.HttpCoreNIOListenerTest)

Tests in error: 
  0056:test=AsyncTextPlain,data=ASCII,client=java.net,endpoint=axis(org.apache.synapse.transport.nhttp.HttpCoreNIOListenerTest)
  0057:test=AsyncTextPlain,data=UTF8,client=java.net,endpoint=axis(org.apache.synapse.transport.nhttp.HttpCoreNIOListenerTest)
  0059:test=AsyncTextPlain,data=ASCII,forceHTTP10=false,client=axis,endpoint=axis(org.apache.synapse.transport.nhttp.HttpCoreNIOListenerTest)
  0060:test=AsyncTextPlain,data=UTF8,forceHTTP10=false,client=axis,endpoint=axis(org.apache.synapse.transport.nhttp.HttpCoreNIOListenerTest)
  0061:test=AsyncTextPlain,data=Latin1,forceHTTP10=false,client=axis,endpoint=axis(org.apache.synapse.transport.nhttp.HttpCoreNIOListenerTest)
  0077:test=MinConcurrency(org.apache.synapse.transport.nhttp.HttpCoreNIOListenerTest)

Tests run: 77, Failures: 1, Errors: 6, Skipped: 0

[ERROR] There are test failures.
[HUDSON] Recording test results
[INFO] [bundle:bundle]
[INFO] [assembly:attached {execution: attach-testkit-logs}]
[INFO] Reading assembly descriptor: src/main/assembly/testkit-logs.xml
[INFO] Building zip: <http://hudson.zones.apache.org/hudson/job/Synapse%20-%201.3%20-%20SNAPSHOT/ws/java/modules/transports/core/nhttp/target/synapse-nhttp-transport-1.3.0-SNAPSHOT-testkit-logs.zip>
[INFO] [install:install]
[INFO] Installing <http://hudson.zones.apache.org/hudson/job/Synapse%20-%201.3%20-%20SNAPSHOT/ws/java/modules/transports/core/nhttp/target/synapse-nhttp-transport-1.3.0-SNAPSHOT.jar>
to /export/home/hudson/.m2/repository/org/apache/synapse/synapse-nhttp-transport/1.3.0-SNAPSHOT/synapse-nhttp-transport-1.3.0-SNAPSHOT.jar
[INFO] Installing <http://hudson.zones.apache.org/hudson/job/Synapse%20-%201.3%20-%20SNAPSHOT/ws/java/modules/transports/core/nhttp/target/synapse-nhttp-transport-1.3.0-SNAPSHOT-testkit-logs.zip>
to /export/home/hudson/.m2/repository/org/apache/synapse/synapse-nhttp-transport/1.3.0-SNAPSHOT/synapse-nhttp-transport-1.3.0-SNAPSHOT-testkit-logs.zip
[INFO] [bundle:install]
[INFO] Parsing file:/export/home/hudson/.m2/repository/repository.xml
[INFO] Installing org/apache/synapse/synapse-nhttp-transport/1.3.0-SNAPSHOT/synapse-nhttp-transport-1.3.0-SNAPSHOT.jar
[INFO] Writing OBR metadata
[HUDSON] Archiving <http://hudson.zones.apache.org/hudson/job/Synapse%20-%201.3%20-%20SNAPSHOT/ws/java/modules/transports/core/nhttp/pom.xml>
to /export/home/hudson/hudson/jobs/Synapse - 1.3 - SNAPSHOT/modules/org.apache.synapse$synapse-nhttp-transport/builds/2009-12-05_06-01-52/archive/org.apache.synapse/synapse-nhttp-transport/1.3.0-SNAPSHOT/pom.xml
[HUDSON] Archiving <http://hudson.zones.apache.org/hudson/job/Synapse%20-%201.3%20-%20SNAPSHOT/ws/java/modules/transports/core/nhttp/target/synapse-nhttp-transport-1.3.0-SNAPSHOT.jar>
to /export/home/hudson/hudson/jobs/Synapse - 1.3 - SNAPSHOT/modules/org.apache.synapse$synapse-nhttp-transport/builds/2009-12-05_06-01-52/archive/org.apache.synapse/synapse-nhttp-transport/1.3.0-SNAPSHOT/synapse-nhttp-transport-1.3.0-SNAPSHOT.jar
[HUDSON] Archiving <http://hudson.zones.apache.org/hudson/job/Synapse%20-%201.3%20-%20SNAPSHOT/ws/java/modules/transports/core/nhttp/target/synapse-nhttp-transport-1.3.0-SNAPSHOT-testkit-logs.zip>
to /export/home/hudson/hudson/jobs/Synapse - 1.3 - SNAPSHOT/modules/org.apache.synapse$synapse-nhttp-transport/builds/2009-12-05_06-01-52/archive/org.apache.synapse/synapse-nhttp-transport/1.3.0-SNAPSHOT/synapse-nhttp-transport-1.3.0-SNAPSHOT-testkit-logs.zip
[INFO] ------------------------------------------------------------------------
[INFO] Building Apache Synapse - PIPE Transport
[INFO]    task-segment: [clean, install]
[INFO] ------------------------------------------------------------------------
[INFO] [clean:clean]
[INFO] Deleting directory <http://hudson.zones.apache.org/hudson/job/Synapse%20-%201.3%20-%20SNAPSHOT/ws/java/modules/transports/core/pipe/target>
[INFO] [resources:resources]
[INFO] Using default encoding to copy filtered resources.
[INFO] [compiler:compile]
Compiling 9 source files to <http://hudson.zones.apache.org/hudson/job/Synapse%20-%201.3%20-%20SNAPSHOT/ws/java/modules/transports/core/pipe/target/classes>
[HUDSON] Archiving <http://hudson.zones.apache.org/hudson/job/Synapse%20-%201.3%20-%20SNAPSHOT/ws/java/modules/transports/core/pipe/pom.xml>
to /export/home/hudson/hudson/jobs/Synapse - 1.3 - SNAPSHOT/modules/org.apache.synapse$synapse-pipe-transport/builds/2009-12-05_06-01-52/archive/org.apache.synapse/synapse-pipe-transport/1.3.0-SNAPSHOT/pom.xml
[INFO] ------------------------------------------------------------------------
[ERROR] BUILD FAILURE
[INFO] ------------------------------------------------------------------------
[INFO] Compilation failure

<http://hudson.zones.apache.org/hudson/job/Synapse%20-%201.3%20-%20SNAPSHOT/ws/java/modules/transports/core/pipe/src/main/java/org/apache/synapse/transport/pipe/PipeEndpointListener.java>:[107,28]
receive(java.net.SocketAddress,org.apache.axis2.transport.base.datagram.DatagramEndpoint,byte[],int)
in org.apache.axis2.transport.base.datagram.DatagramDispatcherCallback cannot be applied to
(org.apache.synapse.transport.pipe.PipeEndpoint,byte[],int)


[INFO] ------------------------------------------------------------------------
[INFO] For more information, run Maven with the -e switch
[INFO] ------------------------------------------------------------------------
[INFO] Total time: 3 minutes 51 seconds
[INFO] Finished at: Sat Dec 05 06:06:03 UTC 2009
[INFO] Final Memory: 39M/152M
[INFO] ------------------------------------------------------------------------
Sending e-mails to: dev@synapse.apache.org
Sending e-mails to: dev@synapse.apache.org
channel stopped


---------------------------------------------------------------------
To unsubscribe, e-mail: dev-unsubscribe@synapse.apache.org
For additional commands, e-mail: dev-help@synapse.apache.org


Mime
View raw message