synapse-dev mailing list archives

Site index · List index
Message view « Date » · « Thread »
Top « Date » · « Thread »
From Apache Hudson Server <hud...@hudson.zones.apache.org>
Subject Build failed in Hudson: Synapse - 1.3 - SNAPSHOT #117
Date Sat, 12 Dec 2009 12:39:02 GMT
See <http://hudson.zones.apache.org/hudson/job/Synapse%20-%201.3%20-%20SNAPSHOT/117/>

------------------------------------------
[...truncated 43 lines...]
[INFO]    task-segment: [clean, install]
[INFO] ------------------------------------------------------------------------
[INFO] [clean:clean]
[INFO] Deleting directory <http://hudson.zones.apache.org/hudson/job/Synapse%20-%201.3%20-%20SNAPSHOT/ws/java/modules/commons/target>
[INFO] [resources:resources]
[INFO] Using default encoding to copy filtered resources.
[INFO] snapshot org.apache.sandesha2:sandesha2-core:SNAPSHOT: checking for updates from apache-snapshots
[INFO] snapshot org.apache.sandesha2:sandesha2-core:SNAPSHOT: checking for updates from wso2-m2
2K downloaded
[INFO] snapshot org.apache.sandesha2:sandesha2-parent:SNAPSHOT: checking for updates from
apache-snapshots
[INFO] snapshot org.apache.sandesha2:sandesha2-parent:SNAPSHOT: checking for updates from
wso2-m2
11K downloaded
[INFO] snapshot org.apache.axis2:addressing:SNAPSHOT: checking for updates from apache-snapshots
[INFO] snapshot org.apache.axis2:addressing:SNAPSHOT: checking for updates from wso2-m2
[INFO] snapshot org.apache.axis2:axis2-parent:SNAPSHOT: checking for updates from apache-snapshots
[INFO] snapshot org.apache.axis2:axis2-parent:SNAPSHOT: checking for updates from wso2-m2
Downloading: http://repository.apache.org/snapshots/java-cup/java-cup/0.0/java-cup-0.0.pom
Downloading: http://dist.wso2.org/maven2//java-cup/java-cup/0.0/java-cup-0.0.pom
Downloading: http://people.apache.org/~asankha/repository/java-cup/java-cup/0.0/java-cup-0.0.pom
Downloading: http://repo1.maven.org/maven2/java-cup/java-cup/0.0/java-cup-0.0.pom
Downloading: http://repository.apache.org/snapshots/JLex/JLex/0.0/JLex-0.0.pom
Downloading: http://dist.wso2.org/maven2//JLex/JLex/0.0/JLex-0.0.pom
Downloading: http://people.apache.org/~asankha/repository/JLex/JLex/0.0/JLex-0.0.pom
Downloading: http://repo1.maven.org/maven2/JLex/JLex/0.0/JLex-0.0.pom
Downloading: http://repository.apache.org/snapshots/net/sf/saxon/saxon/8.9/saxon-8.9.pom
Downloading: http://dist.wso2.org/maven2//net/sf/saxon/saxon/8.9/saxon-8.9.pom
Downloading: http://people.apache.org/~asankha/repository/net/sf/saxon/saxon/8.9/saxon-8.9.pom
Downloading: http://repo1.maven.org/maven2/net/sf/saxon/saxon/8.9/saxon-8.9.pom
Downloading: http://repository.apache.org/snapshots/net/sf/saxon/saxon-dom/8.9/saxon-dom-8.9.pom
Downloading: http://dist.wso2.org/maven2//net/sf/saxon/saxon-dom/8.9/saxon-dom-8.9.pom
Downloading: http://people.apache.org/~asankha/repository/net/sf/saxon/saxon-dom/8.9/saxon-dom-8.9.pom
Downloading: http://repo1.maven.org/maven2/net/sf/saxon/saxon-dom/8.9/saxon-dom-8.9.pom
Downloading: http://repository.apache.org/snapshots/net/sf/saxon/saxon-xqj/8.9/saxon-xqj-8.9.pom
Downloading: http://dist.wso2.org/maven2//net/sf/saxon/saxon-xqj/8.9/saxon-xqj-8.9.pom
Downloading: http://people.apache.org/~asankha/repository/net/sf/saxon/saxon-xqj/8.9/saxon-xqj-8.9.pom
Downloading: http://repo1.maven.org/maven2/net/sf/saxon/saxon-xqj/8.9/saxon-xqj-8.9.pom
365K downloaded
[INFO] [compiler:compile]
Compiling 77 source files to <http://hudson.zones.apache.org/hudson/job/Synapse%20-%201.3%20-%20SNAPSHOT/ws/java/modules/commons/target/classes>
[INFO] [resources:testResources]
[INFO] Using default encoding to copy filtered resources.
[INFO] [compiler:testCompile]
Compiling 1 source file to <http://hudson.zones.apache.org/hudson/job/Synapse%20-%201.3%20-%20SNAPSHOT/ws/java/modules/commons/target/test-classes>
[INFO] [surefire:test]
[INFO] Surefire report directory: <http://hudson.zones.apache.org/hudson/job/Synapse%20-%201.3%20-%20SNAPSHOT/ws/java/modules/commons/target/surefire-reports>

-------------------------------------------------------
 T E S T S
-------------------------------------------------------
Running org.apache.synapse.util.TemporaryDataTest
Tests run: 5, Failures: 0, Errors: 0, Skipped: 0, Time elapsed: 1.32 sec

Results :

Tests run: 5, Failures: 0, Errors: 0, Skipped: 0

[HUDSON] Recording test results
[INFO] [bundle:bundle]
[INFO] [install:install]
[INFO] Installing <http://hudson.zones.apache.org/hudson/job/Synapse%20-%201.3%20-%20SNAPSHOT/ws/java/modules/commons/target/synapse-commons-1.3.0-SNAPSHOT.jar>
to /export/home/hudson/.m2/repository/org/apache/synapse/synapse-commons/1.3.0-SNAPSHOT/synapse-commons-1.3.0-SNAPSHOT.jar
[INFO] [bundle:install]
[INFO] Parsing file:/export/home/hudson/.m2/repository/repository.xml
[INFO] Installing org/apache/synapse/synapse-commons/1.3.0-SNAPSHOT/synapse-commons-1.3.0-SNAPSHOT.jar
[INFO] Writing OBR metadata
[HUDSON] Archiving <http://hudson.zones.apache.org/hudson/job/Synapse%20-%201.3%20-%20SNAPSHOT/ws/java/modules/commons/pom.xml>
to /export/home/hudson/hudson/jobs/Synapse - 1.3 - SNAPSHOT/modules/org.apache.synapse$synapse-commons/builds/2009-12-12_12-30-32/archive/org.apache.synapse/synapse-commons/1.3.0-SNAPSHOT/pom.xml
[HUDSON] Archiving <http://hudson.zones.apache.org/hudson/job/Synapse%20-%201.3%20-%20SNAPSHOT/ws/java/modules/commons/target/synapse-commons-1.3.0-SNAPSHOT.jar>
to /export/home/hudson/hudson/jobs/Synapse - 1.3 - SNAPSHOT/modules/org.apache.synapse$synapse-commons/builds/2009-12-12_12-30-32/archive/org.apache.synapse/synapse-commons/1.3.0-SNAPSHOT/synapse-commons-1.3.0-SNAPSHOT.jar
[INFO] ------------------------------------------------------------------------
[INFO] Building Apache Synapse - Transports
[INFO]    task-segment: [clean, install]
[INFO] ------------------------------------------------------------------------
[INFO] [clean:clean]
[INFO] [site:attach-descriptor]
[INFO] [install:install]
[INFO] Installing <http://hudson.zones.apache.org/hudson/job/Synapse%20-%201.3%20-%20SNAPSHOT/ws/java/modules/transports/pom.xml>
to /export/home/hudson/.m2/repository/org/apache/synapse/synapse-transports/1.3.0-SNAPSHOT/synapse-transports-1.3.0-SNAPSHOT.pom
[HUDSON] Archiving <http://hudson.zones.apache.org/hudson/job/Synapse%20-%201.3%20-%20SNAPSHOT/ws/java/modules/transports/pom.xml>
to /export/home/hudson/hudson/jobs/Synapse - 1.3 - SNAPSHOT/modules/org.apache.synapse$synapse-transports/builds/2009-12-12_12-30-32/archive/org.apache.synapse/synapse-transports/1.3.0-SNAPSHOT/pom.xml
[INFO] ------------------------------------------------------------------------
[INFO] Building Apache Synapse - Non-blocking HTTP/s Transport
[INFO]    task-segment: [clean, install]
[INFO] ------------------------------------------------------------------------
[INFO] [clean:clean]
[INFO] Deleting directory <http://hudson.zones.apache.org/hudson/job/Synapse%20-%201.3%20-%20SNAPSHOT/ws/java/modules/transports/core/nhttp/target>
[INFO] [resources:resources]
[INFO] Using default encoding to copy filtered resources.
[INFO] snapshot org.apache.axis2:axis2-transport-base:1.0-SNAPSHOT: checking for updates from
apache-snapshots
[INFO] snapshot org.apache.axis2:axis2-transport-base:1.0-SNAPSHOT: checking for updates from
wso2-m2
6K downloaded
[INFO] snapshot org.apache.axis2:axis2-transport:1.0-SNAPSHOT: checking for updates from apache-snapshots
[INFO] snapshot org.apache.axis2:axis2-transport:1.0-SNAPSHOT: checking for updates from wso2-m2
15K downloaded
[INFO] snapshot org.apache.axis2:axis2-transport-testkit:1.0-SNAPSHOT: checking for updates
from apache-snapshots
[INFO] snapshot org.apache.axis2:axis2-transport-testkit:1.0-SNAPSHOT: checking for updates
from wso2-m2
8K downloaded
[INFO] snapshot org.apache.synapse:synapse-commons:1.3.0-SNAPSHOT: checking for updates from
apache-snapshots
[INFO] snapshot org.apache.synapse:synapse-commons:1.3.0-SNAPSHOT: checking for updates from
wso2-m2
100K downloaded
[INFO] [compiler:compile]
Compiling 29 source files to <http://hudson.zones.apache.org/hudson/job/Synapse%20-%201.3%20-%20SNAPSHOT/ws/java/modules/transports/core/nhttp/target/classes>
[INFO] [dependency:copy {execution: copy}]
[INFO] Configured Artifact: org.aspectj:aspectjweaver:?:jar
[INFO] Copying aspectjweaver-1.6.1.jar to <http://hudson.zones.apache.org/hudson/job/Synapse%20-%201.3%20-%20SNAPSHOT/ws/java/modules/transports/core/nhttp/target/lib/aspectjweaver.jar>
[INFO] [resources:testResources]
[INFO] Using default encoding to copy filtered resources.
192K downloaded
[INFO] [compiler:testCompile]
Compiling 2 source files to <http://hudson.zones.apache.org/hudson/job/Synapse%20-%201.3%20-%20SNAPSHOT/ws/java/modules/transports/core/nhttp/target/test-classes>
[INFO] [surefire:test]
[INFO] Surefire report directory: <http://hudson.zones.apache.org/hudson/job/Synapse%20-%201.3%20-%20SNAPSHOT/ws/java/modules/transports/core/nhttp/target/surefire-reports>
[IsolatedClassLoader@11c8a71] weaveinfo Join point 'method-call(void org.apache.axis2.transport.MessageFormatter.writeTo(org.apache.axis2.context.MessageContext,
org.apache.axiom.om.OMOutputFormat, java.io.OutputStream, boolean))' in Type 'org.apache.synapse.transport.nhttp.HttpCoreNIOSender'
(HttpCoreNIOSender.java:446) advised by around advice from 'org.apache.axis2.transport.testkit.axis2.LogAspect'
(LogAspect.java)
[IsolatedClassLoader@11c8a71] weaveinfo Join point 'method-call(void org.apache.axis2.transport.MessageFormatter.writeTo(org.apache.axis2.context.MessageContext,
org.apache.axiom.om.OMOutputFormat, java.io.OutputStream, boolean))' in Type 'org.apache.synapse.transport.nhttp.HttpCoreNIOSender'
(HttpCoreNIOSender.java:652) advised by around advice from 'org.apache.axis2.transport.testkit.axis2.LogAspect'
(LogAspect.java)

-------------------------------------------------------
 T E S T S
-------------------------------------------------------
Running org.apache.synapse.transport.nhttp.HttpCoreNIOListenerTest
Dec 12, 2009 12:38:03 PM org.apache.axis2.deployment.util.TempFileManager <clinit>
INFO: TempFileManager::unable to delete /var/tmp/axis2-tmp-25688.tmp
[IsolatedClassLoader@11c8a71] weaveinfo Join point 'method-call(void org.apache.axis2.transport.MessageFormatter.writeTo(org.apache.axis2.context.MessageContext,
org.apache.axiom.om.OMOutputFormat, java.io.OutputStream, boolean))' in Type 'org.apache.synapse.transport.nhttp.Axis2HttpRequest'
(Axis2HttpRequest.java:167) advised by around advice from 'org.apache.axis2.transport.testkit.axis2.LogAspect'
(LogAspect.java)
[IsolatedClassLoader@11c8a71] weaveinfo Join point 'method-call(void org.apache.axis2.transport.MessageFormatter.writeTo(org.apache.axis2.context.MessageContext,
org.apache.axiom.om.OMOutputFormat, java.io.OutputStream, boolean))' in Type 'org.apache.synapse.transport.nhttp.Axis2HttpRequest'
(Axis2HttpRequest.java:287) advised by around advice from 'org.apache.axis2.transport.testkit.axis2.LogAspect'
(LogAspect.java)
log4j:ERROR Failed to flush writer,
java.io.InterruptedIOException
	at java.io.FileOutputStream.writeBytes(Native Method)
	at java.io.FileOutputStream.write(FileOutputStream.java:260)
	at sun.nio.cs.StreamEncoder$CharsetSE.writeBytes(StreamEncoder.java:336)
	at sun.nio.cs.StreamEncoder$CharsetSE.implFlushBuffer(StreamEncoder.java:404)
	at sun.nio.cs.StreamEncoder$CharsetSE.implFlush(StreamEncoder.java:408)
	at sun.nio.cs.StreamEncoder.flush(StreamEncoder.java:152)
	at java.io.OutputStreamWriter.flush(OutputStreamWriter.java:213)
	at org.apache.log4j.helpers.QuietWriter.flush(QuietWriter.java:57)
	at org.apache.log4j.WriterAppender.subAppend(WriterAppender.java:315)
	at org.apache.log4j.WriterAppender.append(WriterAppender.java:159)
	at org.apache.log4j.AppenderSkeleton.doAppend(AppenderSkeleton.java:230)
	at org.apache.log4j.helpers.AppenderAttachableImpl.appendLoopOnAppenders(AppenderAttachableImpl.java:65)
	at org.apache.log4j.Category.callAppenders(Category.java:203)
	at org.apache.log4j.Category.forcedLog(Category.java:388)
	at org.apache.log4j.Category.log(Category.java:853)
	at org.apache.commons.logging.impl.Log4JLogger.info(Log4JLogger.java:199)
	at org.mortbay.util.ThreadedServer$Acceptor.run(ThreadedServer.java:659)
ERROR [HttpServerWorker-2] NativeWorkerPool Uncaught exception
java.lang.IllegalMonitorStateException
	at java.lang.Object.wait(Native Method)
	at java.lang.Object.wait(Object.java:474)
	at org.apache.axis2.transport.testkit.tests.misc.MinConcurrencyTest$1.receive(MinConcurrencyTest.java:91)
	at org.apache.axis2.engine.AxisEngine.receive(AxisEngine.java:173)
	at org.apache.axis2.transport.http.HTTPTransportUtils.processHTTPPostRequest(HTTPTransportUtils.java:167)
	at org.apache.synapse.transport.nhttp.ServerWorker.processEntityEnclosingMethod(ServerWorker.java:349)
	at org.apache.synapse.transport.nhttp.ServerWorker.run(ServerWorker.java:241)
	at org.apache.axis2.transport.base.threads.NativeWorkerPool$1.run(NativeWorkerPool.java:58)
	at java.util.concurrent.ThreadPoolExecutor$Worker.runTask(ThreadPoolExecutor.java:650)
	at java.util.concurrent.ThreadPoolExecutor$Worker.run(ThreadPoolExecutor.java:675)
	at java.lang.Thread.run(Thread.java:595)
ERROR [HttpServerWorker-3] NativeWorkerPool Uncaught exception
java.lang.IllegalMonitorStateException
	at java.lang.Object.wait(Native Method)
	at java.lang.Object.wait(Object.java:474)
	at org.apache.axis2.transport.testkit.tests.misc.MinConcurrencyTest$1.receive(MinConcurrencyTest.java:91)
	at org.apache.axis2.engine.AxisEngine.receive(AxisEngine.java:173)
	at org.apache.axis2.transport.http.HTTPTransportUtils.processHTTPPostRequest(HTTPTransportUtils.java:167)
	at org.apache.synapse.transport.nhttp.ServerWorker.processEntityEnclosingMethod(ServerWorker.java:349)
	at org.apache.synapse.transport.nhttp.ServerWorker.run(ServerWorker.java:241)
	at org.apache.axis2.transport.base.threads.NativeWorkerPool$1.run(NativeWorkerPool.java:58)
	at java.util.concurrent.ThreadPoolExecutor$Worker.runTask(ThreadPoolExecutor.java:650)
	at java.util.concurrent.ThreadPoolExecutor$Worker.run(ThreadPoolExecutor.java:675)
	at java.lang.Thread.run(Thread.java:595)
ERROR [HttpServerWorker-4] NativeWorkerPool Uncaught exception
java.lang.IllegalMonitorStateException
	at java.lang.Object.wait(Native Method)
	at java.lang.Object.wait(Object.java:474)
	at org.apache.axis2.transport.testkit.tests.misc.MinConcurrencyTest$1.receive(MinConcurrencyTest.java:91)
	at org.apache.axis2.engine.AxisEngine.receive(AxisEngine.java:173)
	at org.apache.axis2.transport.http.HTTPTransportUtils.processHTTPPostRequest(HTTPTransportUtils.java:167)
	at org.apache.synapse.transport.nhttp.ServerWorker.processEntityEnclosingMethod(ServerWorker.java:349)
	at org.apache.synapse.transport.nhttp.ServerWorker.run(ServerWorker.java:241)
	at org.apache.axis2.transport.base.threads.NativeWorkerPool$1.run(NativeWorkerPool.java:58)
	at java.util.concurrent.ThreadPoolExecutor$Worker.runTask(ThreadPoolExecutor.java:650)
	at java.util.concurrent.ThreadPoolExecutor$Worker.run(ThreadPoolExecutor.java:675)
	at java.lang.Thread.run(Thread.java:595)
ERROR [HttpServerWorker-5] NativeWorkerPool Uncaught exception
java.lang.IllegalMonitorStateException
	at java.lang.Object.wait(Native Method)
	at java.lang.Object.wait(Object.java:474)
	at org.apache.axis2.transport.testkit.tests.misc.MinConcurrencyTest$1.receive(MinConcurrencyTest.java:91)
	at org.apache.axis2.engine.AxisEngine.receive(AxisEngine.java:173)
	at org.apache.axis2.transport.http.HTTPTransportUtils.processHTTPPostRequest(HTTPTransportUtils.java:167)
	at org.apache.synapse.transport.nhttp.ServerWorker.processEntityEnclosingMethod(ServerWorker.java:349)
	at org.apache.synapse.transport.nhttp.ServerWorker.run(ServerWorker.java:241)
	at org.apache.axis2.transport.base.threads.NativeWorkerPool$1.run(NativeWorkerPool.java:58)
	at java.util.concurrent.ThreadPoolExecutor$Worker.runTask(ThreadPoolExecutor.java:650)
	at java.util.concurrent.ThreadPoolExecutor$Worker.run(ThreadPoolExecutor.java:675)
	at java.lang.Thread.run(Thread.java:595)
Tests run: 77, Failures: 1, Errors: 3, Skipped: 0, Time elapsed: 344.922 sec <<<
FAILURE!

Results :

Failed tests: 
  0034:test=AsyncXML,data=ASCII,messageType=SOAP11,forceHTTP10=true,client=axis,endpoint=axis(org.apache.synapse.transport.nhttp.HttpCoreNIOListenerTest)

Tests in error: 
  0056:test=AsyncTextPlain,data=ASCII,client=java.net,endpoint=axis(org.apache.synapse.transport.nhttp.HttpCoreNIOListenerTest)
  0057:test=AsyncTextPlain,data=UTF8,client=java.net,endpoint=axis(org.apache.synapse.transport.nhttp.HttpCoreNIOListenerTest)
  0071:test=AsyncBinary,client=java.net,endpoint=axis(org.apache.synapse.transport.nhttp.HttpCoreNIOListenerTest)

Tests run: 77, Failures: 1, Errors: 3, Skipped: 0

[ERROR] There are test failures.
[HUDSON] Recording test results
[INFO] [bundle:bundle]
[INFO] [assembly:attached {execution: attach-testkit-logs}]
[INFO] Reading assembly descriptor: src/main/assembly/testkit-logs.xml
[INFO] Building zip: <http://hudson.zones.apache.org/hudson/job/Synapse%20-%201.3%20-%20SNAPSHOT/ws/java/modules/transports/core/nhttp/target/synapse-nhttp-transport-1.3.0-SNAPSHOT-testkit-logs.zip>
[INFO] [install:install]
[INFO] Installing <http://hudson.zones.apache.org/hudson/job/Synapse%20-%201.3%20-%20SNAPSHOT/ws/java/modules/transports/core/nhttp/target/synapse-nhttp-transport-1.3.0-SNAPSHOT.jar>
to /export/home/hudson/.m2/repository/org/apache/synapse/synapse-nhttp-transport/1.3.0-SNAPSHOT/synapse-nhttp-transport-1.3.0-SNAPSHOT.jar
[INFO] Installing <http://hudson.zones.apache.org/hudson/job/Synapse%20-%201.3%20-%20SNAPSHOT/ws/java/modules/transports/core/nhttp/target/synapse-nhttp-transport-1.3.0-SNAPSHOT-testkit-logs.zip>
to /export/home/hudson/.m2/repository/org/apache/synapse/synapse-nhttp-transport/1.3.0-SNAPSHOT/synapse-nhttp-transport-1.3.0-SNAPSHOT-testkit-logs.zip
[INFO] [bundle:install]
[INFO] Parsing file:/export/home/hudson/.m2/repository/repository.xml
[INFO] Installing org/apache/synapse/synapse-nhttp-transport/1.3.0-SNAPSHOT/synapse-nhttp-transport-1.3.0-SNAPSHOT.jar
[INFO] Writing OBR metadata
[HUDSON] Archiving <http://hudson.zones.apache.org/hudson/job/Synapse%20-%201.3%20-%20SNAPSHOT/ws/java/modules/transports/core/nhttp/pom.xml>
to /export/home/hudson/hudson/jobs/Synapse - 1.3 - SNAPSHOT/modules/org.apache.synapse$synapse-nhttp-transport/builds/2009-12-12_12-30-32/archive/org.apache.synapse/synapse-nhttp-transport/1.3.0-SNAPSHOT/pom.xml
[HUDSON] Archiving <http://hudson.zones.apache.org/hudson/job/Synapse%20-%201.3%20-%20SNAPSHOT/ws/java/modules/transports/core/nhttp/target/synapse-nhttp-transport-1.3.0-SNAPSHOT.jar>
to /export/home/hudson/hudson/jobs/Synapse - 1.3 - SNAPSHOT/modules/org.apache.synapse$synapse-nhttp-transport/builds/2009-12-12_12-30-32/archive/org.apache.synapse/synapse-nhttp-transport/1.3.0-SNAPSHOT/synapse-nhttp-transport-1.3.0-SNAPSHOT.jar
[HUDSON] Archiving <http://hudson.zones.apache.org/hudson/job/Synapse%20-%201.3%20-%20SNAPSHOT/ws/java/modules/transports/core/nhttp/target/synapse-nhttp-transport-1.3.0-SNAPSHOT-testkit-logs.zip>
to /export/home/hudson/hudson/jobs/Synapse - 1.3 - SNAPSHOT/modules/org.apache.synapse$synapse-nhttp-transport/builds/2009-12-12_12-30-32/archive/org.apache.synapse/synapse-nhttp-transport/1.3.0-SNAPSHOT/synapse-nhttp-transport-1.3.0-SNAPSHOT-testkit-logs.zip
[INFO] ------------------------------------------------------------------------
[INFO] Building Apache Synapse - PIPE Transport
[INFO]    task-segment: [clean, install]
[INFO] ------------------------------------------------------------------------
[INFO] [clean:clean]
[INFO] Deleting directory <http://hudson.zones.apache.org/hudson/job/Synapse%20-%201.3%20-%20SNAPSHOT/ws/java/modules/transports/core/pipe/target>
[INFO] [resources:resources]
[INFO] Using default encoding to copy filtered resources.
[INFO] [compiler:compile]
Compiling 9 source files to <http://hudson.zones.apache.org/hudson/job/Synapse%20-%201.3%20-%20SNAPSHOT/ws/java/modules/transports/core/pipe/target/classes>
[HUDSON] Archiving <http://hudson.zones.apache.org/hudson/job/Synapse%20-%201.3%20-%20SNAPSHOT/ws/java/modules/transports/core/pipe/pom.xml>
to /export/home/hudson/hudson/jobs/Synapse - 1.3 - SNAPSHOT/modules/org.apache.synapse$synapse-pipe-transport/builds/2009-12-12_12-30-32/archive/org.apache.synapse/synapse-pipe-transport/1.3.0-SNAPSHOT/pom.xml
[INFO] ------------------------------------------------------------------------
[ERROR] BUILD FAILURE
[INFO] ------------------------------------------------------------------------
[INFO] Compilation failure

<http://hudson.zones.apache.org/hudson/job/Synapse%20-%201.3%20-%20SNAPSHOT/ws/java/modules/transports/core/pipe/src/main/java/org/apache/synapse/transport/pipe/PipeEndpointListener.java>:[107,28]
receive(java.net.SocketAddress,org.apache.axis2.transport.base.datagram.DatagramEndpoint,byte[],int)
in org.apache.axis2.transport.base.datagram.DatagramDispatcherCallback cannot be applied to
(org.apache.synapse.transport.pipe.PipeEndpoint,byte[],int)


[INFO] ------------------------------------------------------------------------
[INFO] For more information, run Maven with the -e switch
[INFO] ------------------------------------------------------------------------
[INFO] Total time: 7 minutes 54 seconds
[INFO] Finished at: Sat Dec 12 12:38:43 UTC 2009
[INFO] Final Memory: 39M/165M
[INFO] ------------------------------------------------------------------------
Waiting for Hudson to finish collecting data
Sending e-mails to: dev@synapse.apache.org
Sending e-mails to: dev@synapse.apache.org
channel stopped


---------------------------------------------------------------------
To unsubscribe, e-mail: dev-unsubscribe@synapse.apache.org
For additional commands, e-mail: dev-help@synapse.apache.org


Mime
View raw message