synapse-dev mailing list archives

Site index · List index
Message view « Date » · « Thread »
Top « Date » · « Thread »
From Apache Hudson Server <hud...@hudson.zones.apache.org>
Subject Build failed in Hudson: Synapse - Trunk » Apache Synapse - Transports #627
Date Sun, 26 Apr 2009 06:04:43 GMT
See http://hudson.zones.apache.org/hudson/job/Synapse%20-%20Trunk/org.apache.synapse$synapse-transports/627/

------------------------------------------
[INFO] ------------------------------------------------------------------------
[INFO] Building Apache Synapse - Transports
[INFO]    task-segment: [clean, install]
[INFO] ------------------------------------------------------------------------
[INFO] [clean:clean]
[INFO] Deleting directory http://hudson.zones.apache.org/hudson/job/Synapse%20-%20Trunk/org.apache.synapse$synapse-transports/ws/target

[INFO] [resources:resources]
[INFO] Using default encoding to copy filtered resources.
[INFO] snapshot org.apache.axis2:axis2-transport-http:1.5-SNAPSHOT: checking for updates from
apache-snapshots
[INFO] snapshot org.apache.axis2:axis2-transport-http:1.5-SNAPSHOT: checking for updates from
wso2-m2
[INFO] snapshot org.apache.axis2:axis2-transport-testkit:1.0-SNAPSHOT: checking for updates
from apache-snapshots
[INFO] snapshot org.apache.axis2:axis2-transport-testkit:1.0-SNAPSHOT: checking for updates
from wso2-m2
8K downloaded
[INFO] snapshot org.apache.synapse:synapse-utils:SNAPSHOT: checking for updates from apache-snapshots
[INFO] snapshot org.apache.synapse:synapse-utils:SNAPSHOT: checking for updates from wso2-m2
[INFO] [compiler:compile]
Compiling 65 source files to http://hudson.zones.apache.org/hudson/job/Synapse%20-%20Trunk/org.apache.synapse$synapse-transports/ws/target/classes

[INFO] [dependency:copy {execution: copy}]
[INFO] Configured Artifact: org.aspectj:aspectjweaver:1.6.1:jar
[INFO] Copying aspectjweaver-1.6.1.jar to http://hudson.zones.apache.org/hudson/job/Synapse%20-%20Trunk/org.apache.synapse$synapse-transports/ws/target/lib/aspectjweaver-1.6.1.jar

[INFO] [resources:testResources]
[INFO] Using default encoding to copy filtered resources.
186K downloaded
[INFO] [compiler:testCompile]
Compiling 13 source files to http://hudson.zones.apache.org/hudson/job/Synapse%20-%20Trunk/org.apache.synapse$synapse-transports/ws/target/test-classes

[INFO] [surefire:test]
[INFO] Surefire report directory: http://hudson.zones.apache.org/hudson/job/Synapse%20-%20Trunk/org.apache.synapse$synapse-transports/ws/target/surefire-reports

org.apache.maven.surefire.booter.SurefireExecutionException: org.apache.synapse.transport.vfs.VFSTransportTest;
nested exception is java.lang.NoClassDefFoundError: org/apache/log4j/LogManager; nested exception
is org.apache.maven.surefire.testset.TestSetFailedException: org.apache.synapse.transport.vfs.VFSTransportTest;
nested exception is java.lang.NoClassDefFoundError: org/apache/log4j/LogManager
org.apache.maven.surefire.testset.TestSetFailedException: org.apache.synapse.transport.vfs.VFSTransportTest;
nested exception is java.lang.NoClassDefFoundError: org/apache/log4j/LogManager
java.lang.NoClassDefFoundError: org/apache/log4j/LogManager
	at org.slf4j.impl.Log4jLoggerFactory.getLogger(Log4jLoggerFactory.java:73)
	at org.slf4j.LoggerFactory.getLogger(LoggerFactory.java:209)
	at org.slf4j.LoggerFactory.getLogger(LoggerFactory.java:221)
	at org.apache.directory.shared.ldap.entry.AbstractValue.<clinit>(AbstractValue.java:38)
	at org.apache.directory.shared.ldap.filter.FilterParser.parsePresenceEqOrSubstring(FilterParser.java:385)
	at org.apache.directory.shared.ldap.filter.FilterParser.parseItem(FilterParser.java:440)
	at org.apache.directory.shared.ldap.filter.FilterParser.parseFilterComp(FilterParser.java:599)
	at org.apache.directory.shared.ldap.filter.FilterParser.parseFilterInternal(FilterParser.java:637)
	at org.apache.directory.shared.ldap.filter.FilterParser.parseBranchNode(FilterParser.java:521)
	at org.apache.directory.shared.ldap.filter.FilterParser.parseFilterComp(FilterParser.java:580)
	at org.apache.directory.shared.ldap.filter.FilterParser.parseFilterInternal(FilterParser.java:637)
	at org.apache.directory.shared.ldap.filter.FilterParser.parse(FilterParser.java:675)
	at org.apache.axis2.transport.testkit.filter.FilterExpressionParser.parse(FilterExpressionParser.java:73)
	at org.apache.axis2.transport.testkit.ManagedTestSuite.addExclude(ManagedTestSuite.java:61)
	at org.apache.synapse.transport.vfs.VFSTransportTest.suite(VFSTransportTest.java:46)
	at sun.reflect.NativeMethodAccessorImpl.invoke0(Native Method)
	at sun.reflect.NativeMethodAccessorImpl.invoke(NativeMethodAccessorImpl.java:39)
	at sun.reflect.DelegatingMethodAccessorImpl.invoke(DelegatingMethodAccessorImpl.java:25)
	at java.lang.reflect.Method.invoke(Method.java:585)
	at org.apache.maven.surefire.junit.JUnitTestSet.createInstanceFromSuiteMethod(JUnitTestSet.java:180)
	at org.apache.maven.surefire.junit.JUnitTestSet.constructTestObject(JUnitTestSet.java:140)
	at org.apache.maven.surefire.junit.JUnitTestSet.getTestCount(JUnitTestSet.java:247)
	at org.apache.maven.surefire.suite.AbstractDirectoryTestSuite.locateTestSets(AbstractDirectoryTestSuite.java:104)
	at org.apache.maven.surefire.Surefire.createSuiteFromDefinition(Surefire.java:150)
	at org.apache.maven.surefire.Surefire.run(Surefire.java:111)
	at sun.reflect.NativeMethodAccessorImpl.invoke0(Native Method)
	at sun.reflect.NativeMethodAccessorImpl.invoke(NativeMethodAccessorImpl.java:39)
	at sun.reflect.DelegatingMethodAccessorImpl.invoke(DelegatingMethodAccessorImpl.java:25)
	at java.lang.reflect.Method.invoke(Method.java:585)
	at org.apache.maven.surefire.booter.SurefireBooter.runSuitesInProcess(SurefireBooter.java:290)
	at org.apache.maven.surefire.booter.SurefireBooter.main(SurefireBooter.java:818)
[ERROR] There are test failures.
[HUDSON] Recording test results
[INFO] [bundle:bundle]
[WARNING] Warning building bundle org.apache.synapse:synapse-transports:bundle:SNAPSHOT :
Importing packages that are never refered to by any class on the Bundle-Classpath[Jar:dot]:
[javax.jms, javax.mail]
[INFO] [assembly:attached {execution: attach-testkit-logs}]
[INFO] Reading assembly descriptor: src/main/assembly/testkit-logs.xml
[HUDSON] Archiving http://hudson.zones.apache.org/hudson/job/Synapse%20-%20Trunk/org.apache.synapse$synapse-transports/ws/pom.xml
 to /export/home/hudson/hudson/jobs/Synapse - Trunk/modules/org.apache.synapse$synapse-transports/builds/2009-04-26_06-01-50/archive/org.apache.synapse/synapse-transports/SNAPSHOT/pom.xml
[HUDSON] Archiving http://hudson.zones.apache.org/hudson/job/Synapse%20-%20Trunk/org.apache.synapse$synapse-transports/ws/target/synapse-transports-SNAPSHOT.jar
 to /export/home/hudson/hudson/jobs/Synapse - Trunk/modules/org.apache.synapse$synapse-transports/builds/2009-04-26_06-01-50/archive/org.apache.synapse/synapse-transports/SNAPSHOT/synapse-transports-SNAPSHOT.jar
[INFO] ------------------------------------------------------------------------
[ERROR] BUILD ERROR
[INFO] ------------------------------------------------------------------------
[INFO] Failed to create assembly: Error creating assembly archive testkit-logs: You must set
at least one file.

[INFO] ------------------------------------------------------------------------
[INFO] For more information, run Maven with the -e switch
[INFO] ------------------------------------------------------------------------
[INFO] Total time: 2 minutes 33 seconds
[INFO] Finished at: Sun Apr 26 06:04:33 UTC 2009
[INFO] Final Memory: 39M/177M
[INFO] ------------------------------------------------------------------------
Waiting for Hudson to finish collecting data


---------------------------------------------------------------------
To unsubscribe, e-mail: dev-unsubscribe@synapse.apache.org
For additional commands, e-mail: dev-help@synapse.apache.org


Mime
View raw message