subversion-users mailing list archives

Site index · List index
Message view « Date » · « Thread »
Top « Date » · « Thread »
From Steve Kelem <st...@kelem.net>
Subject problem building 1.8.1
Date Sun, 28 Jul 2013 06:58:16 GMT
<html>
  <head>

    <meta http-equiv="content-type" content="text/html; charset=ISO-8859-1">
  </head>
  <body bgcolor="#FFFFFF" text="#000099">
    I'm trying to build subversion 1.8.1 on Ubuntu 13.04, x86-64.<br>
    It seems to build okay, but when I run the self-tests, I get a bunch
    of failures, for example:<br>
    <br>
    % python build/run_tests.py --config-file
    ./subversion/tests/tests.conf /usr/local/src/subversion-1.8.1
    '/usr/local/src/subversion-1.8.1'
    subversion/tests/libsvn_client/client-test<br>
    [1/1]
client-test........................................................FAILURE<br>
    At least one test FAILED, checking
    /local/usr/local/src/subversion-1.8.1/tests.log<br>
    FAIL:&nbsp; lt-client-test 3: test svn_client_patch<br>
    FAIL:&nbsp; lt-client-test 4: test svn_wc_add3 scenarios<br>
    FAIL:&nbsp; lt-client-test 7: test foreign repository copy<br>
    Summary of test results:<br>
    &nbsp; 4 tests PASSED<br>
    &nbsp; 3 tests FAILED<br>
    SUMMARY: Some tests failed.<br>
    <br>
    the complete list of passing and failing tests is attached.<br>
    <br>
    I'd appreciate any help in resolving this.<br>
    <br>
    Thanks,<br>
    Steve<br>
    .<br>
    .<br>
    .<br>
    <br>
    % cat tests.log <br>
    START: client-test<br>
    PASS:&nbsp; lt-client-test 1: test svn_client__elide_mergeinfo_catalog<br>
    PASS:&nbsp; lt-client-test 2: test svn_client_args_to_target_array<br>
    svn_tests: E200030: sqlite[S26]: file is encrypted or is not a
    database, executing statement 'PRAGMA synchronous=OFF;PRAGMA
    recursive_triggers=ON;'<br>
    FAIL:&nbsp; lt-client-test 3: test svn_client_patch<br>
    svn_tests: E200030: sqlite[S26]: file is encrypted or is not a
    database, executing statement 'PRAGMA synchronous=OFF;PRAGMA
    recursive_triggers=ON;'<br>
    FAIL:&nbsp; lt-client-test 4: test svn_wc_add3 scenarios<br>
    PASS:&nbsp; lt-client-test 5: test a crash in svn_client_copy5<br>
    PASS:&nbsp; lt-client-test 6: test youngest_common_ancestor<br>
    svn_tests: E200030: sqlite[S26]: file is encrypted or is not a
    database, executing statement 'PRAGMA synchronous=OFF;PRAGMA
    recursive_triggers=ON;'<br>
    FAIL:&nbsp; lt-client-test 7: test foreign repository copy<br>
    END: client-test<br>
    ELAPSED: client-test 0:00:07.592688<br>
    <br>
    <br>
    I configured with:<br>
    % setenv CC "gcc -m64 -std=gnu99"<br>
    % ./configure \<br>
    --prefix=/usr/local \<br>
    --with-openssl \<br>
    --with-junit=/opt/java/junit/junit4.11/junit-4.11.jar \<br>
    --with-apr=/usr/local/src/apr-1.4.8 \<br>
    --with-apr-util=/usr/local/src/apr-util-1.5.2 \<br>
    --with-apxs=/usr/local/apache2/bin/apxs \<br>
    --with-berkeley-db \<br>
    --enable-bdb6 \<br>
    --enable-sqlite-compatibility-version=3.7.15 <br>
    <br>
    <br>
    Versions of other tools:<br>
    Python 2.7.4<br>
    ruby 1.9.3p194 (2012-04-20 revision 35410) [x86_64-linux]<br>
  </body>
</html>

Mime
View raw message