struts-dev mailing list archives

Site index · List index
Message view « Date » · « Thread »
Top « Date » · « Thread »
From Apache Jenkins Server <jenk...@builds.apache.org>
Subject Build failed in Jenkins: Struts-examples-JDK8-master #80
Date Mon, 16 Dec 2019 19:42:30 GMT
See <https://builds.apache.org/job/Struts-examples-JDK8-master/80/display/redirect?page=changes>

Changes:

[lukaszlenart] Drops mailreader example as deprecated and based on Struts 1


------------------------------------------
Started by an SCM change
Running as SYSTEM
[EnvInject] - Loading node environment variables.
Building remotely on H27 (ubuntu) in workspace <https://builds.apache.org/job/Struts-examples-JDK8-master/ws/>
No credentials specified
Cloning the remote Git repository
Cloning repository https://gitbox.apache.org/repos/asf/struts-examples.git
 > git init <https://builds.apache.org/job/Struts-examples-JDK8-master/ws/> # timeout=10
Fetching upstream changes from https://gitbox.apache.org/repos/asf/struts-examples.git
 > git --version # timeout=10
 > git fetch --tags --progress -- https://gitbox.apache.org/repos/asf/struts-examples.git
+refs/heads/*:refs/remotes/origin/*
 > git config remote.origin.url https://gitbox.apache.org/repos/asf/struts-examples.git
# timeout=10
 > git config --add remote.origin.fetch +refs/heads/*:refs/remotes/origin/* # timeout=10
 > git config remote.origin.url https://gitbox.apache.org/repos/asf/struts-examples.git
# timeout=10
Cleaning workspace
 > git rev-parse --verify HEAD # timeout=10
No valid HEAD. Skipping the resetting
 > git clean -fdx # timeout=10
Fetching upstream changes from https://gitbox.apache.org/repos/asf/struts-examples.git
 > git fetch --tags --progress -- https://gitbox.apache.org/repos/asf/struts-examples.git
+refs/heads/*:refs/remotes/origin/*
 > git rev-parse refs/remotes/origin/master^{commit} # timeout=10
 > git rev-parse refs/remotes/origin/origin/master^{commit} # timeout=10
Checking out Revision 0f4d596b154908459460ed78d8e8ffa947645601 (refs/remotes/origin/master)
 > git config core.sparsecheckout # timeout=10
 > git checkout -f 0f4d596b154908459460ed78d8e8ffa947645601
Commit message: "Drops mailreader example as deprecated and based on Struts 1"
 > git rev-list --no-walk f9b21b9f0858bdec9754477313cd7664f63433fc # timeout=10
[locks-and-latches] Checking to see if we really have the locks
[locks-and-latches] Have all the locks, build can start
Parsing POMs
Failed to transfer Could not find artifact org.apache.struts:struts-examples:pom:1.0.0 in
central (https://repo.maven.apache.org/maven2)
[locks-and-latches] Releasing all the locks
[locks-and-latches] All the locks released
ERROR: Failed to parse POMs
hudson.remoting.ProxyException: hudson.maven.MavenModuleSetBuild$MavenExecutionException:
org.apache.maven.project.ProjectBuildingException: Some problems were encountered while processing
the POMs:
[FATAL] Non-resolvable parent POM for org.apache.struts:action-chaining:1.0-SNAPSHOT: Could
not find artifact org.apache.struts:struts-examples:pom:1.0.0 in central (https://repo.maven.apache.org/maven2)
and 'parent.relativePath' points at wrong local POM @ line 5, column 13
[FATAL] Non-resolvable parent POM for org.apache.struts:annotations:[unknown-version]: Failure
to find org.apache.struts:struts-examples:pom:1.0.0 in https://repo.maven.apache.org/maven2
was cached in the local repository, resolution will not be reattempted until the update interval
of central has elapsed or updates are forced and 'parent.relativePath' points at wrong local
POM @ line 6, column 13
[FATAL] Non-resolvable parent POM for org.apache.struts:basic-struts:[unknown-version]: Failure
to find org.apache.struts:struts-examples:pom:1.0.0 in https://repo.maven.apache.org/maven2
was cached in the local repository, resolution will not be reattempted until the update interval
of central has elapsed or updates are forced and 'parent.relativePath' points at wrong local
POM @ line 6, column 13
[FATAL] Non-resolvable parent POM for org.apache.struts:bean-validation:[unknown-version]:
Failure to find org.apache.struts:struts-examples:pom:1.0.0 in https://repo.maven.apache.org/maven2
was cached in the local repository, resolution will not be reattempted until the update interval
of central has elapsed or updates are forced and 'parent.relativePath' points at wrong local
POM @ line 4, column 13
[FATAL] Non-resolvable parent POM for org.apache.struts:blank:[unknown-version]: Failure to
find org.apache.struts:struts-examples:pom:1.0.0 in https://repo.maven.apache.org/maven2 was
cached in the local repository, resolution will not be reattempted until the update interval
of central has elapsed or updates are forced and 'parent.relativePath' points at wrong local
POM @ line 24, column 13
[FATAL] Non-resolvable parent POM for org.apache.struts:coding-actions:[unknown-version]:
Failure to find org.apache.struts:struts-examples:pom:1.0.0 in https://repo.maven.apache.org/maven2
was cached in the local repository, resolution will not be reattempted until the update interval
of central has elapsed or updates are forced and 'parent.relativePath' points at wrong local
POM @ line 6, column 13
[FATAL] Non-resolvable parent POM for org.apache.struts:control-tags:[unknown-version]: Failure
to find org.apache.struts:struts-examples:pom:1.0.0 in https://repo.maven.apache.org/maven2
was cached in the local repository, resolution will not be reattempted until the update interval
of central has elapsed or updates are forced and 'parent.relativePath' points at wrong local
POM @ line 6, column 13
[FATAL] Non-resolvable parent POM for org.apache.struts:crud:1.0-SNAPSHOT: Failure to find
org.apache.struts:struts-examples:pom:1.0.0 in https://repo.maven.apache.org/maven2 was cached
in the local repository, resolution will not be reattempted until the update interval of central
has elapsed or updates are forced and 'parent.relativePath' points at wrong local POM @ line
7, column 13
[FATAL] Non-resolvable parent POM for org.apache.struts:debugging-struts:[unknown-version]:
Failure to find org.apache.struts:struts-examples:pom:1.0.0 in https://repo.maven.apache.org/maven2
was cached in the local repository, resolution will not be reattempted until the update interval
of central has elapsed or updates are forced and 'parent.relativePath' points at wrong local
POM @ line 5, column 11
[FATAL] Non-resolvable parent POM for org.apache.struts:exception-handling:[unknown-version]:
Failure to find org.apache.struts:struts-examples:pom:1.0.0 in https://repo.maven.apache.org/maven2
was cached in the local repository, resolution will not be reattempted until the update interval
of central has elapsed or updates are forced and 'parent.relativePath' points at wrong local
POM @ line 6, column 13
[FATAL] Non-resolvable parent POM for org.apache.struts:exclude-parameters:[unknown-version]:
Failure to find org.apache.struts:struts-examples:pom:1.0.0 in https://repo.maven.apache.org/maven2
was cached in the local repository, resolution will not be reattempted until the update interval
of central has elapsed or updates are forced and 'parent.relativePath' points at wrong local
POM @ line 6, column 13
[FATAL] Non-resolvable parent POM for org.apache.struts:file-upload:[unknown-version]: Failure
to find org.apache.struts:struts-examples:pom:1.0.0 in https://repo.maven.apache.org/maven2
was cached in the local repository, resolution will not be reattempted until the update interval
of central has elapsed or updates are forced and 'parent.relativePath' points at wrong local
POM @ line 6, column 13
[FATAL] Non-resolvable parent POM for org.apache.struts:form-processing:[unknown-version]:
Failure to find org.apache.struts:struts-examples:pom:1.0.0 in https://repo.maven.apache.org/maven2
was cached in the local repository, resolution will not be reattempted until the update interval
of central has elapsed or updates are forced and 'parent.relativePath' points at wrong local
POM @ line 6, column 13
[FATAL] Non-resolvable parent POM for org.apache.struts:form-tags:[unknown-version]: Failure
to find org.apache.struts:struts-examples:pom:1.0.0 in https://repo.maven.apache.org/maven2
was cached in the local repository, resolution will not be reattempted until the update interval
of central has elapsed or updates are forced and 'parent.relativePath' points at wrong local
POM @ line 6, column 13
[FATAL] Non-resolvable parent POM for org.apache.struts:form-validation:[unknown-version]:
Failure to find org.apache.struts:struts-examples:pom:1.0.0 in https://repo.maven.apache.org/maven2
was cached in the local repository, resolution will not be reattempted until the update interval
of central has elapsed or updates are forced and 'parent.relativePath' points at wrong local
POM @ line 6, column 13
[FATAL] Non-resolvable parent POM for org.apache.struts:form-xml-validation:[unknown-version]:
Failure to find org.apache.struts:struts-examples:pom:1.0.0 in https://repo.maven.apache.org/maven2
was cached in the local repository, resolution will not be reattempted until the update interval
of central has elapsed or updates are forced and 'parent.relativePath' points at wrong local
POM @ line 6, column 13
[FATAL] Non-resolvable parent POM for org.apache.struts:helloworld:[unknown-version]: Failure
to find org.apache.struts:struts-examples:pom:1.0.0 in https://repo.maven.apache.org/maven2
was cached in the local repository, resolution will not be reattempted until the update interval
of central has elapsed or updates are forced and 'parent.relativePath' points at wrong local
POM @ line 6, column 13
[FATAL] Non-resolvable parent POM for org.apache.struts:http-session:[unknown-version]: Failure
to find org.apache.struts:struts-examples:pom:1.0.0 in https://repo.maven.apache.org/maven2
was cached in the local repository, resolution will not be reattempted until the update interval
of central has elapsed or updates are forced and 'parent.relativePath' points at wrong local
POM @ line 6, column 13
[FATAL] Non-resolvable parent POM for org.apache.struts:interceptors:[unknown-version]: Failure
to find org.apache.struts:struts-examples:pom:1.0.0 in https://repo.maven.apache.org/maven2
was cached in the local repository, resolution will not be reattempted until the update interval
of central has elapsed or updates are forced and 'parent.relativePath' points at wrong local
POM @ line 6, column 13
[FATAL] Non-resolvable parent POM for org.demo:json:1.0-SNAPSHOT: Failure to find org.apache.struts:struts-examples:pom:1.0.0
in https://repo.maven.apache.org/maven2 was cached in the local repository, resolution will
not be reattempted until the update interval of central has elapsed or updates are forced
and 'parent.relativePath' points at wrong local POM @ line 5, column 11
[FATAL] Non-resolvable parent POM for org.demo:json-customize:1.0-SNAPSHOT: Failure to find
org.apache.struts:struts-examples:pom:1.0.0 in https://repo.maven.apache.org/maven2 was cached
in the local repository, resolution will not be reattempted until the update interval of central
has elapsed or updates are forced and 'parent.relativePath' points at wrong local POM @ line
5, column 11
[FATAL] Non-resolvable parent POM for org.apache.struts:message-resource:[unknown-version]:
Failure to find org.apache.struts:struts-examples:pom:1.0.0 in https://repo.maven.apache.org/maven2
was cached in the local repository, resolution will not be reattempted until the update interval
of central has elapsed or updates are forced and 'parent.relativePath' points at wrong local
POM @ line 6, column 13
[FATAL] Non-resolvable parent POM for org.apache.struts:message-store:1.0-SNAPSHOT: Failure
to find org.apache.struts:struts-examples:pom:1.0.0 in https://repo.maven.apache.org/maven2
was cached in the local repository, resolution will not be reattempted until the update interval
of central has elapsed or updates are forced and 'parent.relativePath' points at wrong local
POM @ line 5, column 11
[FATAL] Non-resolvable parent POM for org.apache.struts:portlet:[unknown-version]: Failure
to find org.apache.struts:struts-examples:pom:1.0.0 in https://repo.maven.apache.org/maven2
was cached in the local repository, resolution will not be reattempted until the update interval
of central has elapsed or updates are forced and 'parent.relativePath' points at wrong local
POM @ line 24, column 13
[FATAL] Non-resolvable parent POM for org.apache.struts:preparable-interface:[unknown-version]:
Failure to find org.apache.struts:struts-examples:pom:1.0.0 in https://repo.maven.apache.org/maven2
was cached in the local repository, resolution will not be reattempted until the update interval
of central has elapsed or updates are forced and 'parent.relativePath' points at wrong local
POM @ line 6, column 13
[FATAL] Non-resolvable parent POM for org.apache.struts:restful2actionmapper:[unknown-version]:
Failure to find org.apache.struts:struts-examples:pom:1.0.0 in https://repo.maven.apache.org/maven2
was cached in the local repository, resolution will not be reattempted until the update interval
of central has elapsed or updates are forced and 'parent.relativePath' points at wrong local
POM @ line 6, column 13
[FATAL] Non-resolvable parent POM for org.apache.struts:rest-angular:[unknown-version]: Failure
to find org.apache.struts:struts-examples:pom:1.0.0 in https://repo.maven.apache.org/maven2
was cached in the local repository, resolution will not be reattempted until the update interval
of central has elapsed or updates are forced and 'parent.relativePath' points at wrong local
POM @ line 5, column 13
[FATAL] Non-resolvable parent POM for org.apache.struts:shiro-basic:[unknown-version]: Failure
to find org.apache.struts:struts-examples:pom:1.0.0 in https://repo.maven.apache.org/maven2
was cached in the local repository, resolution will not be reattempted until the update interval
of central has elapsed or updates are forced and 'parent.relativePath' points at wrong local
POM @ line 4, column 13
[FATAL] Non-resolvable parent POM for org.apache.struts:spring-struts:[unknown-version]: Failure
to find org.apache.struts:struts-examples:pom:1.0.0 in https://repo.maven.apache.org/maven2
was cached in the local repository, resolution will not be reattempted until the update interval
of central has elapsed or updates are forced and 'parent.relativePath' points at wrong local
POM @ line 6, column 13
[FATAL] Non-resolvable parent POM for org.apache.struts:text-provider:[unknown-version]: Failure
to find org.apache.struts:struts-examples:pom:1.0.0 in https://repo.maven.apache.org/maven2
was cached in the local repository, resolution will not be reattempted until the update interval
of central has elapsed or updates are forced and 'parent.relativePath' points at wrong local
POM @ line 5, column 11
[FATAL] Non-resolvable parent POM for org.apache.struts:tiles:[unknown-version]: Failure to
find org.apache.struts:struts-examples:pom:1.0.0 in https://repo.maven.apache.org/maven2 was
cached in the local repository, resolution will not be reattempted until the update interval
of central has elapsed or updates are forced and 'parent.relativePath' points at wrong local
POM @ line 5, column 13
[FATAL] Non-resolvable parent POM for org.apache.struts:themes:[unknown-version]: Failure
to find org.apache.struts:struts-examples:pom:1.0.0 in https://repo.maven.apache.org/maven2
was cached in the local repository, resolution will not be reattempted until the update interval
of central has elapsed or updates are forced and 'parent.relativePath' points at wrong local
POM @ line 6, column 13
[FATAL] Non-resolvable parent POM for org.apache.struts:themes-override:[unknown-version]:
Failure to find org.apache.struts:struts-examples:pom:1.0.0 in https://repo.maven.apache.org/maven2
was cached in the local repository, resolution will not be reattempted until the update interval
of central has elapsed or updates are forced and 'parent.relativePath' points at wrong local
POM @ line 6, column 13
[FATAL] Non-resolvable parent POM for org.apache.struts:type-conversion:[unknown-version]:
Failure to find org.apache.struts:struts-examples:pom:1.0.0 in https://repo.maven.apache.org/maven2
was cached in the local repository, resolution will not be reattempted until the update interval
of central has elapsed or updates are forced and 'parent.relativePath' points at wrong local
POM @ line 6, column 11
[FATAL] Non-resolvable parent POM for org.apache.struts:unit-testing:[unknown-version]: Failure
to find org.apache.struts:struts-examples:pom:1.0.0 in https://repo.maven.apache.org/maven2
was cached in the local repository, resolution will not be reattempted until the update interval
of central has elapsed or updates are forced and 'parent.relativePath' points at wrong local
POM @ line 6, column 10
[FATAL] Non-resolvable parent POM for org.apache.struts:using-tags:[unknown-version]: Failure
to find org.apache.struts:struts-examples:pom:1.0.0 in https://repo.maven.apache.org/maven2
was cached in the local repository, resolution will not be reattempted until the update interval
of central has elapsed or updates are forced and 'parent.relativePath' points at wrong local
POM @ line 6, column 13
[FATAL] Non-resolvable parent POM for org.apache.struts:validation-messages:[unknown-version]:
Failure to find org.apache.struts:struts-examples:pom:1.0.0 in https://repo.maven.apache.org/maven2
was cached in the local repository, resolution will not be reattempted until the update interval
of central has elapsed or updates are forced and 'parent.relativePath' points at wrong local
POM @ line 5, column 13
[FATAL] Non-resolvable parent POM for org.apache.struts:wildcard-method-selection:[unknown-version]:
Failure to find org.apache.struts:struts-examples:pom:1.0.0 in https://repo.maven.apache.org/maven2
was cached in the local repository, resolution will not be reattempted until the update interval
of central has elapsed or updates are forced and 'parent.relativePath' points at wrong local
POM @ line 6, column 13
[FATAL] Non-resolvable parent POM for org.apache.struts:wildcard-regex:1: Failure to find
org.apache.struts:struts-examples:pom:1.0.0 in https://repo.maven.apache.org/maven2 was cached
in the local repository, resolution will not be reattempted until the update interval of central
has elapsed or updates are forced and 'parent.relativePath' points at wrong local POM @ line
5, column 11
[FATAL] Non-resolvable parent POM for org.apache.org:unknown-handler:[unknown-version]: Failure
to find org.apache.struts:struts-examples:pom:1.0.0 in https://repo.maven.apache.org/maven2
was cached in the local repository, resolution will not be reattempted until the update interval
of central has elapsed or updates are forced and 'parent.relativePath' points at wrong local
POM @ line 6, column 11

	at hudson.maven.MavenModuleSetBuild$PomParser.invoke(MavenModuleSetBuild.java:1390)
	at hudson.maven.MavenModuleSetBuild$PomParser.invoke(MavenModuleSetBuild.java:1126)
	at hudson.FilePath$FileCallableWrapper.call(FilePath.java:3052)
	at hudson.remoting.UserRequest.perform(UserRequest.java:212)
	at hudson.remoting.UserRequest.perform(UserRequest.java:54)
	at hudson.remoting.Request$2.run(Request.java:369)
	at hudson.remoting.InterceptingExecutorService$1.call(InterceptingExecutorService.java:72)
	at java.util.concurrent.FutureTask.run(FutureTask.java:266)
	at java.util.concurrent.ThreadPoolExecutor.runWorker(ThreadPoolExecutor.java:1149)
	at java.util.concurrent.ThreadPoolExecutor$Worker.run(ThreadPoolExecutor.java:624)
	at java.lang.Thread.run(Thread.java:748)
	Suppressed: hudson.remoting.Channel$CallSiteStackTrace: Remote call to H27
		at hudson.remoting.Channel.attachCallSiteStackTrace(Channel.java:1743)
		at hudson.remoting.UserRequest$ExceptionResponse.retrieve(UserRequest.java:357)
		at hudson.remoting.Channel.call(Channel.java:957)
		at hudson.FilePath.act(FilePath.java:1072)
		at hudson.FilePath.act(FilePath.java:1061)
		at hudson.maven.MavenModuleSetBuild$MavenModuleSetBuildExecution.parsePoms(MavenModuleSetBuild.java:987)
		at hudson.maven.MavenModuleSetBuild$MavenModuleSetBuildExecution.doRun(MavenModuleSetBuild.java:691)
		at hudson.model.AbstractBuild$AbstractBuildExecution.run(AbstractBuild.java:504)
		at hudson.model.Run.execute(Run.java:1815)
		at hudson.maven.MavenModuleSetBuild.run(MavenModuleSetBuild.java:543)
		at hudson.model.ResourceController.execute(ResourceController.java:97)
		at hudson.model.Executor.run(Executor.java:429)
Caused by: hudson.remoting.ProxyException: org.apache.maven.project.ProjectBuildingException:
Some problems were encountered while processing the POMs:
[FATAL] Non-resolvable parent POM for org.apache.struts:action-chaining:1.0-SNAPSHOT: Could
not find artifact org.apache.struts:struts-examples:pom:1.0.0 in central (https://repo.maven.apache.org/maven2)
and 'parent.relativePath' points at wrong local POM @ line 5, column 13
[FATAL] Non-resolvable parent POM for org.apache.struts:annotations:[unknown-version]: Failure
to find org.apache.struts:struts-examples:pom:1.0.0 in https://repo.maven.apache.org/maven2
was cached in the local repository, resolution will not be reattempted until the update interval
of central has elapsed or updates are forced and 'parent.relativePath' points at wrong local
POM @ line 6, column 13
[FATAL] Non-resolvable parent POM for org.apache.struts:basic-struts:[unknown-version]: Failure
to find org.apache.struts:struts-examples:pom:1.0.0 in https://repo.maven.apache.org/maven2
was cached in the local repository, resolution will not be reattempted until the update interval
of central has elapsed or updates are forced and 'parent.relativePath' points at wrong local
POM @ line 6, column 13
[FATAL] Non-resolvable parent POM for org.apache.struts:bean-validation:[unknown-version]:
Failure to find org.apache.struts:struts-examples:pom:1.0.0 in https://repo.maven.apache.org/maven2
was cached in the local repository, resolution will not be reattempted until the update interval
of central has elapsed or updates are forced and 'parent.relativePath' points at wrong local
POM @ line 4, column 13
[FATAL] Non-resolvable parent POM for org.apache.struts:blank:[unknown-version]: Failure to
find org.apache.struts:struts-examples:pom:1.0.0 in https://repo.maven.apache.org/maven2 was
cached in the local repository, resolution will not be reattempted until the update interval
of central has elapsed or updates are forced and 'parent.relativePath' points at wrong local
POM @ line 24, column 13
[FATAL] Non-resolvable parent POM for org.apache.struts:coding-actions:[unknown-version]:
Failure to find org.apache.struts:struts-examples:pom:1.0.0 in https://repo.maven.apache.org/maven2
was cached in the local repository, resolution will not be reattempted until the update interval
of central has elapsed or updates are forced and 'parent.relativePath' points at wrong local
POM @ line 6, column 13
[FATAL] Non-resolvable parent POM for org.apache.struts:control-tags:[unknown-version]: Failure
to find org.apache.struts:struts-examples:pom:1.0.0 in https://repo.maven.apache.org/maven2
was cached in the local repository, resolution will not be reattempted until the update interval
of central has elapsed or updates are forced and 'parent.relativePath' points at wrong local
POM @ line 6, column 13
[FATAL] Non-resolvable parent POM for org.apache.struts:crud:1.0-SNAPSHOT: Failure to find
org.apache.struts:struts-examples:pom:1.0.0 in https://repo.maven.apache.org/maven2 was cached
in the local repository, resolution will not be reattempted until the update interval of central
has elapsed or updates are forced and 'parent.relativePath' points at wrong local POM @ line
7, column 13
[FATAL] Non-resolvable parent POM for org.apache.struts:debugging-struts:[unknown-version]:
Failure to find org.apache.struts:struts-examples:pom:1.0.0 in https://repo.maven.apache.org/maven2
was cached in the local repository, resolution will not be reattempted until the update interval
of central has elapsed or updates are forced and 'parent.relativePath' points at wrong local
POM @ line 5, column 11
[FATAL] Non-resolvable parent POM for org.apache.struts:exception-handling:[unknown-version]:
Failure to find org.apache.struts:struts-examples:pom:1.0.0 in https://repo.maven.apache.org/maven2
was cached in the local repository, resolution will not be reattempted until the update interval
of central has elapsed or updates are forced and 'parent.relativePath' points at wrong local
POM @ line 6, column 13
[FATAL] Non-resolvable parent POM for org.apache.struts:exclude-parameters:[unknown-version]:
Failure to find org.apache.struts:struts-examples:pom:1.0.0 in https://repo.maven.apache.org/maven2
was cached in the local repository, resolution will not be reattempted until the update interval
of central has elapsed or updates are forced and 'parent.relativePath' points at wrong local
POM @ line 6, column 13
[FATAL] Non-resolvable parent POM for org.apache.struts:file-upload:[unknown-version]: Failure
to find org.apache.struts:struts-examples:pom:1.0.0 in https://repo.maven.apache.org/maven2
was cached in the local repository, resolution will not be reattempted until the update interval
of central has elapsed or updates are forced and 'parent.relativePath' points at wrong local
POM @ line 6, column 13
[FATAL] Non-resolvable parent POM for org.apache.struts:form-processing:[unknown-version]:
Failure to find org.apache.struts:struts-examples:pom:1.0.0 in https://repo.maven.apache.org/maven2
was cached in the local repository, resolution will not be reattempted until the update interval
of central has elapsed or updates are forced and 'parent.relativePath' points at wrong local
POM @ line 6, column 13
[FATAL] Non-resolvable parent POM for org.apache.struts:form-tags:[unknown-version]: Failure
to find org.apache.struts:struts-examples:pom:1.0.0 in https://repo.maven.apache.org/maven2
was cached in the local repository, resolution will not be reattempted until the update interval
of central has elapsed or updates are forced and 'parent.relativePath' points at wrong local
POM @ line 6, column 13
[FATAL] Non-resolvable parent POM for org.apache.struts:form-validation:[unknown-version]:
Failure to find org.apache.struts:struts-examples:pom:1.0.0 in https://repo.maven.apache.org/maven2
was cached in the local repository, resolution will not be reattempted until the update interval
of central has elapsed or updates are forced and 'parent.relativePath' points at wrong local
POM @ line 6, column 13
[FATAL] Non-resolvable parent POM for org.apache.struts:form-xml-validation:[unknown-version]:
Failure to find org.apache.struts:struts-examples:pom:1.0.0 in https://repo.maven.apache.org/maven2
was cached in the local repository, resolution will not be reattempted until the update interval
of central has elapsed or updates are forced and 'parent.relativePath' points at wrong local
POM @ line 6, column 13
[FATAL] Non-resolvable parent POM for org.apache.struts:helloworld:[unknown-version]: Failure
to find org.apache.struts:struts-examples:pom:1.0.0 in https://repo.maven.apache.org/maven2
was cached in the local repository, resolution will not be reattempted until the update interval
of central has elapsed or updates are forced and 'parent.relativePath' points at wrong local
POM @ line 6, column 13
[FATAL] Non-resolvable parent POM for org.apache.struts:http-session:[unknown-version]: Failure
to find org.apache.struts:struts-examples:pom:1.0.0 in https://repo.maven.apache.org/maven2
was cached in the local repository, resolution will not be reattempted until the update interval
of central has elapsed or updates are forced and 'parent.relativePath' points at wrong local
POM @ line 6, column 13
[FATAL] Non-resolvable parent POM for org.apache.struts:interceptors:[unknown-version]: Failure
to find org.apache.struts:struts-examples:pom:1.0.0 in https://repo.maven.apache.org/maven2
was cached in the local repository, resolution will not be reattempted until the update interval
of central has elapsed or updates are forced and 'parent.relativePath' points at wrong local
POM @ line 6, column 13
[FATAL] Non-resolvable parent POM for org.demo:json:1.0-SNAPSHOT: Failure to find org.apache.struts:struts-examples:pom:1.0.0
in https://repo.maven.apache.org/maven2 was cached in the local repository, resolution will
not be reattempted until the update interval of central has elapsed or updates are forced
and 'parent.relativePath' points at wrong local POM @ line 5, column 11
[FATAL] Non-resolvable parent POM for org.demo:json-customize:1.0-SNAPSHOT: Failure to find
org.apache.struts:struts-examples:pom:1.0.0 in https://repo.maven.apache.org/maven2 was cached
in the local repository, resolution will not be reattempted until the update interval of central
has elapsed or updates are forced and 'parent.relativePath' points at wrong local POM @ line
5, column 11
[FATAL] Non-resolvable parent POM for org.apache.struts:message-resource:[unknown-version]:
Failure to find org.apache.struts:struts-examples:pom:1.0.0 in https://repo.maven.apache.org/maven2
was cached in the local repository, resolution will not be reattempted until the update interval
of central has elapsed or updates are forced and 'parent.relativePath' points at wrong local
POM @ line 6, column 13
[FATAL] Non-resolvable parent POM for org.apache.struts:message-store:1.0-SNAPSHOT: Failure
to find org.apache.struts:struts-examples:pom:1.0.0 in https://repo.maven.apache.org/maven2
was cached in the local repository, resolution will not be reattempted until the update interval
of central has elapsed or updates are forced and 'parent.relativePath' points at wrong local
POM @ line 5, column 11
[FATAL] Non-resolvable parent POM for org.apache.struts:portlet:[unknown-version]: Failure
to find org.apache.struts:struts-examples:pom:1.0.0 in https://repo.maven.apache.org/maven2
was cached in the local repository, resolution will not be reattempted until the update interval
of central has elapsed or updates are forced and 'parent.relativePath' points at wrong local
POM @ line 24, column 13
[FATAL] Non-resolvable parent POM for org.apache.struts:preparable-interface:[unknown-version]:
Failure to find org.apache.struts:struts-examples:pom:1.0.0 in https://repo.maven.apache.org/maven2
was cached in the local repository, resolution will not be reattempted until the update interval
of central has elapsed or updates are forced and 'parent.relativePath' points at wrong local
POM @ line 6, column 13
[FATAL] Non-resolvable parent POM for org.apache.struts:restful2actionmapper:[unknown-version]:
Failure to find org.apache.struts:struts-examples:pom:1.0.0 in https://repo.maven.apache.org/maven2
was cached in the local repository, resolution will not be reattempted until the update interval
of central has elapsed or updates are forced and 'parent.relativePath' points at wrong local
POM @ line 6, column 13
[FATAL] Non-resolvable parent POM for org.apache.struts:rest-angular:[unknown-version]: Failure
to find org.apache.struts:struts-examples:pom:1.0.0 in https://repo.maven.apache.org/maven2
was cached in the local repository, resolution will not be reattempted until the update interval
of central has elapsed or updates are forced and 'parent.relativePath' points at wrong local
POM @ line 5, column 13
[FATAL] Non-resolvable parent POM for org.apache.struts:shiro-basic:[unknown-version]: Failure
to find org.apache.struts:struts-examples:pom:1.0.0 in https://repo.maven.apache.org/maven2
was cached in the local repository, resolution will not be reattempted until the update interval
of central has elapsed or updates are forced and 'parent.relativePath' points at wrong local
POM @ line 4, column 13
[FATAL] Non-resolvable parent POM for org.apache.struts:spring-struts:[unknown-version]: Failure
to find org.apache.struts:struts-examples:pom:1.0.0 in https://repo.maven.apache.org/maven2
was cached in the local repository, resolution will not be reattempted until the update interval
of central has elapsed or updates are forced and 'parent.relativePath' points at wrong local
POM @ line 6, column 13
[FATAL] Non-resolvable parent POM for org.apache.struts:text-provider:[unknown-version]: Failure
to find org.apache.struts:struts-examples:pom:1.0.0 in https://repo.maven.apache.org/maven2
was cached in the local repository, resolution will not be reattempted until the update interval
of central has elapsed or updates are forced and 'parent.relativePath' points at wrong local
POM @ line 5, column 11
[FATAL] Non-resolvable parent POM for org.apache.struts:tiles:[unknown-version]: Failure to
find org.apache.struts:struts-examples:pom:1.0.0 in https://repo.maven.apache.org/maven2 was
cached in the local repository, resolution will not be reattempted until the update interval
of central has elapsed or updates are forced and 'parent.relativePath' points at wrong local
POM @ line 5, column 13
[FATAL] Non-resolvable parent POM for org.apache.struts:themes:[unknown-version]: Failure
to find org.apache.struts:struts-examples:pom:1.0.0 in https://repo.maven.apache.org/maven2
was cached in the local repository, resolution will not be reattempted until the update interval
of central has elapsed or updates are forced and 'parent.relativePath' points at wrong local
POM @ line 6, column 13
[FATAL] Non-resolvable parent POM for org.apache.struts:themes-override:[unknown-version]:
Failure to find org.apache.struts:struts-examples:pom:1.0.0 in https://repo.maven.apache.org/maven2
was cached in the local repository, resolution will not be reattempted until the update interval
of central has elapsed or updates are forced and 'parent.relativePath' points at wrong local
POM @ line 6, column 13
[FATAL] Non-resolvable parent POM for org.apache.struts:type-conversion:[unknown-version]:
Failure to find org.apache.struts:struts-examples:pom:1.0.0 in https://repo.maven.apache.org/maven2
was cached in the local repository, resolution will not be reattempted until the update interval
of central has elapsed or updates are forced and 'parent.relativePath' points at wrong local
POM @ line 6, column 11
[FATAL] Non-resolvable parent POM for org.apache.struts:unit-testing:[unknown-version]: Failure
to find org.apache.struts:struts-examples:pom:1.0.0 in https://repo.maven.apache.org/maven2
was cached in the local repository, resolution will not be reattempted until the update interval
of central has elapsed or updates are forced and 'parent.relativePath' points at wrong local
POM @ line 6, column 10
[FATAL] Non-resolvable parent POM for org.apache.struts:using-tags:[unknown-version]: Failure
to find org.apache.struts:struts-examples:pom:1.0.0 in https://repo.maven.apache.org/maven2
was cached in the local repository, resolution will not be reattempted until the update interval
of central has elapsed or updates are forced and 'parent.relativePath' points at wrong local
POM @ line 6, column 13
[FATAL] Non-resolvable parent POM for org.apache.struts:validation-messages:[unknown-version]:
Failure to find org.apache.struts:struts-examples:pom:1.0.0 in https://repo.maven.apache.org/maven2
was cached in the local repository, resolution will not be reattempted until the update interval
of central has elapsed or updates are forced and 'parent.relativePath' points at wrong local
POM @ line 5, column 13
[FATAL] Non-resolvable parent POM for org.apache.struts:wildcard-method-selection:[unknown-version]:
Failure to find org.apache.struts:struts-examples:pom:1.0.0 in https://repo.maven.apache.org/maven2
was cached in the local repository, resolution will not be reattempted until the update interval
of central has elapsed or updates are forced and 'parent.relativePath' points at wrong local
POM @ line 6, column 13
[FATAL] Non-resolvable parent POM for org.apache.struts:wildcard-regex:1: Failure to find
org.apache.struts:struts-examples:pom:1.0.0 in https://repo.maven.apache.org/maven2 was cached
in the local repository, resolution will not be reattempted until the update interval of central
has elapsed or updates are forced and 'parent.relativePath' points at wrong local POM @ line
5, column 11
[FATAL] Non-resolvable parent POM for org.apache.org:unknown-handler:[unknown-version]: Failure
to find org.apache.struts:struts-examples:pom:1.0.0 in https://repo.maven.apache.org/maven2
was cached in the local repository, resolution will not be reattempted until the update interval
of central has elapsed or updates are forced and 'parent.relativePath' points at wrong local
POM @ line 6, column 11

	at org.apache.maven.project.DefaultProjectBuilder.build(DefaultProjectBuilder.java:383)
	at hudson.maven.MavenEmbedder.buildProjects(MavenEmbedder.java:370)
	at hudson.maven.MavenEmbedder.readProjects(MavenEmbedder.java:340)
	at hudson.maven.MavenModuleSetBuild$PomParser.invoke(MavenModuleSetBuild.java:1329)
	... 10 more

---------------------------------------------------------------------
To unsubscribe, e-mail: dev-unsubscribe@struts.apache.org
For additional commands, e-mail: dev-help@struts.apache.org


Mime
View raw message