struts-dev mailing list archives

Site index · List index
Message view « Date » · « Thread »
Top « Date » · « Thread »
From Apache Jenkins Server <jenk...@builds.apache.org>
Subject Build failed in Jenkins: Struts-master-JDK8-dependency-check #175
Date Thu, 30 May 2019 07:58:43 GMT
See <https://builds.apache.org/job/Struts-master-JDK8-dependency-check/175/display/redirect>

------------------------------------------
[...truncated 4.98 KB...]
[INFO] Struts 2 TestNG Plugin                                             [jar]
[INFO] Struts 2 OSGi Bundles                                              [pom]
[INFO] Struts 2 OSGi Admin Bundle                                      [bundle]
[INFO] Struts 2 OSGi Demo Bundle                                       [bundle]
[INFO] Struts 2 Assembly                                                  [pom]
[INFO] 
[INFO] -------------------< org.apache.struts:struts2-bom >--------------------
[INFO] Building Struts 2 Bill of Materials 2.6-SNAPSHOT                  [1/35]
[INFO] --------------------------------[ pom ]---------------------------------
[INFO] 
[INFO] --- maven-enforcer-plugin:1.4.1:enforce (enforce-maven-version) @ struts2-bom ---
[INFO] 
[INFO] --- maven-remote-resources-plugin:1.5:process (process-resource-bundles) @ struts2-bom
---
[INFO] 
[INFO] --- maven-site-plugin:3.7.1:attach-descriptor (attach-descriptor) @ struts2-bom ---
[INFO] No site descriptor found: nothing to attach.
[INFO] 
[INFO] ------------------< org.apache.struts:struts2-parent >------------------
[INFO] Building Struts 2 2.6-SNAPSHOT                                    [2/35]
[INFO] --------------------------------[ pom ]---------------------------------
Downloading from central: https://repo.maven.apache.org/maven2/org/owasp/dependency-check-maven/4.0.2/dependency-check-maven-4.0.2.pom
Progress (1): 2.2/9.4 kBProgress (1): 5.0/9.4 kBProgress (1): 7.8/9.4 kBProgress (1): 9.4
kB                        Downloaded from central: https://repo.maven.apache.org/maven2/org/owasp/dependency-check-maven/4.0.2/dependency-check-maven-4.0.2.pom
(9.4 kB at 39 kB/s)
Downloading from central: https://repo.maven.apache.org/maven2/org/owasp/dependency-check-parent/4.0.2/dependency-check-parent-4.0.2.pom
Progress (1): 2.2/50 kBProgress (1): 5.0/50 kBProgress (1): 7.8/50 kBProgress (1): 11/50 kB
Progress (1): 13/50 kBProgress (1): 16/50 kBProgress (1): 19/50 kBProgress (1): 21/50 kBProgress
(1): 24/50 kBProgress (1): 27/50 kBProgress (1): 30/50 kBProgress (1): 32/50 kBProgress (1):
36/50 kBProgress (1): 40/50 kBProgress (1): 45/50 kBProgress (1): 49/50 kBProgress (1): 50
kB                      Downloaded from central: https://repo.maven.apache.org/maven2/org/owasp/dependency-check-parent/4.0.2/dependency-check-parent-4.0.2.pom
(50 kB at 1.8 MB/s)
Downloading from central: https://repo.maven.apache.org/maven2/org/owasp/dependency-check-maven/4.0.2/dependency-check-maven-4.0.2.jar
Progress (1): 4.1/80 kBProgress (1): 7.7/80 kBProgress (1): 12/80 kB Progress (1): 16/80 kBProgress
(1): 20/80 kBProgress (1): 24/80 kBProgress (1): 28/80 kBProgress (1): 32/80 kBProgress (1):
36/80 kBProgress (1): 40/80 kBProgress (1): 45/80 kBProgress (1): 49/80 kBProgress (1): 53/80
kBProgress (1): 57/80 kBProgress (1): 61/80 kBProgress (1): 65/80 kBProgress (1): 69/80 kBProgress
(1): 73/80 kBProgress (1): 77/80 kBProgress (1): 80 kB                      Downloaded from
central: https://repo.maven.apache.org/maven2/org/owasp/dependency-check-maven/4.0.2/dependency-check-maven-4.0.2.jar
(80 kB at 3.1 MB/s)
[INFO] 
[INFO] --- maven-enforcer-plugin:3.0.0-M2:enforce (enforce) @ struts2-parent ---
[INFO] 
[INFO] --- maven-enforcer-plugin:3.0.0-M2:enforce (enforce-maven-version) @ struts2-parent
---
[INFO] 
[INFO] --- maven-remote-resources-plugin:1.5:process (process-resource-bundles) @ struts2-parent
---
[INFO] 
[INFO] --- maven-bundle-plugin:3.5.0:manifest (bundle-manifest) @ struts2-parent ---
[WARNING] Ignoring project type pom - supportedProjectTypes = [jar, bundle]
[INFO] 
[INFO] --- apache-rat-plugin:0.12:check (default) @ struts2-parent ---
[INFO] Added 1 additional default licenses.
[INFO] Added 1 custom approved licenses.
[INFO] Will parse SCM ignores for exclusions...
[INFO] Parsing exclusions from <https://builds.apache.org/job/Struts-master-JDK8-dependency-check/ws/.gitignore>
[INFO] Finished adding exclusions from SCM ignore files.
[INFO] 88 implicit excludes (use -debug for more details).
[INFO] Exclude: Jenkinsfile
[INFO] Exclude: src/main/groovy/Jenkinsfile.gdsl
[INFO] Exclude: src/main/resources/org/apache/struts2/static/domTT.js
[INFO] Exclude: src/site/resources/tags/**/*.html
[INFO] Exclude: src/main/resources/*LICENSE.txt
[INFO] Exclude: src/test/resources/**/*.txt
[INFO] Exclude: src/main/webapp/**/*.css
[INFO] Exclude: src/main/webapp/**/*.map
[INFO] Exclude: src/main/webapp/**/*.js
[INFO] Exclude: src/main/webapp/**/*.svg
[INFO] Exclude: src/main/webapp/**/*.txt
[INFO] Exclude: src/main/resources/**/docs-urls.txt
[INFO] Exclude: src/etc/header.txt
[INFO] Exclude: src/main/resources/static/css/**/*.css
[INFO] Exclude: src/main/resources/static/js/**/*.js
[INFO] Exclude: src/main/resources/docs.cfg
[INFO] Exclude: src/main/webapp/fonts/**/*
[INFO] 3 resources included (use -debug for more details)
[INFO] Rat check: Summary over all files. Unapproved: 0, unknown: 0, generated: 0, approved:
3 licenses.
[INFO] 
[INFO] >>> maven-source-plugin:3.0.1:jar (attach-sources) > generate-sources @
struts2-parent >>>
[INFO] 
[INFO] --- maven-enforcer-plugin:3.0.0-M2:enforce (enforce) @ struts2-parent ---
[INFO] 
[INFO] --- maven-enforcer-plugin:3.0.0-M2:enforce (enforce-maven-version) @ struts2-parent
---
[INFO] 
[INFO] <<< maven-source-plugin:3.0.1:jar (attach-sources) < generate-sources @
struts2-parent <<<
[INFO] 
[INFO] 
[INFO] --- maven-source-plugin:3.0.1:jar (attach-sources) @ struts2-parent ---
[INFO] 
[INFO] --- maven-site-plugin:3.7.1:attach-descriptor (attach-descriptor) @ struts2-parent
---
[INFO] Attaching 'src/site/site.xml' site descriptor with classifier 'site'.
[INFO] 
[INFO] --- dependency-check-maven:4.0.2:check (default) @ struts2-parent ---
Downloading from central: https://repo.maven.apache.org/maven2/org/owasp/dependency-check-core/4.0.2/dependency-check-core-4.0.2.pom
Progress (1): 2.2/26 kBProgress (1): 5.0/26 kBProgress (1): 7.8/26 kBProgress (1): 11/26 kB
Progress (1): 13/26 kBProgress (1): 16/26 kBProgress (1): 19/26 kBProgress (1): 21/26 kBProgress
(1): 24/26 kBProgress (1): 26 kB                      Downloaded from central: https://repo.maven.apache.org/maven2/org/owasp/dependency-check-core/4.0.2/dependency-check-core-4.0.2.pom
(26 kB at 1.2 MB/s)
Downloading from central: https://repo.maven.apache.org/maven2/com/vdurmont/semver4j/2.2.0/semver4j-2.2.0.pom
Progress (1): 2.2/6.1 kBProgress (1): 5.0/6.1 kBProgress (1): 6.1 kB                     
  Downloaded from central: https://repo.maven.apache.org/maven2/com/vdurmont/semver4j/2.2.0/semver4j-2.2.0.pom
(6.1 kB at 410 kB/s)
Downloading from central: https://repo.maven.apache.org/maven2/org/owasp/dependency-check-utils/4.0.2/dependency-check-utils-4.0.2.pom
Progress (1): 2.2/2.7 kBProgress (1): 2.7 kB                        Downloaded from central:
https://repo.maven.apache.org/maven2/org/owasp/dependency-check-utils/4.0.2/dependency-check-utils-4.0.2.pom
(2.7 kB at 180 kB/s)
Downloading from central: https://repo.maven.apache.org/maven2/com/sun/mail/mailapi/1.6.3/mailapi-1.6.3.pom
Progress (1): 2.8/6.2 kBProgress (1): 5.5/6.2 kBProgress (1): 6.2 kB                     
  Downloaded from central: https://repo.maven.apache.org/maven2/com/sun/mail/mailapi/1.6.3/mailapi-1.6.3.pom
(6.2 kB at 342 kB/s)
Downloading from central: https://repo.maven.apache.org/maven2/com/sun/mail/all/1.6.3/all-1.6.3.pom
Progress (1): 2.2/25 kBProgress (1): 5.0/25 kBProgress (1): 7.8/25 kBProgress (1): 11/25 kB
Progress (1): 13/25 kBProgress (1): 16/25 kBProgress (1): 19/25 kBProgress (1): 21/25 kBProgress
(1): 24/25 kBProgress (1): 25 kB                      Downloaded from central: https://repo.maven.apache.org/maven2/com/sun/mail/all/1.6.3/all-1.6.3.pom
(25 kB at 1.2 MB/s)
Downloading from central: https://repo.maven.apache.org/maven2/com/h3xstream/retirejs/retirejs-core/3.0.1/retirejs-core-3.0.1.pom
Progress (1): 1.6 kB                    Downloaded from central: https://repo.maven.apache.org/maven2/com/h3xstream/retirejs/retirejs-core/3.0.1/retirejs-core-3.0.1.pom
(1.6 kB at 106 kB/s)
Downloading from central: https://repo.maven.apache.org/maven2/com/h3xstream/retirejs/retirejs-root-pom/3.0.1/retirejs-root-pom-3.0.1.pom
Progress (1): 2.2/8.9 kBProgress (1): 5.0/8.9 kBProgress (1): 7.8/8.9 kBProgress (1): 8.9
kB                        Downloaded from central: https://repo.maven.apache.org/maven2/com/h3xstream/retirejs/retirejs-root-pom/3.0.1/retirejs-root-pom-3.0.1.pom
(8.9 kB at 524 kB/s)
Downloading from central: https://repo.maven.apache.org/maven2/com/esotericsoftware/minlog/1.3/minlog-1.3.pom
Progress (1): 2.2/4.3 kBProgress (1): 4.3 kB                        Downloaded from central:
https://repo.maven.apache.org/maven2/com/esotericsoftware/minlog/1.3/minlog-1.3.pom (4.3 kB
at 267 kB/s)
Downloading from central: https://repo.maven.apache.org/maven2/com/github/spullara/mustache/java/compiler/0.8.17/compiler-0.8.17.pom
Progress (1): 2.2/4.2 kBProgress (1): 4.2 kB                        Downloaded from central:
https://repo.maven.apache.org/maven2/com/github/spullara/mustache/java/compiler/0.8.17/compiler-0.8.17.pom
(4.2 kB at 261 kB/s)
Downloading from central: https://repo.maven.apache.org/maven2/com/github/spullara/mustache/java/mustache.java/0.8.17/mustache.java-0.8.17.pom
Progress (1): 2.2/3.7 kBProgress (1): 3.7 kB                        Downloaded from central:
https://repo.maven.apache.org/maven2/com/github/spullara/mustache/java/mustache.java/0.8.17/mustache.java-0.8.17.pom
(3.7 kB at 244 kB/s)
Downloading from central: https://repo.maven.apache.org/maven2/org/owasp/dependency-check-core/4.0.2/dependency-check-core-4.0.2.jar
Downloading from central: https://repo.maven.apache.org/maven2/com/vdurmont/semver4j/2.2.0/semver4j-2.2.0.jar
Downloading from central: https://repo.maven.apache.org/maven2/com/sun/mail/mailapi/1.6.3/mailapi-1.6.3.jar
Downloading from central: https://repo.maven.apache.org/maven2/com/h3xstream/retirejs/retirejs-core/3.0.1/retirejs-core-3.0.1.jar
Downloading from central: https://repo.maven.apache.org/maven2/com/esotericsoftware/minlog/1.3/minlog-1.3.jar
Progress (1): 2.2/686 kBProgress (1): 5.0/686 kBProgress (1): 7.7/686 kBProgress (1): 10/686
kB Progress (1): 13/686 kBProgress (1): 16/686 kBProgress (1): 19/686 kBProgress (1): 21/686
kBProgress (1): 24/686 kBProgress (1): 27/686 kBProgress (1): 30/686 kBProgress (1): 32/686
kBProgress (1): 36/686 kBProgress (1): 40/686 kBProgress (1): 45/686 kBProgress (1): 49/686
kBProgress (1): 53/686 kBProgress (1): 57/686 kBProgress (1): 61/686 kBProgress (1): 65/686
kBProgress (1): 69/686 kBProgress (1): 73/686 kBProgress (1): 77/686 kBProgress (1): 81/686
kBProgress (1): 85/686 kBProgress (1): 90/686 kBProgress (2): 90/686 kB | 2.2/27 kBProgress
(3): 90/686 kB | 2.2/27 kB | 2.8/5.6 kBProgress (3): 94/686 kB | 2.2/27 kB | 2.8/5.6 kBProgress
(3): 94/686 kB | 2.2/27 kB | 5.5/5.6 kBProgress (3): 94/686 kB | 5.0/27 kB | 5.5/5.6 kBProgress
(4): 94/686 kB | 5.0/27 kB | 5.5/5.6 kB | 2.2/27 kBProgress (4): 94/686 kB | 7.7/27 kB | 5.5/5.6
kB | 2.2/27 kBProgress (4): 94/686 kB | 7.7/27 kB | 5.6 kB | 2.2/27 kB    Progress (4): 98/686
kB | 7.7/27 kB | 5.6 kB | 2.2/27 kBProgress (4): 98/686 kB | 10/27 kB | 5.6 kB | 2.2/27 kB
Progress (5): 98/686 kB | 10/27 kB | 5.6 kB | 2.2/27 kB | 2.2/299 kBProgress (5): 98/686 kB
| 10/27 kB | 5.6 kB | 5.0/27 kB | 2.2/299 kBProgress (5): 98/686 kB | 10/27 kB | 5.6 kB |
5.0/27 kB | 5.0/299 kBProgress (5): 98/686 kB | 13/27 kB | 5.6 kB | 5.0/27 kB | 5.0/299 kBProgress
(5): 102/686 kB | 13/27 kB | 5.6 kB | 5.0/27 kB | 5.0/299 kBProgress (5): 102/686 kB | 16/27
kB | 5.6 kB | 5.0/27 kB | 5.0/299 kBProgress (5): 102/686 kB | 16/27 kB | 5.6 kB | 5.0/27
kB | 7.7/299 kBProgress (5): 102/686 kB | 16/27 kB | 5.6 kB | 7.7/27 kB | 7.7/299 kBProgress
(5): 102/686 kB | 16/27 kB | 5.6 kB | 7.7/27 kB | 10/299 kB Progress (5): 102/686 kB | 19/27
kB | 5.6 kB | 7.7/27 kB | 10/299 kBProgress (5): 106/686 kB | 19/27 kB | 5.6 kB | 7.7/27 kB
| 10/299 kBProgress (5): 106/686 kB | 21/27 kB | 5.6 kB | 7.7/27 kB | 10/299 kBProgress (5):
106/686 kB | 21/27 kB | 5.6 kB | 7.7/27 kB | 13/299 kBProgress (5): 106/686 kB | 21/27 kB
| 5.6 kB | 10/27 kB | 13/299 kB Progress (5): 106/686 kB | 21/27 kB | 5.6 kB | 10/27 kB |
16/299 kBProgress (5): 106/686 kB | 24/27 kB | 5.6 kB | 10/27 kB | 16/299 kB             
                                                     Downloaded from central: https://repo.maven.apache.org/maven2/com/esotericsoftware/minlog/1.3/minlog-1.3.jar
(5.6 kB at 125 kB/s)
Progress (4): 110/686 kB | 24/27 kB | 10/27 kB | 16/299 kB                               
                          Downloading from central: https://repo.maven.apache.org/maven2/com/github/spullara/mustache/java/compiler/0.8.17/compiler-0.8.17.jar
Progress (4): 110/686 kB | 27 kB | 10/27 kB | 16/299 kBProgress (4): 110/686 kB | 27 kB |
10/27 kB | 19/299 kBProgress (4): 110/686 kB | 27 kB | 13/27 kB | 19/299 kBProgress (4): 110/686
kB | 27 kB | 13/27 kB | 21/299 kBProgress (4): 114/686 kB | 27 kB | 13/27 kB | 21/299 kBProgress
(4): 114/686 kB | 27 kB | 13/27 kB | 24/299 kBProgress (4): 114/686 kB | 27 kB | 16/27 kB
| 24/299 kBProgress (4): 114/686 kB | 27 kB | 16/27 kB | 27/299 kBProgress (4): 118/686 kB
| 27 kB | 16/27 kB | 27/299 kBProgress (4): 118/686 kB | 27 kB | 16/27 kB | 30/299 kBProgress
(4): 118/686 kB | 27 kB | 19/27 kB | 30/299 kBProgress (4): 118/686 kB | 27 kB | 21/27 kB
| 30/299 kBProgress (4): 118/686 kB | 27 kB | 21/27 kB | 32/299 kBProgress (5): 118/686 kB
| 27 kB | 21/27 kB | 32/299 kB | 4.1/116 kBProgress (5): 122/686 kB | 27 kB | 21/27 kB | 32/299
kB | 4.1/116 kBProgress (5): 122/686 kB | 27 kB | 21/27 kB | 32/299 kB | 7.7/116 kBProgress
(5): 122/686 kB | 27 kB | 24/27 kB | 32/299 kB | 7.7/116 kB                              
                                     Downloaded from central: https://repo.maven.apache.org/maven2/com/vdurmont/semver4j/2.2.0/semver4j-2.2.0.jar
(27 kB at 402 kB/s)
Progress (4): 122/686 kB | 24/27 kB | 32/299 kB | 12/116 kBProgress (4): 122/686 kB | 24/27
kB | 36/299 kB | 12/116 kBProgress (4): 126/686 kB | 24/27 kB | 36/299 kB | 12/116 kBProgress
(4): 126/686 kB | 24/27 kB | 40/299 kB | 12/116 kBProgress (4): 126/686 kB | 24/27 kB | 40/299
kB | 16/116 kB                                                           Downloading from
central: https://repo.maven.apache.org/maven2/org/owasp/dependency-check-utils/4.0.2/dependency-check-utils-4.0.2.jar
Progress (4): 126/686 kB | 27/27 kB | 40/299 kB | 16/116 kBProgress (4): 126/686 kB | 27/27
kB | 45/299 kB | 16/116 kBProgress (4): 131/686 kB | 27/27 kB | 45/299 kB | 16/116 kBProgress
(4): 131/686 kB | 27/27 kB | 45/299 kB | 20/116 kBProgress (4): 131/686 kB | 27/27 kB | 49/299
kB | 20/116 kBProgress (4): 131/686 kB | 27 kB | 49/299 kB | 20/116 kB   Progress (4): 135/686
kB | 27 kB | 49/299 kB | 20/116 kBProgress (4): 135/686 kB | 27 kB | 49/299 kB | 24/116 kBProgress
(4): 135/686 kB | 27 kB | 53/299 kB | 24/116 kBProgress (4): 139/686 kB | 27 kB | 53/299 kB
| 24/116 kBProgress (4): 139/686 kB | 27 kB | 57/299 kB | 24/116 kBProgress (4): 139/686 kB
| 27 kB | 57/299 kB | 28/116 kBProgress (4): 139/686 kB | 27 kB | 61/299 kB | 28/116 kBProgress
(4): 143/686 kB | 27 kB | 61/299 kB | 28/116 kBProgress (4): 143/686 kB | 27 kB | 65/299 kB
| 28/116 kBProgress (4): 143/686 kB | 27 kB | 65/299 kB | 32/116 kBProgress (4): 147/686 kB
| 27 kB | 65/299 kB | 32/116 kBProgress (4): 147/686 kB | 27 kB | 69/299 kB | 32/116 kBProgress
(4): 147/686 kB | 27 kB | 73/299 kB | 32/116 kBProgress (4): 147/686 kB | 27 kB | 77/299 kB
| 32/116 kBProgress (4): 147/686 kB | 27 kB | 77/299 kB | 36/116 kBProgress (4): 151/686 kB
| 27 kB | 77/299 kB | 36/116 kBProgress (4): 151/686 kB | 27 kB | 77/299 kB | 40/116 kBProgress
(4): 151/686 kB | 27 kB | 81/299 kB | 40/116 kBProgress (4): 151/686 kB | 27 kB | 81/299 kB
| 45/116 kBProgress (5): 151/686 kB | 27 kB | 81/299 kB | 45/116 kB | 2.2/38 kBProgress (5):
155/686 kB | 27 kB | 81/299 kB | 45/116 kB | 2.2/38 kBProgress (5): 155/686 kB | 27 kB | 81/299
kB | 49/116 kB | 2.2/38 kB                                                               
    Downloaded from central: https://repo.maven.apache.org/maven2/com/h3xstream/retirejs/retirejs-core/3.0.1/retirejs-core-3.0.1.jar
(27 kB at 361 kB/s)
Progress (4): 155/686 kB | 81/299 kB | 49/116 kB | 5.0/38 kBProgress (4): 159/686 kB | 81/299
kB | 49/116 kB | 5.0/38 kBProgress (4): 159/686 kB | 85/299 kB | 49/116 kB | 5.0/38 kBProgress
(4): 163/686 kB | 85/299 kB | 49/116 kB | 5.0/38 kBProgress (4): 163/686 kB | 85/299 kB |
49/116 kB | 7.7/38 kBProgress (4): 163/686 kB | 85/299 kB | 53/116 kB | 7.7/38 kBProgress
(4): 163/686 kB | 85/299 kB | 53/116 kB | 10/38 kB Progress (4): 163/686 kB | 90/299 kB |
53/116 kB | 10/38 kBProgress (4): 167/686 kB | 90/299 kB | 53/116 kB | 10/38 kBProgress (4):
167/686 kB | 90/299 kB | 57/116 kB | 10/38 kBProgress (4): 171/686 kB | 90/299 kB | 57/116
kB | 10/38 kBProgress (4): 171/686 kB | 94/299 kB | 57/116 kB | 10/38 kBProgress (4): 171/686
kB | 94/299 kB | 57/116 kB | 13/38 kBProgress (4): 171/686 kB | 98/299 kB | 57/116 kB | 13/38
kBProgress (4): 176/686 kB | 98/299 kB | 57/116 kB | 13/38 kBProgress (4): 176/686 kB | 98/299
kB | 61/116 kB | 13/38 kBProgress (4): 180/686 kB | 98/299 kB | 61/116 kB | 13/38 kBProgress
(4): 180/686 kB | 98/299 kB | 61/116 kB | 16/38 kBProgress (4): 180/686 kB | 102/299 kB |
61/116 kB | 16/38 kBProgress (4): 180/686 kB | 102/299 kB | 65/116 kB | 16/38 kBProgress (4):
180/686 kB | 106/299 kB | 65/116 kB | 16/38 kBProgress (4): 184/686 kB | 106/299 kB | 65/116
kB | 16/38 kBProgress (4): 184/686 kB | 106/299 kB | 65/116 kB | 19/38 kBProgress (4): 184/686
kB | 106/299 kB | 69/116 kB | 19/38 kBProgress (4): 188/686 kB | 106/299 kB | 69/116 kB |
19/38 kBProgress (4): 188/686 kB | 110/299 kB | 69/116 kB | 19/38 kBProgress (4): 192/686
kB | 110/299 kB | 69/116 kB | 19/38 kBProgress (4): 192/686 kB | 110/299 kB | 69/116 kB |
21/38 kBProgress (4): 192/686 kB | 110/299 kB | 73/116 kB | 21/38 kBProgress (4): 196/686
kB | 110/299 kB | 73/116 kB | 21/38 kBProgress (4): 196/686 kB | 114/299 kB | 73/116 kB |
21/38 kBProgress (4): 196/686 kB | 114/299 kB | 73/116 kB | 24/38 kBProgress (4): 196/686
kB | 114/299 kB | 77/116 kB | 24/38 kBProgress (4): 200/686 kB | 114/299 kB | 77/116 kB |
24/38 kBProgress (4): 200/686 kB | 114/299 kB | 81/116 kB | 24/38 kBProgress (4): 200/686
kB | 114/299 kB | 81/116 kB | 27/38 kBProgress (4): 200/686 kB | 114/299 kB | 85/116 kB |
27/38 kBProgress (4): 200/686 kB | 114/299 kB | 90/116 kB | 27/38 kBProgress (4): 200/686
kB | 114/299 kB | 94/116 kB | 27/38 kBProgress (4): 200/686 kB | 114/299 kB | 98/116 kB |
27/38 kBProgress (4): 200/686 kB | 114/299 kB | 102/116 kB | 27/38 kBProgress (4): 200/686
kB | 114/299 kB | 106/116 kB | 27/38 kBProgress (4): 200/686 kB | 114/299 kB | 110/116 kB
| 27/38 kBProgress (4): 200/686 kB | 114/299 kB | 114/116 kB | 27/38 kBProgress (4): 200/686
kB | 114/299 kB | 116 kB | 27/38 kB    Progress (4): 200/686 kB | 118/299 kB | 116 kB | 27/38
kBProgress (4): 200/686 kB | 118/299 kB | 116 kB | 30/38 kBProgress (4): 200/686 kB | 118/299
kB | 116 kB | 32/38 kBProgress (4): 200/686 kB | 118/299 kB | 116 kB | 35/38 kBProgress (4):
204/686 kB | 118/299 kB | 116 kB | 35/38 kBProgress (4): 204/686 kB | 118/299 kB | 116 kB
| 38 kB   Progress (4): 204/686 kB | 122/299 kB | 116 kB | 38 kBProgress (4): 208/686 kB |
122/299 kB | 116 kB | 38 kBProgress (4): 208/686 kB | 126/299 kB | 116 kB | 38 kBProgress
(4): 212/686 kB | 126/299 kB | 116 kB | 38 kBProgress (4): 212/686 kB | 131/299 kB | 116 kB
| 38 kBProgress (4): 217/686 kB | 131/299 kB | 116 kB | 38 kBProgress (4): 217/686 kB | 135/299
kB | 116 kB | 38 kBProgress (4): 221/686 kB | 135/299 kB | 116 kB | 38 kBProgress (4): 221/686
kB | 139/299 kB | 116 kB | 38 kBProgress (4): 225/686 kB | 139/299 kB | 116 kB | 38 kBProgress
(4): 225/686 kB | 143/299 kB | 116 kB | 38 kBProgress (4): 229/686 kB | 143/299 kB | 116 kB
| 38 kBProgress (4): 229/686 kB | 147/299 kB | 116 kB | 38 kB                            
                         Downloaded from central: https://repo.maven.apache.org/maven2/com/github/spullara/mustache/java/compiler/0.8.17/compiler-0.8.17.jar
(116 kB at 1.2 MB/s)
Progress (3): 233/686 kB | 147/299 kB | 38 kBProgress (3): 233/686 kB | 151/299 kB | 38 kBProgress
(3): 237/686 kB | 151/299 kB | 38 kBProgress (3): 237/686 kB | 155/299 kB | 38 kBProgress
(3): 241/686 kB | 155/299 kB | 38 kBProgress (3): 241/686 kB | 159/299 kB | 38 kBProgress
(3): 245/686 kB | 159/299 kB | 38 kBProgress (3): 245/686 kB | 163/299 kB | 38 kB        
                                    Downloaded from central: https://repo.maven.apache.org/maven2/org/owasp/dependency-check-utils/4.0.2/dependency-check-utils-4.0.2.jar
(38 kB at 377 kB/s)
Progress (2): 249/686 kB | 163/299 kBProgress (2): 249/686 kB | 167/299 kBProgress (2): 253/686
kB | 167/299 kBProgress (2): 258/686 kB | 167/299 kBProgress (2): 258/686 kB | 171/299 kBProgress
(2): 262/686 kB | 171/299 kBProgress (2): 262/686 kB | 176/299 kBProgress (2): 262/686 kB
| 180/299 kBProgress (2): 266/686 kB | 180/299 kBProgress (2): 270/686 kB | 180/299 kBProgress
(2): 270/686 kB | 184/299 kBProgress (2): 274/686 kB | 184/299 kBProgress (2): 274/686 kB
| 188/299 kBProgress (2): 278/686 kB | 188/299 kBProgress (2): 278/686 kB | 192/299 kBProgress
(2): 278/686 kB | 196/299 kBProgress (2): 282/686 kB | 196/299 kBProgress (2): 282/686 kB
| 200/299 kBProgress (2): 286/686 kB | 200/299 kBProgress (2): 286/686 kB | 204/299 kBProgress
(2): 290/686 kB | 204/299 kBProgress (2): 290/686 kB | 208/299 kBProgress (2): 294/686 kB
| 208/299 kBProgress (2): 294/686 kB | 212/299 kBProgress (2): 298/686 kB | 212/299 kBProgress
(2): 298/686 kB | 217/299 kBProgress (2): 303/686 kB | 217/299 kBProgress (2): 303/686 kB
| 221/299 kBProgress (2): 307/686 kB | 221/299 kBProgress (2): 307/686 kB | 225/299 kBProgress
(2): 311/686 kB | 225/299 kBProgress (2): 311/686 kB | 229/299 kBProgress (2): 315/686 kB
| 229/299 kBProgress (2): 319/686 kB | 229/299 kBProgress (2): 319/686 kB | 233/299 kBProgress
(2): 323/686 kB | 233/299 kBProgress (2): 323/686 kB | 237/299 kBProgress (2): 327/686 kB
| 237/299 kBProgress (2): 327/686 kB | 241/299 kBProgress (2): 327/686 kB | 245/299 kBProgress
(2): 331/686 kB | 245/299 kBProgress (2): 335/686 kB | 245/299 kBProgress (2): 339/686 kB
| 245/299 kBProgress (2): 339/686 kB | 249/299 kBProgress (2): 344/686 kB | 249/299 kBProgress
(2): 344/686 kB | 253/299 kBProgress (2): 344/686 kB | 258/299 kBProgress (2): 344/686 kB
| 262/299 kBProgress (2): 348/686 kB | 262/299 kBProgress (2): 352/686 kB | 262/299 kBProgress
(2): 356/686 kB | 262/299 kBProgress (2): 360/686 kB | 262/299 kBProgress (2): 360/686 kB
| 266/299 kBProgress (2): 360/686 kB | 270/299 kBProgress (2): 360/686 kB | 274/299 kBProgress
(2): 364/686 kB | 274/299 kBProgress (2): 364/686 kB | 278/299 kBProgress (2): 368/686 kB
| 278/299 kBProgress (2): 372/686 kB | 278/299 kBProgress (2): 376/686 kB | 278/299 kBProgress
(2): 376/686 kB | 282/299 kBProgress (2): 376/686 kB | 286/299 kBProgress (2): 380/686 kB
| 286/299 kBProgress (2): 380/686 kB | 290/299 kBProgress (2): 384/686 kB | 290/299 kBProgress
(2): 384/686 kB | 294/299 kBProgress (2): 389/686 kB | 294/299 kBProgress (2): 393/686 kB
| 294/299 kBProgress (2): 393/686 kB | 298/299 kBProgress (2): 393/686 kB | 299 kB    Progress
(2): 397/686 kB | 299 kBProgress (2): 401/686 kB | 299 kBProgress (2): 405/686 kB | 299 kBProgress
(2): 409/686 kB | 299 kBProgress (2): 413/686 kB | 299 kBProgress (2): 417/686 kB | 299 kBProgress
(2): 421/686 kB | 299 kBProgress (2): 425/686 kB | 299 kBProgress (2): 430/686 kB | 299 kBProgress
(2): 434/686 kB | 299 kBProgress (2): 438/686 kB | 299 kBProgress (2): 442/686 kB | 299 kBProgress
(2): 446/686 kB | 299 kBProgress (2): 450/686 kB | 299 kBProgress (2): 454/686 kB | 299 kBProgress
(2): 458/686 kB | 299 kBProgress (2): 462/686 kB | 299 kBProgress (2): 466/686 kB | 299 kBProgress
(2): 470/686 kB | 299 kBProgress (2): 475/686 kB | 299 kB                                
Downloaded from central: https://repo.maven.apache.org/maven2/com/sun/mail/mailapi/1.6.3/mailapi-1.6.3.jar
(299 kB at 2.3 MB/s)
Progress (1): 479/686 kBProgress (1): 483/686 kBProgress (1): 487/686 kBProgress (1): 491/686
kBProgress (1): 495/686 kBProgress (1): 499/686 kBProgress (1): 503/686 kBProgress (1): 507/686
kBProgress (1): 511/686 kBProgress (1): 516/686 kBProgress (1): 520/686 kBProgress (1): 524/686
kBProgress (1): 528/686 kBProgress (1): 532/686 kBProgress (1): 536/686 kBProgress (1): 540/686
kBProgress (1): 544/686 kBProgress (1): 548/686 kBProgress (1): 552/686 kBProgress (1): 557/686
kBProgress (1): 561/686 kBProgress (1): 565/686 kBProgress (1): 569/686 kBProgress (1): 573/686
kBProgress (1): 577/686 kBProgress (1): 581/686 kBProgress (1): 585/686 kBProgress (1): 589/686
kBProgress (1): 593/686 kBProgress (1): 597/686 kBProgress (1): 602/686 kBProgress (1): 606/686
kBProgress (1): 610/686 kBProgress (1): 614/686 kBProgress (1): 618/686 kBProgress (1): 622/686
kBProgress (1): 626/686 kBProgress (1): 630/686 kBProgress (1): 634/686 kBProgress (1): 638/686
kBProgress (1): 643/686 kBProgress (1): 647/686 kBProgress (1): 651/686 kBProgress (1): 655/686
kBProgress (1): 659/686 kBProgress (1): 663/686 kBProgress (1): 667/686 kBProgress (1): 671/686
kBProgress (1): 675/686 kBProgress (1): 679/686 kBProgress (1): 683/686 kBProgress (1): 686
kB                        Downloaded from central: https://repo.maven.apache.org/maven2/org/owasp/dependency-check-core/4.0.2/dependency-check-core-4.0.2.jar
(686 kB at 4.3 MB/s)
[INFO] Central analyzer disabled
[INFO] Checking for updates
[INFO] starting getUpdatesNeeded() ...
[INFO] NVD CVE requires several updates; this could take a couple of minutes.
[INFO] Download Started for NVD CVE - 2010
[INFO] Download Started for NVD CVE - 2011
[INFO] Download Started for NVD CVE - 2012
[INFO] Download Started for NVD CVE - 2008
[INFO] Download Started for NVD CVE - 2007
[INFO] Download Started for NVD CVE - 2006
[INFO] Download Started for NVD CVE - 2009
[INFO] Download Started for NVD CVE - 2005
[INFO] Download Started for NVD CVE - 2004
[INFO] Download Started for NVD CVE - 2003
[INFO] Download Started for NVD CVE - 2013
[INFO] Download Started for NVD CVE - 2015
[INFO] Download Started for NVD CVE - 2002
[INFO] Download Started for NVD CVE - 2016
[INFO] Download Started for NVD CVE - 2014
[INFO] Download Started for NVD CVE - 2017
[INFO] Download Started for NVD CVE - 2019
[INFO] Download Started for NVD CVE - Modified
[INFO] Download Started for NVD CVE - 2018
[INFO] Download Complete for NVD CVE - 2003  (1597 ms)
[INFO] Processing Started for NVD CVE - 2003
[INFO] Download Complete for NVD CVE - Modified  (1810 ms)
[INFO] Processing Started for NVD CVE - Modified
[INFO] Download Complete for NVD CVE - 2004  (2178 ms)
[INFO] Processing Started for NVD CVE - 2004
[INFO] Download Complete for NVD CVE - 2005  (2325 ms)
[INFO] Processing Started for NVD CVE - 2005
[INFO] Download Complete for NVD CVE - 2007  (2596 ms)
[INFO] Processing Started for NVD CVE - 2007
[INFO] Download Complete for NVD CVE - 2006  (3021 ms)
[INFO] Processing Started for NVD CVE - 2006
[INFO] Download Complete for NVD CVE - 2002  (3169 ms)
[INFO] Processing Started for NVD CVE - 2002
[INFO] Download Complete for NVD CVE - 2016  (3313 ms)
[INFO] Processing Started for NVD CVE - 2016
[INFO] Download Complete for NVD CVE - 2015  (3515 ms)
[INFO] Processing Started for NVD CVE - 2015
[INFO] Download Complete for NVD CVE - 2009  (3937 ms)
[INFO] Processing Started for NVD CVE - 2009
[INFO] Download Complete for NVD CVE - 2012  (4213 ms)
[INFO] Processing Started for NVD CVE - 2012
[INFO] Download Complete for NVD CVE - 2019  (4251 ms)
[INFO] Processing Started for NVD CVE - 2019
[INFO] Download Complete for NVD CVE - 2011  (4621 ms)
[INFO] Download Complete for NVD CVE - 2008  (4733 ms)
[INFO] Processing Started for NVD CVE - 2011
[INFO] Download Complete for NVD CVE - 2013  (4806 ms)
[INFO] Processing Started for NVD CVE - 2008
[INFO] Processing Started for NVD CVE - 2013
[INFO] Download Complete for NVD CVE - 2014  (4918 ms)
[INFO] Processing Started for NVD CVE - 2014
[INFO] Download Complete for NVD CVE - 2017  (5299 ms)
[INFO] Processing Started for NVD CVE - 2017
[INFO] Download Complete for NVD CVE - 2010  (5552 ms)
[INFO] Processing Started for NVD CVE - 2010
[WARNING] Download Failed for NVD CVE - 2018
Some CVEs may not be reported.
[INFO] If you are behind a proxy you may need to configure dependency-check to use the proxy.
[WARNING] Unable to update Cached Web DataSource, using local data instead. Results may not
include recent vulnerabilities.
[INFO] Analysis Started
[INFO] Finished File Name Analyzer (0 seconds)
[INFO] Finished Dependency Merging Analyzer (0 seconds)
[INFO] Finished Version Filter Analyzer (0 seconds)
[INFO] Finished Hint Analyzer (0 seconds)
[INFO] Processing Complete for NVD CVE - Modified  (9074 ms)
[INFO] Created CPE Index (0 seconds)
[INFO] Skipping CPE Analysis for npm
[INFO] Finished CPE Analyzer (1 seconds)
[INFO] Finished False Positive Analyzer (0 seconds)
[INFO] Finished NVD CVE Analyzer (0 seconds)
[INFO] Finished Vulnerability Suppression Analyzer (0 seconds)
[INFO] Finished Dependency Bundling Analyzer (0 seconds)
[INFO] Analysis Complete (1 seconds)
[INFO] ------------------------------------------------------------------------
[INFO] Reactor Summary for Struts 2 2.6-SNAPSHOT:
[INFO] 
[INFO] Struts 2 Bill of Materials ......................... SUCCESS [  1.535 s]
[INFO] Struts 2 ........................................... FAILURE [ 16.765 s]
[INFO] Struts 2 Core ...................................... SKIPPED
[INFO] Struts 2 Plugins ................................... SKIPPED
[INFO] Struts 2 Configuration Browser Plugin .............. SKIPPED
[INFO] Struts 2 Sitemesh Plugin ........................... SKIPPED
[INFO] Struts 2 Tiles Plugin .............................. SKIPPED
[INFO] Struts 2 DWR Plugin ................................ SKIPPED
[INFO] Struts 2 Spring Plugin ............................. SKIPPED
[INFO] Struts 2 Convention Plugin ......................... SKIPPED
[INFO] Struts 2 JUnit Plugin .............................. SKIPPED
[INFO] Struts 2 JSON Plugin ............................... SKIPPED
[INFO] Struts 2 Bean Validation Plugin .................... SKIPPED
[INFO] Struts 2 Async Plugin .............................. SKIPPED
[INFO] Struts 2 Webapps ................................... SKIPPED
[INFO] Struts 2 Showcase Webapp ........................... SKIPPED
[INFO] Struts 2 REST Plugin ............................... SKIPPED
[INFO] Struts 2 Rest Showcase Webapp ...................... SKIPPED
[INFO] Struts 2 CDI Plugin ................................ SKIPPED
[INFO] DEPRECATED: Struts 2 Embedded JSP Plugin ........... SKIPPED
[INFO] Struts 2 GXP Plugin ................................ SKIPPED
[INFO] Struts 2 Jasper Reports Plugin ..................... SKIPPED
[INFO] Struts 2 Java Templates Plugin ..................... SKIPPED
[INFO] Struts 2 JFreeChart Plugin ......................... SKIPPED
[INFO] Struts 2 OSGi Plugin ............................... SKIPPED
[INFO] Struts 2 OVal Plugin ............................... SKIPPED
[INFO] Struts 2 Pell Multipart Plugin ..................... SKIPPED
[INFO] Struts 2 Plexus Plugin ............................. SKIPPED
[INFO] Struts 2 Portlet Plugin ............................ SKIPPED
[INFO] Struts 2 Portlet Tiles Plugin ...................... SKIPPED
[INFO] Struts 2 TestNG Plugin ............................. SKIPPED
[INFO] Struts 2 OSGi Bundles .............................. SKIPPED
[INFO] Struts 2 OSGi Admin Bundle ......................... SKIPPED
[INFO] Struts 2 OSGi Demo Bundle .......................... SKIPPED
[INFO] Struts 2 Assembly .................................. SKIPPED
[INFO] ------------------------------------------------------------------------
[INFO] BUILD FAILURE
[INFO] ------------------------------------------------------------------------
[INFO] Total time:  19.908 s
[INFO] Finished at: 2019-05-30T07:58:42Z
[INFO] ------------------------------------------------------------------------
[ERROR] Failed to execute goal org.owasp:dependency-check-maven:4.0.2:check (default) on project
struts2-parent: One or more exceptions occurred during dependency-check analysis: One or more
exceptions occurred during dependency-check analysis
[ERROR] 	The download was interrupted; unable to complete the update
[ERROR] -> [Help 1]
[ERROR] 
[ERROR] To see the full stack trace of the errors, re-run Maven with the -e switch.
[ERROR] Re-run Maven using the -X switch to enable full debug logging.
[ERROR] 
[ERROR] For more information about the errors and possible solutions, please read the following
articles:
[ERROR] [Help 1] http://cwiki.apache.org/confluence/display/MAVEN/MojoExecutionException
[ERROR] 
[ERROR] After correcting the problems, you can resume the build with the command
[ERROR]   mvn <goals> -rf :struts2-parent
Build step 'Execute shell' marked build as failure
[locks-and-latches] Releasing all the locks
[locks-and-latches] All the locks released
Setting MAVEN_3_LATEST__HOME=/home/jenkins/tools/maven/latest3/

---------------------------------------------------------------------
To unsubscribe, e-mail: dev-unsubscribe@struts.apache.org
For additional commands, e-mail: dev-help@struts.apache.org


Mime
View raw message