struts-dev mailing list archives

Site index · List index
Message view « Date » · « Thread »
Top « Date » · « Thread »
From Apache Jenkins Server <jenk...@builds.apache.org>
Subject Build failed in Jenkins: Struts-master-JDK11 #1
Date Sun, 11 Nov 2018 08:12:02 GMT
See <https://builds.apache.org/job/Struts-master-JDK11/1/display/redirect>

------------------------------------------
[...truncated 134.18 KB...]
[ERROR]                                                      ^
[ERROR] <https://builds.apache.org/job/Struts-master-JDK11/ws/core/src/main/java/com/opensymphony/xwork2/UnknownHandler.java>:50:
error: tag not supported in the generated HTML version: tt
[ERROR]      * @return A result to be executed, can return <tt>null</tt>
[ERROR]                                                    ^
[ERROR] <https://builds.apache.org/job/Struts-master-JDK11/ws/core/src/main/java/com/opensymphony/xwork2/UnknownHandler.java>:61:
error: tag not supported in the generated HTML version: tt
[ERROR]      * @return The result returned from invoking the action method, can return <tt>null</tt>
if this instance cannot
[ERROR]                                                                                ^
[ERROR] <https://builds.apache.org/job/Struts-master-JDK11/ws/core/src/main/java/com/opensymphony/xwork2/XWorkException.java>:113:
error: tag not supported in the generated HTML version: tt
[ERROR]      * @return the location, <tt>null</tt> if not available 
[ERROR]                              ^
[ERROR] <https://builds.apache.org/job/Struts-master-JDK11/ws/core/src/main/java/com/opensymphony/xwork2/config/ContainerProvider.java>:47:
error: tag not supported in the generated HTML version: tt
[ERROR]      * @return <tt>true</tt>, whether the ContainerProvider should reload
its configuration, <tt>false</tt>otherwise.
[ERROR]                ^
[ERROR] <https://builds.apache.org/job/Struts-master-JDK11/ws/core/src/main/java/com/opensymphony/xwork2/config/ContainerProvider.java>:47:
error: tag not supported in the generated HTML version: tt
[ERROR]      * @return <tt>true</tt>, whether the ContainerProvider should reload
its configuration, <tt>false</tt>otherwise.
[ERROR]                                                                                  
           ^
[ERROR] <https://builds.apache.org/job/Struts-master-JDK11/ws/core/src/main/java/com/opensymphony/xwork2/config/PackageProvider.java>:39:
error: tag not supported in the generated HTML version: tt
[ERROR]      * @return <tt>true</tt>, whether the PackageProvider should reload
its configuration, <tt>false</tt>otherwise.
[ERROR]                ^
[ERROR] <https://builds.apache.org/job/Struts-master-JDK11/ws/core/src/main/java/com/opensymphony/xwork2/config/PackageProvider.java>:39:
error: tag not supported in the generated HTML version: tt
[ERROR]      * @return <tt>true</tt>, whether the PackageProvider should reload
its configuration, <tt>false</tt>otherwise.
[ERROR]                                                                                  
         ^
[ERROR] <https://builds.apache.org/job/Struts-master-JDK11/ws/core/src/main/java/com/opensymphony/xwork2/inject/Factory.java>:35:
error: unknown tag: T
[ERROR]      * Returns a class of <T>
[ERROR]                           ^
[ERROR] <https://builds.apache.org/job/Struts-master-JDK11/ws/core/src/main/java/com/opensymphony/xwork2/conversion/annotations/TypeConversion.java>:189:
error: unexpected content
[ERROR]      * @see {@link #converterClass()}
[ERROR]        ^
[ERROR] <https://builds.apache.org/job/Struts-master-JDK11/ws/core/src/main/java/com/opensymphony/xwork2/conversion/impl/DefaultObjectTypeDeterminer.java>:158:
error: tag not supported in the generated HTML version: tt
[ERROR]      * @param isIndexAccessed <tt>true</tt>, if the collection or map
is accessed via index, <tt>false</tt> otherwise.
[ERROR]                               ^
[ERROR] <https://builds.apache.org/job/Struts-master-JDK11/ws/core/src/main/java/com/opensymphony/xwork2/conversion/impl/DefaultObjectTypeDeterminer.java>:158:
error: tag not supported in the generated HTML version: tt
[ERROR]      * @param isIndexAccessed <tt>true</tt>, if the collection or map
is accessed via index, <tt>false</tt> otherwise.
[ERROR]                                                                                  
           ^
[ERROR] <https://builds.apache.org/job/Struts-master-JDK11/ws/core/src/main/java/com/opensymphony/xwork2/conversion/impl/DefaultObjectTypeDeterminer.java>:159:
error: tag not supported in the generated HTML version: tt
[ERROR]      * @return <tt>true</tt>, if the Collection or Map should be created,
<tt>false</tt> otherwise.
[ERROR]                ^
[ERROR] <https://builds.apache.org/job/Struts-master-JDK11/ws/core/src/main/java/com/opensymphony/xwork2/conversion/impl/DefaultObjectTypeDeterminer.java>:159:
error: tag not supported in the generated HTML version: tt
[ERROR]      * @return <tt>true</tt>, if the Collection or Map should be created,
<tt>false</tt> otherwise.
[ERROR]                                                                           ^
[ERROR] <https://builds.apache.org/job/Struts-master-JDK11/ws/core/src/main/java/com/opensymphony/xwork2/conversion/impl/XWorkList.java>:92:
error: tag not supported in the generated HTML version: tt
[ERROR]      * @return <tt>true</tt> (as per the general contract of Collection.add).
[ERROR]                ^
[ERROR] <https://builds.apache.org/job/Struts-master-JDK11/ws/core/src/main/java/com/opensymphony/xwork2/conversion/impl/XWorkList.java>:115:
error: tag not supported in the generated HTML version: tt
[ERROR]      * @return <tt>true</tt> if this list changed as a result of the call.
[ERROR]                ^
[ERROR] <https://builds.apache.org/job/Struts-master-JDK11/ws/core/src/main/java/com/opensymphony/xwork2/conversion/impl/XWorkList.java>:147:
error: tag not supported in the generated HTML version: tt
[ERROR]      * @return <tt>true</tt> if this list changed as a result of the call.
[ERROR]                ^
[ERROR] <https://builds.apache.org/job/Struts-master-JDK11/ws/core/src/main/java/com/opensymphony/xwork2/inject/util/Strings.java>:43:
error: tag not supported in the generated HTML version: tt
[ERROR]    * @return a string equivalent to <tt>s</tt> with its first character
[ERROR]                                     ^
[ERROR] <https://builds.apache.org/job/Struts-master-JDK11/ws/core/src/main/java/com/opensymphony/xwork2/inject/util/Strings.java>:45:
error: tag not supported in the generated HTML version: tt
[ERROR]    * @throws NullPointerException if <tt>s</tt> is null
[ERROR]                                      ^
[ERROR] <https://builds.apache.org/job/Struts-master-JDK11/ws/core/src/main/java/com/opensymphony/xwork2/interceptor/MethodFilterInterceptorUtil.java>:50:
error: tag not supported in the generated HTML version: tt
[ERROR]      * @return <tt>true</tt> if the method should be applied.
[ERROR]                ^
[ERROR] <https://builds.apache.org/job/Struts-master-JDK11/ws/core/src/main/java/com/opensymphony/xwork2/interceptor/MethodFilterInterceptorUtil.java>:139:
error: tag not supported in the generated HTML version: tt
[ERROR]      * @return <tt>true</tt> if the method should be applied.
[ERROR]                ^
[ERROR] <https://builds.apache.org/job/Struts-master-JDK11/ws/core/src/main/java/com/opensymphony/xwork2/interceptor/ParameterNameAware.java>:33:
error: tag not supported in the generated HTML version: tt
[ERROR]      * @return <tt>true</tt> if accepted, <tt>false</tt> otherwise
[ERROR]                ^
[ERROR] <https://builds.apache.org/job/Struts-master-JDK11/ws/core/src/main/java/com/opensymphony/xwork2/interceptor/ParameterNameAware.java>:33:
error: tag not supported in the generated HTML version: tt
[ERROR]      * @return <tt>true</tt> if accepted, <tt>false</tt> otherwise
[ERROR]                                           ^
[ERROR] <https://builds.apache.org/job/Struts-master-JDK11/ws/core/src/main/java/com/opensymphony/xwork2/interceptor/PrefixMethodInvocationUtil.java>:148:
error: tag not supported in the generated HTML version: tt
[ERROR] 	 * @return a {@link Method} if one is found, else <tt>null</tt>.
[ERROR] 	                                                  ^
[ERROR] <https://builds.apache.org/job/Struts-master-JDK11/ws/core/src/main/java/com/opensymphony/xwork2/interceptor/PrepareInterceptor.java>:115:
error: tag not supported in the generated HTML version: tt
[ERROR]      * Default is <tt>true</tt>.
[ERROR]                   ^
[ERROR] <https://builds.apache.org/job/Struts-master-JDK11/ws/core/src/main/java/com/opensymphony/xwork2/interceptor/PrepareInterceptor.java>:127:
error: tag not supported in the generated HTML version: tt
[ERROR]      * Default is <tt>false</tt> for backward compatibility
[ERROR]                   ^
[ERROR] <https://builds.apache.org/job/Struts-master-JDK11/ws/core/src/main/java/com/opensymphony/xwork2/interceptor/StaticParametersInterceptor.java>:222:
error: tag not supported in the generated HTML version: tt
[ERROR]      * If you want the static parameters as successor over already existing parameters,
set overwrite to <tt>true</tt>.
[ERROR]                                                                                  
                       ^
[ERROR] <https://builds.apache.org/job/Struts-master-JDK11/ws/core/src/main/java/com/opensymphony/xwork2/util/ValueStack.java>:62:
error: tag not supported in the generated HTML version: tt
[ERROR]      * @return the override map, <tt>null</tt> if not set.
[ERROR]                                  ^
[ERROR] <https://builds.apache.org/job/Struts-master-JDK11/ws/core/src/main/java/com/opensymphony/xwork2/util/CreateIfNull.java>:74:
error: tag not supported in the generated HTML version: tt
[ERROR]      * @return The CreateIfNull value. Defaults to <tt>true</tt>.
[ERROR]                                                    ^
[ERROR] <https://builds.apache.org/job/Struts-master-JDK11/ws/core/src/main/java/com/opensymphony/xwork2/util/Element.java>:78:
error: tag not supported in the generated HTML version: tt
[ERROR]      * @return The Element value. Defaults to <tt>java.lang.Object.class</tt>.
[ERROR]                                               ^
[ERROR] <https://builds.apache.org/job/Struts-master-JDK11/ws/core/src/main/java/com/opensymphony/xwork2/util/AbstractLocalizedTextProvider.java>:493:
warning: no @param for clazz
[ERROR]     protected String findMessage(Class clazz, String key, String indexedKey, Locale
locale, Object[] args, Set<String> checked,
[ERROR]                      ^
[ERROR] <https://builds.apache.org/job/Struts-master-JDK11/ws/core/src/main/java/com/opensymphony/xwork2/util/AbstractLocalizedTextProvider.java>:493:
warning: no @param for key
[ERROR]     protected String findMessage(Class clazz, String key, String indexedKey, Locale
locale, Object[] args, Set<String> checked,
[ERROR]                      ^
[ERROR] <https://builds.apache.org/job/Struts-master-JDK11/ws/core/src/main/java/com/opensymphony/xwork2/util/AbstractLocalizedTextProvider.java>:493:
warning: no @param for indexedKey
[ERROR]     protected String findMessage(Class clazz, String key, String indexedKey, Locale
locale, Object[] args, Set<String> checked,
[ERROR]                      ^
[ERROR] <https://builds.apache.org/job/Struts-master-JDK11/ws/core/src/main/java/com/opensymphony/xwork2/util/AbstractLocalizedTextProvider.java>:493:
warning: no @param for locale
[ERROR]     protected String findMessage(Class clazz, String key, String indexedKey, Locale
locale, Object[] args, Set<String> checked,
[ERROR]                      ^
[ERROR] <https://builds.apache.org/job/Struts-master-JDK11/ws/core/src/main/java/com/opensymphony/xwork2/util/AbstractLocalizedTextProvider.java>:493:
warning: no @param for args
[ERROR]     protected String findMessage(Class clazz, String key, String indexedKey, Locale
locale, Object[] args, Set<String> checked,
[ERROR]                      ^
[ERROR] <https://builds.apache.org/job/Struts-master-JDK11/ws/core/src/main/java/com/opensymphony/xwork2/util/AbstractLocalizedTextProvider.java>:493:
warning: no @param for checked
[ERROR]     protected String findMessage(Class clazz, String key, String indexedKey, Locale
locale, Object[] args, Set<String> checked,
[ERROR]                      ^
[ERROR] <https://builds.apache.org/job/Struts-master-JDK11/ws/core/src/main/java/com/opensymphony/xwork2/util/AbstractLocalizedTextProvider.java>:493:
warning: no @param for valueStack
[ERROR]     protected String findMessage(Class clazz, String key, String indexedKey, Locale
locale, Object[] args, Set<String> checked,
[ERROR]                      ^
[ERROR] <https://builds.apache.org/job/Struts-master-JDK11/ws/core/src/main/java/com/opensymphony/xwork2/util/AbstractLocalizedTextProvider.java>:351:
error: tag not supported in the generated HTML version: tt
[ERROR]      * @return the bundle, <tt>null</tt> if not found.
[ERROR]                            ^
[ERROR] <https://builds.apache.org/job/Struts-master-JDK11/ws/core/src/main/java/com/opensymphony/xwork2/util/AbstractLocalizedTextProvider.java>:436:
warning: no @param for key
[ERROR]     protected GetDefaultMessageReturnArg getDefaultMessage(String key, Locale locale,
ValueStack valueStack, Object[] args,
[ERROR]                                          ^
[ERROR] <https://builds.apache.org/job/Struts-master-JDK11/ws/core/src/main/java/com/opensymphony/xwork2/util/AbstractLocalizedTextProvider.java>:436:
warning: no @param for locale
[ERROR]     protected GetDefaultMessageReturnArg getDefaultMessage(String key, Locale locale,
ValueStack valueStack, Object[] args,
[ERROR]                                          ^
[ERROR] <https://builds.apache.org/job/Struts-master-JDK11/ws/core/src/main/java/com/opensymphony/xwork2/util/AbstractLocalizedTextProvider.java>:436:
warning: no @param for valueStack
[ERROR]     protected GetDefaultMessageReturnArg getDefaultMessage(String key, Locale locale,
ValueStack valueStack, Object[] args,
[ERROR]                                          ^
[ERROR] <https://builds.apache.org/job/Struts-master-JDK11/ws/core/src/main/java/com/opensymphony/xwork2/util/AbstractLocalizedTextProvider.java>:436:
warning: no @param for args
[ERROR]     protected GetDefaultMessageReturnArg getDefaultMessage(String key, Locale locale,
ValueStack valueStack, Object[] args,
[ERROR]                                          ^
[ERROR] <https://builds.apache.org/job/Struts-master-JDK11/ws/core/src/main/java/com/opensymphony/xwork2/util/AbstractLocalizedTextProvider.java>:436:
warning: no @param for defaultMessage
[ERROR]     protected GetDefaultMessageReturnArg getDefaultMessage(String key, Locale locale,
ValueStack valueStack, Object[] args,
[ERROR]                                          ^
[ERROR] <https://builds.apache.org/job/Struts-master-JDK11/ws/core/src/main/java/com/opensymphony/xwork2/util/AbstractLocalizedTextProvider.java>:464:
warning: no @param for bundleName
[ERROR]     protected String getMessage(String bundleName, Locale locale, String key, ValueStack
valueStack, Object[] args) {
[ERROR]                      ^
[ERROR] <https://builds.apache.org/job/Struts-master-JDK11/ws/core/src/main/java/com/opensymphony/xwork2/util/AbstractLocalizedTextProvider.java>:464:
warning: no @param for locale
[ERROR]     protected String getMessage(String bundleName, Locale locale, String key, ValueStack
valueStack, Object[] args) {
[ERROR]                      ^
[ERROR] <https://builds.apache.org/job/Struts-master-JDK11/ws/core/src/main/java/com/opensymphony/xwork2/util/AbstractLocalizedTextProvider.java>:464:
warning: no @param for key
[ERROR]     protected String getMessage(String bundleName, Locale locale, String key, ValueStack
valueStack, Object[] args) {
[ERROR]                      ^
[ERROR] <https://builds.apache.org/job/Struts-master-JDK11/ws/core/src/main/java/com/opensymphony/xwork2/util/AbstractLocalizedTextProvider.java>:464:
warning: no @param for valueStack
[ERROR]     protected String getMessage(String bundleName, Locale locale, String key, ValueStack
valueStack, Object[] args) {
[ERROR]                      ^
[ERROR] <https://builds.apache.org/job/Struts-master-JDK11/ws/core/src/main/java/com/opensymphony/xwork2/util/AbstractLocalizedTextProvider.java>:464:
warning: no @param for args
[ERROR]     protected String getMessage(String bundleName, Locale locale, String key, ValueStack
valueStack, Object[] args) {
[ERROR]                      ^
[ERROR] <https://builds.apache.org/job/Struts-master-JDK11/ws/core/src/main/java/com/opensymphony/xwork2/util/AbstractLocalizedTextProvider.java>:405:
error: tag not supported in the generated HTML version: tt
[ERROR]      * @return <tt>true</tt> if we could <b>not</b> find the
text, <tt>false</tt> if the text was found (=success).
[ERROR]                ^
[ERROR] <https://builds.apache.org/job/Struts-master-JDK11/ws/core/src/main/java/com/opensymphony/xwork2/util/AbstractLocalizedTextProvider.java>:405:
error: tag not supported in the generated HTML version: tt
[ERROR]      * @return <tt>true</tt> if we could <b>not</b> find the
text, <tt>false</tt> if the text was found (=success).
[ERROR]                                                                    ^
[ERROR] <https://builds.apache.org/job/Struts-master-JDK11/ws/core/src/main/java/com/opensymphony/xwork2/util/Key.java>:75:
error: tag not supported in the generated HTML version: tt
[ERROR]      * @return The Key value. Defaults to <tt>java.lang.Object.class</tt>.
[ERROR]                                           ^
[ERROR] <https://builds.apache.org/job/Struts-master-JDK11/ws/core/src/main/java/com/opensymphony/xwork2/util/KeyProperty.java>:77:
error: tag not supported in the generated HTML version: tt
[ERROR]      * @return The KeyProperty value. Defaults to the <tt>id</tt> attribute.
[ERROR]                                                       ^
[ERROR] <https://builds.apache.org/job/Struts-master-JDK11/ws/core/src/main/java/com/opensymphony/xwork2/util/ProxyUtil.java>:71:
warning: no @return
[ERROR]     public static boolean isProxy(Object object) {
[ERROR]                           ^
[ERROR] <https://builds.apache.org/job/Struts-master-JDK11/ws/core/src/main/java/com/opensymphony/xwork2/util/ProxyUtil.java>:89:
warning: no @return
[ERROR]     public static boolean isProxyMember(Member member, Object object) {
[ERROR]                           ^
[ERROR] <https://builds.apache.org/job/Struts-master-JDK11/ws/core/src/main/java/com/opensymphony/xwork2/util/StrutsLocalizedTextProvider.java>:64:
error: tag not supported in the generated HTML version: tt
[ERROR]      * @param defaultLocale The locale to use if localeStr is <tt>null</tt>.
[ERROR]                                                               ^
[ERROR] <https://builds.apache.org/job/Struts-master-JDK11/ws/core/src/main/java/com/opensymphony/xwork2/validator/ActionValidatorManager.java>:35:
error: tag not supported in the generated HTML version: tt
[ERROR]      * @param context the context of the action class - can be <tt>null</tt>.
[ERROR]                                                                ^
[ERROR] <https://builds.apache.org/job/Struts-master-JDK11/ws/core/src/main/java/com/opensymphony/xwork2/validator/ActionValidatorManager.java>:36:
error: tag not supported in the generated HTML version: tt
[ERROR]      * @param method the name of the method being invoked on the action - can be <tt>null</tt>.
[ERROR]                                                                                  ^
[ERROR] <https://builds.apache.org/job/Struts-master-JDK11/ws/core/src/main/java/com/opensymphony/xwork2/validator/DelegatingValidatorContext.java>:62:
warning: no @param for textProviderFactory
[ERROR]     public DelegatingValidatorContext(Object object, TextProviderFactory textProviderFactory)
{
[ERROR]            ^
[ERROR] <https://builds.apache.org/job/Struts-master-JDK11/ws/core/src/main/java/org/apache/struts2/dispatcher/HttpParameters.java>:73:
warning: no @return
[ERROR]     public Map<String, String[]> toMap() {
[ERROR]                                  ^
[ERROR] <https://builds.apache.org/job/Struts-master-JDK11/ws/core/src/main/java/org/apache/struts2/dispatcher/filter/StrutsPrepareAndExecuteFilter.java>:92:
warning: no @param for dispatcher
[ERROR]     protected PrepareOperations createPrepareOperations(Dispatcher dispatcher) {
[ERROR]                                 ^
[ERROR] <https://builds.apache.org/job/Struts-master-JDK11/ws/core/src/main/java/org/apache/struts2/dispatcher/filter/StrutsPrepareAndExecuteFilter.java>:102:
warning: no @param for dispatcher
[ERROR]     protected ExecuteOperations createExecuteOperations(Dispatcher dispatcher) {
[ERROR]                                 ^
[ERROR] <https://builds.apache.org/job/Struts-master-JDK11/ws/core/src/main/java/org/apache/struts2/dispatcher/multipart/JakartaStreamMultiPartRequest.java>:199:
warning: no description for @throws
[ERROR]      * @throws Exception
[ERROR]        ^
[ERROR] Please file a bug against the javadoc tool via the Java bug reporting page
[ERROR] (http://bugreport.java.com) after checking the Bug Database (http://bugs.java.com)
[ERROR] for duplicates. Include error messages and the following diagnostic in your report.
Thank you.
[ERROR] java.lang.ClassCastException: class com.sun.tools.javac.code.Symtab$6 cannot be cast
to class com.sun.tools.javac.code.Symbol$ClassSymbol (com.sun.tools.javac.code.Symtab$6 and
com.sun.tools.javac.code.Symbol$ClassSymbol are in module jdk.compiler of loader 'app')
[ERROR] 	at jdk.compiler/com.sun.tools.javac.code.Symbol.outermostClass(Symbol.java:490)
[ERROR] 	at jdk.javadoc/jdk.javadoc.internal.tool.ToolEnvironment.getFileKind(ToolEnvironment.java:196)
[ERROR] 	at jdk.javadoc/jdk.javadoc.internal.tool.ElementsTable.isTypeElementSelected(ElementsTable.java:985)
[ERROR] 	at jdk.javadoc/jdk.javadoc.internal.tool.ElementsTable$IncludedVisitor.visitType(ElementsTable.java:1062)
[ERROR] 	at jdk.javadoc/jdk.javadoc.internal.tool.ElementsTable$IncludedVisitor.visitType(ElementsTable.java:1038)
[ERROR] 	at jdk.compiler/com.sun.tools.javac.code.Symbol$ClassSymbol.accept(Symbol.java:1447)
[ERROR] 	at java.compiler@11.0.1/javax.lang.model.util.AbstractElementVisitor6.visit(AbstractElementVisitor6.java:106)
[ERROR] 	at jdk.javadoc/jdk.javadoc.internal.tool.ElementsTable.isIncluded(ElementsTable.java:334)
[ERROR] 	at jdk.javadoc/jdk.javadoc.internal.tool.DocEnvImpl.isIncluded(DocEnvImpl.java:85)
[ERROR] 	at jdk.javadoc/jdk.javadoc.internal.doclets.toolkit.util.Utils.isIncluded(Utils.java:2685)
[ERROR] 	at jdk.javadoc/jdk.javadoc.internal.doclets.formats.html.LinkFactoryImpl.getClassLink(LinkFactoryImpl.java:95)
[ERROR] 	at jdk.javadoc/jdk.javadoc.internal.doclets.toolkit.util.links.LinkFactory.getLink(LinkFactory.java:194)
[ERROR] 	at jdk.javadoc/jdk.javadoc.internal.doclets.formats.html.HtmlDocletWriter.getLink(HtmlDocletWriter.java:679)
[ERROR] 	at jdk.javadoc/jdk.javadoc.internal.doclets.formats.html.HtmlDocletWriter.seeTagToContent(HtmlDocletWriter.java:1060)
[ERROR] 	at jdk.javadoc/jdk.javadoc.internal.doclets.formats.html.HtmlDocletWriter$2.visitLink(HtmlDocletWriter.java:1463)
[ERROR] 	at jdk.javadoc/jdk.javadoc.internal.doclets.formats.html.HtmlDocletWriter$2.visitLink(HtmlDocletWriter.java:1324)
[ERROR] 	at jdk.compiler/com.sun.tools.javac.tree.DCTree$DCLink.accept(DCTree.java:538)
[ERROR] 	at jdk.compiler/com.sun.source.util.SimpleDocTreeVisitor.visit(SimpleDocTreeVisitor.java:79)
[ERROR] 	at jdk.javadoc/jdk.javadoc.internal.doclets.formats.html.HtmlDocletWriter.commentTagsToContent(HtmlDocletWriter.java:1539)
[ERROR] 	at jdk.javadoc/jdk.javadoc.internal.doclets.formats.html.HtmlDocletWriter.addCommentTags(HtmlDocletWriter.java:1229)
[ERROR] 	at jdk.javadoc/jdk.javadoc.internal.doclets.formats.html.HtmlDocletWriter.addCommentTags(HtmlDocletWriter.java:1210)
[ERROR] 	at jdk.javadoc/jdk.javadoc.internal.doclets.formats.html.HtmlDocletWriter.addSummaryComment(HtmlDocletWriter.java:1180)
[ERROR] 	at jdk.javadoc/jdk.javadoc.internal.doclets.formats.html.SubWriterHolderWriter.addIndexComment(SubWriterHolderWriter.java:135)
[ERROR] 	at jdk.javadoc/jdk.javadoc.internal.doclets.formats.html.SubWriterHolderWriter.addSummaryLinkComment(SubWriterHolderWriter.java:160)
[ERROR] 	at jdk.javadoc/jdk.javadoc.internal.doclets.formats.html.AbstractMemberWriter.addMemberSummary(AbstractMemberWriter.java:488)
[ERROR] 	at jdk.javadoc/jdk.javadoc.internal.doclets.toolkit.builders.MemberSummaryBuilder.buildSummary(MemberSummaryBuilder.java:332)
[ERROR] 	at jdk.javadoc/jdk.javadoc.internal.doclets.toolkit.builders.MemberSummaryBuilder.addSummary(MemberSummaryBuilder.java:495)
[ERROR] 	at jdk.javadoc/jdk.javadoc.internal.doclets.toolkit.builders.MemberSummaryBuilder.buildMethodsSummary(MemberSummaryBuilder.java:288)
[ERROR] 	at jdk.javadoc/jdk.javadoc.internal.doclets.toolkit.builders.MemberSummaryBuilder$1.build(MemberSummaryBuilder.java:112)
[ERROR] 	at jdk.javadoc/jdk.javadoc.internal.doclets.toolkit.builders.ClassBuilder.buildMemberSummary(ClassBuilder.java:324)
[ERROR] 	at jdk.javadoc/jdk.javadoc.internal.doclets.toolkit.builders.ClassBuilder.buildClassDoc(ClassBuilder.java:144)
[ERROR] 	at jdk.javadoc/jdk.javadoc.internal.doclets.toolkit.builders.ClassBuilder.build(ClassBuilder.java:120)
[ERROR] 	at jdk.javadoc/jdk.javadoc.internal.doclets.formats.html.HtmlDoclet.generateClassFiles(HtmlDoclet.java:266)
[ERROR] 	at jdk.javadoc/jdk.javadoc.internal.doclets.toolkit.AbstractDoclet.generateClassFiles(AbstractDoclet.java:273)
[ERROR] 	at jdk.javadoc/jdk.javadoc.internal.doclets.toolkit.AbstractDoclet.startGeneration(AbstractDoclet.java:207)
[ERROR] 	at jdk.javadoc/jdk.javadoc.internal.doclets.toolkit.AbstractDoclet.run(AbstractDoclet.java:114)
[ERROR] 	at jdk.javadoc/jdk.javadoc.doclet.StandardDoclet.run(StandardDoclet.java:72)
[ERROR] 	at jdk.javadoc/jdk.javadoc.internal.tool.Start.parseAndExecute(Start.java:582)
[ERROR] 	at jdk.javadoc/jdk.javadoc.internal.tool.Start.begin(Start.java:431)
[ERROR] 	at jdk.javadoc/jdk.javadoc.internal.tool.Start.begin(Start.java:344)
[ERROR] 	at jdk.javadoc/jdk.javadoc.internal.tool.Main.execute(Main.java:63)
[ERROR] 	at jdk.javadoc/jdk.javadoc.internal.tool.Main.main(Main.java:52)
[ERROR] 
[ERROR] Command line was: /home/jenkins/tools/java/latest11/bin/javadoc @options @packages
[ERROR] 
[ERROR] Refer to the generated Javadoc files in '<https://builds.apache.org/job/Struts-master-JDK11/ws/core/target/apidocs'>
dir.
[ERROR] 
[ERROR] -> [Help 1]
[ERROR] 
[ERROR] To see the full stack trace of the errors, re-run Maven with the -e switch.
[ERROR] Re-run Maven using the -X switch to enable full debug logging.
[ERROR] 
[ERROR] For more information about the errors and possible solutions, please read the following
articles:
[ERROR] [Help 1] http://cwiki.apache.org/confluence/display/MAVEN/MojoExecutionException
[ERROR] 
[ERROR] After correcting the problems, you can resume the build with the command
[ERROR]   mvn <goals> -rf :struts2-core
Build step 'Execute shell' marked build as failure
[locks-and-latches] Releasing all the locks
[locks-and-latches] All the locks released
Setting MAVEN_3_LATEST__HOME=/home/jenkins/tools/maven/latest3/

---------------------------------------------------------------------
To unsubscribe, e-mail: dev-unsubscribe@struts.apache.org
For additional commands, e-mail: dev-help@struts.apache.org


Mime
View raw message