struts-dev mailing list archives

Site index · List index
Message view « Date » · « Thread »
Top « Date » · « Thread »
From Apache Jenkins Server <jenk...@builds.apache.org>
Subject Build failed in Jenkins: Struts-master-JDK11 #2
Date Sun, 11 Nov 2018 08:57:03 GMT
See <https://builds.apache.org/job/Struts-master-JDK11/2/display/redirect?page=changes>

Changes:

[lukaszlenart] WW-4866 Includes 1.8+ JDKs

------------------------------------------
[...truncated 70.64 KB...]
Generating <https://builds.apache.org/job/Struts-master-JDK11/ws/core/target/apidocs/org/apache/struts2/ServletActionContext.html...>
Generating <https://builds.apache.org/job/Struts-master-JDK11/ws/core/target/apidocs/org/apache/struts2/StrutsConstants.html...>
Generating <https://builds.apache.org/job/Struts-master-JDK11/ws/core/target/apidocs/org/apache/struts2/StrutsException.html...>
Generating <https://builds.apache.org/job/Struts-master-JDK11/ws/core/target/apidocs/org/apache/struts2/StrutsStatics.html...>
Generating <https://builds.apache.org/job/Struts-master-JDK11/ws/core/target/apidocs/org/apache/struts2/action/ApplicationAware.html...>
Generating <https://builds.apache.org/job/Struts-master-JDK11/ws/core/target/apidocs/org/apache/struts2/action/CookiesAware.html...>
Generating <https://builds.apache.org/job/Struts-master-JDK11/ws/core/target/apidocs/org/apache/struts2/action/ParametersAware.html...>
Generating <https://builds.apache.org/job/Struts-master-JDK11/ws/core/target/apidocs/org/apache/struts2/action/PrincipalAware.html...>
Generating <https://builds.apache.org/job/Struts-master-JDK11/ws/core/target/apidocs/org/apache/struts2/action/ServletContextAware.html...>
Generating <https://builds.apache.org/job/Struts-master-JDK11/ws/core/target/apidocs/org/apache/struts2/action/ServletRequestAware.html...>
Generating <https://builds.apache.org/job/Struts-master-JDK11/ws/core/target/apidocs/org/apache/struts2/action/ServletResponseAware.html...>
Generating <https://builds.apache.org/job/Struts-master-JDK11/ws/core/target/apidocs/org/apache/struts2/action/SessionAware.html...>
Generating <https://builds.apache.org/job/Struts-master-JDK11/ws/core/target/apidocs/org/apache/struts2/components/ActionComponent.html...>
Generating <https://builds.apache.org/job/Struts-master-JDK11/ws/core/target/apidocs/org/apache/struts2/components/ActionError.html...>
Generating <https://builds.apache.org/job/Struts-master-JDK11/ws/core/target/apidocs/org/apache/struts2/components/ActionMessage.html...>
Generating <https://builds.apache.org/job/Struts-master-JDK11/ws/core/target/apidocs/org/apache/struts2/components/Anchor.html...>
Generating <https://builds.apache.org/job/Struts-master-JDK11/ws/core/target/apidocs/org/apache/struts2/components/AppendIterator.html...>
Generating <https://builds.apache.org/job/Struts-master-JDK11/ws/core/target/apidocs/org/apache/struts2/components/Bean.html...>
Generating <https://builds.apache.org/job/Struts-master-JDK11/ws/core/target/apidocs/org/apache/struts2/components/Checkbox.html...>
Generating <https://builds.apache.org/job/Struts-master-JDK11/ws/core/target/apidocs/org/apache/struts2/components/CheckboxList.html...>
Generating <https://builds.apache.org/job/Struts-master-JDK11/ws/core/target/apidocs/org/apache/struts2/components/ClosingUIBean.html...>
Generating <https://builds.apache.org/job/Struts-master-JDK11/ws/core/target/apidocs/org/apache/struts2/components/ComboBox.html...>
Generating <https://builds.apache.org/job/Struts-master-JDK11/ws/core/target/apidocs/org/apache/struts2/components/Component.html...>
Generating <https://builds.apache.org/job/Struts-master-JDK11/ws/core/target/apidocs/org/apache/struts2/components/ComponentUrlProvider.html...>
Generating <https://builds.apache.org/job/Struts-master-JDK11/ws/core/target/apidocs/org/apache/struts2/components/ContextBean.html...>
Generating <https://builds.apache.org/job/Struts-master-JDK11/ws/core/target/apidocs/org/apache/struts2/components/Date.html...>
Generating <https://builds.apache.org/job/Struts-master-JDK11/ws/core/target/apidocs/org/apache/struts2/components/DateTextField.html...>
Generating <https://builds.apache.org/job/Struts-master-JDK11/ws/core/target/apidocs/org/apache/struts2/components/Debug.html...>
Generating <https://builds.apache.org/job/Struts-master-JDK11/ws/core/target/apidocs/org/apache/struts2/components/DoubleListUIBean.html...>
Generating <https://builds.apache.org/job/Struts-master-JDK11/ws/core/target/apidocs/org/apache/struts2/components/DoubleSelect.html...>
Generating <https://builds.apache.org/job/Struts-master-JDK11/ws/core/target/apidocs/org/apache/struts2/components/Else.html...>
Generating <https://builds.apache.org/job/Struts-master-JDK11/ws/core/target/apidocs/org/apache/struts2/components/ElseIf.html...>
Generating <https://builds.apache.org/job/Struts-master-JDK11/ws/core/target/apidocs/org/apache/struts2/components/ExtraParameterProvider.html...>
Generating <https://builds.apache.org/job/Struts-master-JDK11/ws/core/target/apidocs/org/apache/struts2/components/FieldError.html...>
Generating <https://builds.apache.org/job/Struts-master-JDK11/ws/core/target/apidocs/org/apache/struts2/components/File.html...>
Generating <https://builds.apache.org/job/Struts-master-JDK11/ws/core/target/apidocs/org/apache/struts2/components/Form.html...>
Generating <https://builds.apache.org/job/Struts-master-JDK11/ws/core/target/apidocs/org/apache/struts2/components/Form.FieldVisitorValidatorWrapper.html...>
Generating <https://builds.apache.org/job/Struts-master-JDK11/ws/core/target/apidocs/org/apache/struts2/components/FormButton.html...>
Generating <https://builds.apache.org/job/Struts-master-JDK11/ws/core/target/apidocs/org/apache/struts2/components/GenericUIBean.html...>
Generating <https://builds.apache.org/job/Struts-master-JDK11/ws/core/target/apidocs/org/apache/struts2/components/Head.html...>
Generating <https://builds.apache.org/job/Struts-master-JDK11/ws/core/target/apidocs/org/apache/struts2/components/Hidden.html...>
Generating <https://builds.apache.org/job/Struts-master-JDK11/ws/core/target/apidocs/org/apache/struts2/components/I18n.html...>
Generating <https://builds.apache.org/job/Struts-master-JDK11/ws/core/target/apidocs/org/apache/struts2/components/If.html...>
Generating <https://builds.apache.org/job/Struts-master-JDK11/ws/core/target/apidocs/org/apache/struts2/components/Include.html...>
Generating <https://builds.apache.org/job/Struts-master-JDK11/ws/core/target/apidocs/org/apache/struts2/components/InputTransferSelect.html...>
Generating <https://builds.apache.org/job/Struts-master-JDK11/ws/core/target/apidocs/org/apache/struts2/components/IteratorComponent.html...>
Generating <https://builds.apache.org/job/Struts-master-JDK11/ws/core/target/apidocs/org/apache/struts2/components/Label.html...>
Generating <https://builds.apache.org/job/Struts-master-JDK11/ws/core/target/apidocs/org/apache/struts2/components/ListUIBean.html...>
Generating <https://builds.apache.org/job/Struts-master-JDK11/ws/core/target/apidocs/org/apache/struts2/components/MergeIterator.html...>
Generating <https://builds.apache.org/job/Struts-master-JDK11/ws/core/target/apidocs/org/apache/struts2/components/Number.html...>
Generating <https://builds.apache.org/job/Struts-master-JDK11/ws/core/target/apidocs/org/apache/struts2/components/OptGroup.html...>
Generating <https://builds.apache.org/job/Struts-master-JDK11/ws/core/target/apidocs/org/apache/struts2/components/OptionTransferSelect.html...>
Generating <https://builds.apache.org/job/Struts-master-JDK11/ws/core/target/apidocs/org/apache/struts2/components/Param.html...>
Generating <https://builds.apache.org/job/Struts-master-JDK11/ws/core/target/apidocs/org/apache/struts2/components/Param.UnnamedParametric.html...>
Generating <https://builds.apache.org/job/Struts-master-JDK11/ws/core/target/apidocs/org/apache/struts2/components/Password.html...>
Generating <https://builds.apache.org/job/Struts-master-JDK11/ws/core/target/apidocs/org/apache/struts2/components/Property.html...>
Generating <https://builds.apache.org/job/Struts-master-JDK11/ws/core/target/apidocs/org/apache/struts2/components/Push.html...>
Generating <https://builds.apache.org/job/Struts-master-JDK11/ws/core/target/apidocs/org/apache/struts2/components/Radio.html...>
Generating <https://builds.apache.org/job/Struts-master-JDK11/ws/core/target/apidocs/org/apache/struts2/components/Reset.html...>
Generating <https://builds.apache.org/job/Struts-master-JDK11/ws/core/target/apidocs/org/apache/struts2/components/Select.html...>
Generating <https://builds.apache.org/job/Struts-master-JDK11/ws/core/target/apidocs/org/apache/struts2/components/ServletUrlRenderer.html...>
Generating <https://builds.apache.org/job/Struts-master-JDK11/ws/core/target/apidocs/org/apache/struts2/components/Set.html...>
Generating <https://builds.apache.org/job/Struts-master-JDK11/ws/core/target/apidocs/org/apache/struts2/components/Submit.html...>
Generating <https://builds.apache.org/job/Struts-master-JDK11/ws/core/target/apidocs/org/apache/struts2/components/Text.html...>
Generating <https://builds.apache.org/job/Struts-master-JDK11/ws/core/target/apidocs/org/apache/struts2/components/TextArea.html...>
Generating <https://builds.apache.org/job/Struts-master-JDK11/ws/core/target/apidocs/org/apache/struts2/components/TextField.html...>
Generating <https://builds.apache.org/job/Struts-master-JDK11/ws/core/target/apidocs/org/apache/struts2/components/Token.html...>
Generating <https://builds.apache.org/job/Struts-master-JDK11/ws/core/target/apidocs/org/apache/struts2/components/UIBean.html...>
Generating <https://builds.apache.org/job/Struts-master-JDK11/ws/core/target/apidocs/org/apache/struts2/components/UpDownSelect.html...>
Generating <https://builds.apache.org/job/Struts-master-JDK11/ws/core/target/apidocs/org/apache/struts2/components/URL.html...>
Generating <https://builds.apache.org/job/Struts-master-JDK11/ws/core/target/apidocs/org/apache/struts2/components/UrlProvider.html...>
Generating <https://builds.apache.org/job/Struts-master-JDK11/ws/core/target/apidocs/org/apache/struts2/components/UrlRenderer.html...>
Generating <https://builds.apache.org/job/Struts-master-JDK11/ws/core/target/apidocs/org/apache/struts2/components/template/BaseTemplateEngine.html...>
Generating <https://builds.apache.org/job/Struts-master-JDK11/ws/core/target/apidocs/org/apache/struts2/components/template/FreemarkerTemplateEngine.html...>
Generating <https://builds.apache.org/job/Struts-master-JDK11/ws/core/target/apidocs/org/apache/struts2/components/template/JspTemplateEngine.html...>
Generating <https://builds.apache.org/job/Struts-master-JDK11/ws/core/target/apidocs/org/apache/struts2/components/template/Template.html...>
Generating <https://builds.apache.org/job/Struts-master-JDK11/ws/core/target/apidocs/org/apache/struts2/components/template/TemplateEngine.html...>
Generating <https://builds.apache.org/job/Struts-master-JDK11/ws/core/target/apidocs/org/apache/struts2/components/template/TemplateEngineManager.html...>
Generating <https://builds.apache.org/job/Struts-master-JDK11/ws/core/target/apidocs/org/apache/struts2/components/template/TemplateRenderingContext.html...>
Generating <https://builds.apache.org/job/Struts-master-JDK11/ws/core/target/apidocs/org/apache/struts2/components/template/VelocityTemplateEngine.html...>
Generating <https://builds.apache.org/job/Struts-master-JDK11/ws/core/target/apidocs/org/apache/struts2/config/AbstractBeanSelectionProvider.html...>
Generating <https://builds.apache.org/job/Struts-master-JDK11/ws/core/target/apidocs/org/apache/struts2/config/DefaultBeanSelectionProvider.html...>
Generating <https://builds.apache.org/job/Struts-master-JDK11/ws/core/target/apidocs/org/apache/struts2/config/DefaultPropertiesProvider.html...>
Generating <https://builds.apache.org/job/Struts-master-JDK11/ws/core/target/apidocs/org/apache/struts2/config/DefaultSettings.html...>
Generating <https://builds.apache.org/job/Struts-master-JDK11/ws/core/target/apidocs/org/apache/struts2/config/NullResult.html...>
Generating <https://builds.apache.org/job/Struts-master-JDK11/ws/core/target/apidocs/org/apache/struts2/config/PropertiesConfigurationProvider.html...>
Generating <https://builds.apache.org/job/Struts-master-JDK11/ws/core/target/apidocs/org/apache/struts2/config/StrutsJavaConfiguration.html...>
Generating <https://builds.apache.org/job/Struts-master-JDK11/ws/core/target/apidocs/org/apache/struts2/config/StrutsJavaConfigurationProvider.html...>
Generating <https://builds.apache.org/job/Struts-master-JDK11/ws/core/target/apidocs/org/apache/struts2/config/StrutsXmlConfigurationProvider.html...>
Generating <https://builds.apache.org/job/Struts-master-JDK11/ws/core/target/apidocs/org/apache/struts2/config/entities/BeanConfig.html...>
Generating <https://builds.apache.org/job/Struts-master-JDK11/ws/core/target/apidocs/org/apache/struts2/config/entities/ConstantConfig.html...>
Generating <https://builds.apache.org/job/Struts-master-JDK11/ws/core/target/apidocs/org/apache/struts2/conversion/UploadedFileConverter.html...>
Generating <https://builds.apache.org/job/Struts-master-JDK11/ws/core/target/apidocs/org/apache/struts2/dispatcher/ApplicationMap.html...>
Generating <https://builds.apache.org/job/Struts-master-JDK11/ws/core/target/apidocs/org/apache/struts2/dispatcher/DefaultActionSupport.html...>
Generating <https://builds.apache.org/job/Struts-master-JDK11/ws/core/target/apidocs/org/apache/struts2/dispatcher/DefaultDispatcherErrorHandler.html...>
Generating <https://builds.apache.org/job/Struts-master-JDK11/ws/core/target/apidocs/org/apache/struts2/dispatcher/DefaultStaticContentLoader.html...>
Generating <https://builds.apache.org/job/Struts-master-JDK11/ws/core/target/apidocs/org/apache/struts2/dispatcher/Dispatcher.html...>
Generating <https://builds.apache.org/job/Struts-master-JDK11/ws/core/target/apidocs/org/apache/struts2/dispatcher/Dispatcher.Locator.html...>
Generating <https://builds.apache.org/job/Struts-master-JDK11/ws/core/target/apidocs/org/apache/struts2/dispatcher/DispatcherErrorHandler.html...>
Generating <https://builds.apache.org/job/Struts-master-JDK11/ws/core/target/apidocs/org/apache/struts2/dispatcher/DispatcherListener.html...>
Generating <https://builds.apache.org/job/Struts-master-JDK11/ws/core/target/apidocs/org/apache/struts2/dispatcher/ExecuteOperations.html...>
Generating <https://builds.apache.org/job/Struts-master-JDK11/ws/core/target/apidocs/org/apache/struts2/dispatcher/HostConfig.html...>
Generating <https://builds.apache.org/job/Struts-master-JDK11/ws/core/target/apidocs/org/apache/struts2/dispatcher/HttpParameters.html...>
Generating <https://builds.apache.org/job/Struts-master-JDK11/ws/core/target/apidocs/org/apache/struts2/dispatcher/HttpParameters.Builder.html...>
Generating <https://builds.apache.org/job/Struts-master-JDK11/ws/core/target/apidocs/org/apache/struts2/dispatcher/InitOperations.html...>
Generating <https://builds.apache.org/job/Struts-master-JDK11/ws/core/target/apidocs/org/apache/struts2/dispatcher/LocalizedMessage.html...>
Generating <https://builds.apache.org/job/Struts-master-JDK11/ws/core/target/apidocs/org/apache/struts2/dispatcher/MockDispatcher.html...>
Generating <https://builds.apache.org/job/Struts-master-JDK11/ws/core/target/apidocs/org/apache/struts2/dispatcher/Parameter.html...>
Generating <https://builds.apache.org/job/Struts-master-JDK11/ws/core/target/apidocs/org/apache/struts2/dispatcher/Parameter.Empty.html...>
Generating <https://builds.apache.org/job/Struts-master-JDK11/ws/core/target/apidocs/org/apache/struts2/dispatcher/Parameter.File.html...>
Generating <https://builds.apache.org/job/Struts-master-JDK11/ws/core/target/apidocs/org/apache/struts2/dispatcher/Parameter.Request.html...>
Generating <https://builds.apache.org/job/Struts-master-JDK11/ws/core/target/apidocs/org/apache/struts2/dispatcher/PrepareOperations.html...>
Generating <https://builds.apache.org/job/Struts-master-JDK11/ws/core/target/apidocs/org/apache/struts2/dispatcher/RequestMap.html...>
Generating <https://builds.apache.org/job/Struts-master-JDK11/ws/core/target/apidocs/org/apache/struts2/dispatcher/SessionMap.html...>
Generating <https://builds.apache.org/job/Struts-master-JDK11/ws/core/target/apidocs/org/apache/struts2/dispatcher/StaticContentLoader.html...>
Generating <https://builds.apache.org/job/Struts-master-JDK11/ws/core/target/apidocs/org/apache/struts2/dispatcher/StrutsRequestWrapper.html...>
Generating <https://builds.apache.org/job/Struts-master-JDK11/ws/core/target/apidocs/org/apache/struts2/dispatcher/filter/FilterHostConfig.html...>
Generating <https://builds.apache.org/job/Struts-master-JDK11/ws/core/target/apidocs/org/apache/struts2/dispatcher/filter/StrutsExecuteFilter.html...>
Generating <https://builds.apache.org/job/Struts-master-JDK11/ws/core/target/apidocs/org/apache/struts2/dispatcher/filter/StrutsPrepareAndExecuteFilter.html...>
Generating <https://builds.apache.org/job/Struts-master-JDK11/ws/core/target/apidocs/org/apache/struts2/dispatcher/filter/StrutsPrepareFilter.html...>
Generating <https://builds.apache.org/job/Struts-master-JDK11/ws/core/target/apidocs/org/apache/struts2/dispatcher/listener/ListenerHostConfig.html...>
Generating <https://builds.apache.org/job/Struts-master-JDK11/ws/core/target/apidocs/org/apache/struts2/dispatcher/listener/StrutsListener.html...>
Generating <https://builds.apache.org/job/Struts-master-JDK11/ws/core/target/apidocs/org/apache/struts2/dispatcher/mapper/ActionMapper.html...>
Generating <https://builds.apache.org/job/Struts-master-JDK11/ws/core/target/apidocs/org/apache/struts2/dispatcher/mapper/ActionMapping.html...>
Generating <https://builds.apache.org/job/Struts-master-JDK11/ws/core/target/apidocs/org/apache/struts2/dispatcher/mapper/CompositeActionMapper.html...>
Generating <https://builds.apache.org/job/Struts-master-JDK11/ws/core/target/apidocs/org/apache/struts2/dispatcher/mapper/DefaultActionMapper.html...>
Generating <https://builds.apache.org/job/Struts-master-JDK11/ws/core/target/apidocs/org/apache/struts2/dispatcher/mapper/ParameterAction.html...>
Generating <https://builds.apache.org/job/Struts-master-JDK11/ws/core/target/apidocs/org/apache/struts2/dispatcher/mapper/PrefixBasedActionMapper.html...>
Generating <https://builds.apache.org/job/Struts-master-JDK11/ws/core/target/apidocs/org/apache/struts2/dispatcher/mapper/Restful2ActionMapper.html...>
Generating <https://builds.apache.org/job/Struts-master-JDK11/ws/core/target/apidocs/org/apache/struts2/dispatcher/mapper/RestfulActionMapper.html...>
Generating <https://builds.apache.org/job/Struts-master-JDK11/ws/core/target/apidocs/org/apache/struts2/dispatcher/multipart/AbstractMultiPartRequest.html...>
Generating <https://builds.apache.org/job/Struts-master-JDK11/ws/core/target/apidocs/org/apache/struts2/dispatcher/multipart/JakartaMultiPartRequest.html...>
Generating <https://builds.apache.org/job/Struts-master-JDK11/ws/core/target/apidocs/org/apache/struts2/dispatcher/multipart/JakartaStreamMultiPartRequest.html...>
Generating <https://builds.apache.org/job/Struts-master-JDK11/ws/core/target/apidocs/org/apache/struts2/dispatcher/multipart/JakartaStreamMultiPartRequest.FileInfo.html...>
Generating <https://builds.apache.org/job/Struts-master-JDK11/ws/core/target/apidocs/org/apache/struts2/dispatcher/multipart/MultiPartRequest.html...>
Generating <https://builds.apache.org/job/Struts-master-JDK11/ws/core/target/apidocs/org/apache/struts2/dispatcher/multipart/MultiPartRequestWrapper.html...>
1 error
[INFO] ------------------------------------------------------------------------
[INFO] Reactor Summary:
[INFO] 
[INFO] Struts 2 Bill of Materials ......................... SUCCESS [  1.894 s]
[INFO] Struts 2 2.6-SNAPSHOT .............................. SUCCESS [  2.419 s]
[INFO] Struts 2 Core ...................................... FAILURE [ 11.909 s]
[INFO] Struts Plugins ..................................... SKIPPED
[INFO] Struts 2 Configuration Browser Plugin .............. SKIPPED
[INFO] Struts 2 Sitemesh Plugin ........................... SKIPPED
[INFO] Struts 2 Tiles Plugin .............................. SKIPPED
[INFO] Struts 2 DWR Plugin ................................ SKIPPED
[INFO] Struts 2 Spring Plugin ............................. SKIPPED
[INFO] Struts 2 Convention Plugin ......................... SKIPPED
[INFO] Struts 2 JUnit Plugin .............................. SKIPPED
[INFO] Struts 2 JSON Plugin ............................... SKIPPED
[INFO] Struts 2 Bean Validation Plugin .................... SKIPPED
[INFO] Struts 2 Async Plugin .............................. SKIPPED
[INFO] Struts 2 Webapps ................................... SKIPPED
[INFO] Struts 2 Showcase Webapp ........................... SKIPPED
[INFO] Struts 2 REST Plugin ............................... SKIPPED
[INFO] Struts 2 Rest Showcase Webapp ...................... SKIPPED
[INFO] Struts 2 CDI Plugin ................................ SKIPPED
[INFO] Struts 2 Embedded JSP Plugin ....................... SKIPPED
[INFO] Struts 2 GXP Plugin ................................ SKIPPED
[INFO] Struts 2 Jasper Reports Plugin ..................... SKIPPED
[INFO] Struts 2 Java Templates Plugin ..................... SKIPPED
[INFO] Struts 2 JFreeChart Plugin ......................... SKIPPED
[INFO] Struts 2 OSGi Plugin ............................... SKIPPED
[INFO] Struts 2 OVal Plugin ............................... SKIPPED
[INFO] Struts 2 Pell Multipart Plugin ..................... SKIPPED
[INFO] Struts 2 Plexus Plugin ............................. SKIPPED
[INFO] Struts 2 Portlet Plugin ............................ SKIPPED
[INFO] Struts 2 Portlet Tiles Plugin ...................... SKIPPED
[INFO] DEPRECATED: Struts 2 Sitegraph Plugin .............. SKIPPED
[INFO] Struts 2 TestNG Plugin ............................. SKIPPED
[INFO] Struts OSGi Bundles ................................ SKIPPED
[INFO] Struts 2 OSGi Admin Bundle ......................... SKIPPED
[INFO] Struts 2 OSGi Demo Bundle 2.6-SNAPSHOT ............. SKIPPED
[INFO] ------------------------------------------------------------------------
[INFO] BUILD FAILURE
[INFO] ------------------------------------------------------------------------
[INFO] Total time: 18.072 s
[INFO] Finished at: 2018-11-11T08:57:02Z
[INFO] ------------------------------------------------------------------------
[ERROR] Failed to execute goal org.apache.maven.plugins:maven-javadoc-plugin:3.0.1:jar (default-cli)
on project struts2-core: MavenReportException: Error while generating Javadoc: 
[ERROR] Exit code: 1 - javadoc: error - An internal exception has occurred. 
[ERROR] 	(java.lang.ClassCastException: class com.sun.tools.javac.code.Symtab$6 cannot be
cast to class com.sun.tools.javac.code.Symbol$ClassSymbol (com.sun.tools.javac.code.Symtab$6
and com.sun.tools.javac.code.Symbol$ClassSymbol are in module jdk.compiler of loader 'app'))
[ERROR] Please file a bug against the javadoc tool via the Java bug reporting page
[ERROR] (http://bugreport.java.com) after checking the Bug Database (http://bugs.java.com)
[ERROR] for duplicates. Include error messages and the following diagnostic in your report.
Thank you.
[ERROR] java.lang.ClassCastException: class com.sun.tools.javac.code.Symtab$6 cannot be cast
to class com.sun.tools.javac.code.Symbol$ClassSymbol (com.sun.tools.javac.code.Symtab$6 and
com.sun.tools.javac.code.Symbol$ClassSymbol are in module jdk.compiler of loader 'app')
[ERROR] 	at jdk.compiler/com.sun.tools.javac.code.Symbol.outermostClass(Symbol.java:490)
[ERROR] 	at jdk.javadoc/jdk.javadoc.internal.tool.ToolEnvironment.getFileKind(ToolEnvironment.java:196)
[ERROR] 	at jdk.javadoc/jdk.javadoc.internal.tool.ElementsTable.isTypeElementSelected(ElementsTable.java:985)
[ERROR] 	at jdk.javadoc/jdk.javadoc.internal.tool.ElementsTable$IncludedVisitor.visitType(ElementsTable.java:1062)
[ERROR] 	at jdk.javadoc/jdk.javadoc.internal.tool.ElementsTable$IncludedVisitor.visitType(ElementsTable.java:1038)
[ERROR] 	at jdk.compiler/com.sun.tools.javac.code.Symbol$ClassSymbol.accept(Symbol.java:1447)
[ERROR] 	at java.compiler@11.0.1/javax.lang.model.util.AbstractElementVisitor6.visit(AbstractElementVisitor6.java:106)
[ERROR] 	at jdk.javadoc/jdk.javadoc.internal.tool.ElementsTable.isIncluded(ElementsTable.java:334)
[ERROR] 	at jdk.javadoc/jdk.javadoc.internal.tool.DocEnvImpl.isIncluded(DocEnvImpl.java:85)
[ERROR] 	at jdk.javadoc/jdk.javadoc.internal.doclets.toolkit.util.Utils.isIncluded(Utils.java:2685)
[ERROR] 	at jdk.javadoc/jdk.javadoc.internal.doclets.formats.html.LinkFactoryImpl.getClassLink(LinkFactoryImpl.java:95)
[ERROR] 	at jdk.javadoc/jdk.javadoc.internal.doclets.toolkit.util.links.LinkFactory.getLink(LinkFactory.java:194)
[ERROR] 	at jdk.javadoc/jdk.javadoc.internal.doclets.formats.html.HtmlDocletWriter.getLink(HtmlDocletWriter.java:679)
[ERROR] 	at jdk.javadoc/jdk.javadoc.internal.doclets.formats.html.HtmlDocletWriter.seeTagToContent(HtmlDocletWriter.java:1060)
[ERROR] 	at jdk.javadoc/jdk.javadoc.internal.doclets.formats.html.HtmlDocletWriter$2.visitLink(HtmlDocletWriter.java:1463)
[ERROR] 	at jdk.javadoc/jdk.javadoc.internal.doclets.formats.html.HtmlDocletWriter$2.visitLink(HtmlDocletWriter.java:1324)
[ERROR] 	at jdk.compiler/com.sun.tools.javac.tree.DCTree$DCLink.accept(DCTree.java:538)
[ERROR] 	at jdk.compiler/com.sun.source.util.SimpleDocTreeVisitor.visit(SimpleDocTreeVisitor.java:79)
[ERROR] 	at jdk.javadoc/jdk.javadoc.internal.doclets.formats.html.HtmlDocletWriter.commentTagsToContent(HtmlDocletWriter.java:1539)
[ERROR] 	at jdk.javadoc/jdk.javadoc.internal.doclets.formats.html.HtmlDocletWriter.addCommentTags(HtmlDocletWriter.java:1229)
[ERROR] 	at jdk.javadoc/jdk.javadoc.internal.doclets.formats.html.HtmlDocletWriter.addCommentTags(HtmlDocletWriter.java:1210)
[ERROR] 	at jdk.javadoc/jdk.javadoc.internal.doclets.formats.html.HtmlDocletWriter.addSummaryComment(HtmlDocletWriter.java:1180)
[ERROR] 	at jdk.javadoc/jdk.javadoc.internal.doclets.formats.html.SubWriterHolderWriter.addIndexComment(SubWriterHolderWriter.java:135)
[ERROR] 	at jdk.javadoc/jdk.javadoc.internal.doclets.formats.html.SubWriterHolderWriter.addSummaryLinkComment(SubWriterHolderWriter.java:160)
[ERROR] 	at jdk.javadoc/jdk.javadoc.internal.doclets.formats.html.AbstractMemberWriter.addMemberSummary(AbstractMemberWriter.java:488)
[ERROR] 	at jdk.javadoc/jdk.javadoc.internal.doclets.toolkit.builders.MemberSummaryBuilder.buildSummary(MemberSummaryBuilder.java:332)
[ERROR] 	at jdk.javadoc/jdk.javadoc.internal.doclets.toolkit.builders.MemberSummaryBuilder.addSummary(MemberSummaryBuilder.java:495)
[ERROR] 	at jdk.javadoc/jdk.javadoc.internal.doclets.toolkit.builders.MemberSummaryBuilder.buildMethodsSummary(MemberSummaryBuilder.java:288)
[ERROR] 	at jdk.javadoc/jdk.javadoc.internal.doclets.toolkit.builders.MemberSummaryBuilder$1.build(MemberSummaryBuilder.java:112)
[ERROR] 	at jdk.javadoc/jdk.javadoc.internal.doclets.toolkit.builders.ClassBuilder.buildMemberSummary(ClassBuilder.java:324)
[ERROR] 	at jdk.javadoc/jdk.javadoc.internal.doclets.toolkit.builders.ClassBuilder.buildClassDoc(ClassBuilder.java:144)
[ERROR] 	at jdk.javadoc/jdk.javadoc.internal.doclets.toolkit.builders.ClassBuilder.build(ClassBuilder.java:120)
[ERROR] 	at jdk.javadoc/jdk.javadoc.internal.doclets.formats.html.HtmlDoclet.generateClassFiles(HtmlDoclet.java:266)
[ERROR] 	at jdk.javadoc/jdk.javadoc.internal.doclets.toolkit.AbstractDoclet.generateClassFiles(AbstractDoclet.java:273)
[ERROR] 	at jdk.javadoc/jdk.javadoc.internal.doclets.toolkit.AbstractDoclet.startGeneration(AbstractDoclet.java:207)
[ERROR] 	at jdk.javadoc/jdk.javadoc.internal.doclets.toolkit.AbstractDoclet.run(AbstractDoclet.java:114)
[ERROR] 	at jdk.javadoc/jdk.javadoc.doclet.StandardDoclet.run(StandardDoclet.java:72)
[ERROR] 	at jdk.javadoc/jdk.javadoc.internal.tool.Start.parseAndExecute(Start.java:582)
[ERROR] 	at jdk.javadoc/jdk.javadoc.internal.tool.Start.begin(Start.java:431)
[ERROR] 	at jdk.javadoc/jdk.javadoc.internal.tool.Start.begin(Start.java:344)
[ERROR] 	at jdk.javadoc/jdk.javadoc.internal.tool.Main.execute(Main.java:63)
[ERROR] 	at jdk.javadoc/jdk.javadoc.internal.tool.Main.main(Main.java:52)
[ERROR] 
[ERROR] Command line was: /home/jenkins/tools/java/latest11/bin/javadoc @options @packages
[ERROR] 
[ERROR] Refer to the generated Javadoc files in '<https://builds.apache.org/job/Struts-master-JDK11/ws/core/target/apidocs'>
dir.
[ERROR] 
[ERROR] -> [Help 1]
[ERROR] 
[ERROR] To see the full stack trace of the errors, re-run Maven with the -e switch.
[ERROR] Re-run Maven using the -X switch to enable full debug logging.
[ERROR] 
[ERROR] For more information about the errors and possible solutions, please read the following
articles:
[ERROR] [Help 1] http://cwiki.apache.org/confluence/display/MAVEN/MojoExecutionException
[ERROR] 
[ERROR] After correcting the problems, you can resume the build with the command
[ERROR]   mvn <goals> -rf :struts2-core
Build step 'Execute shell' marked build as failure
[locks-and-latches] Releasing all the locks
[locks-and-latches] All the locks released
Setting MAVEN_3_LATEST__HOME=/home/jenkins/tools/maven/latest3/

---------------------------------------------------------------------
To unsubscribe, e-mail: dev-unsubscribe@struts.apache.org
For additional commands, e-mail: dev-help@struts.apache.org


Mime
View raw message