struts-dev mailing list archives

Site index · List index
Message view « Date » · « Thread »
Top « Date » · « Thread »
From Apache Jenkins Server <jenk...@builds.apache.org>
Subject Build failed in Jenkins: Struts-master-JDK9 #12
Date Mon, 19 Nov 2018 10:17:53 GMT
See <https://builds.apache.org/job/Struts-master-JDK9/12/display/redirect?page=changes>

Changes:

[yasserzamani] fix travis if statement syntax

------------------------------------------
[...truncated 1.29 MB...]
	at java.lang.reflect.Method.invoke(Method.java:564) ~[?:?]
	at org.apache.maven.surefire.util.ReflectionUtils.invokeMethodWithArray2(ReflectionUtils.java:206)
[surefire-api-2.22.1.jar:2.22.1]
	at org.apache.maven.surefire.booter.ProviderFactory$ProviderProxy.invoke(ProviderFactory.java:161)
[surefire-booter-2.22.1.jar:2.22.1]
	at org.apache.maven.surefire.booter.ProviderFactory.invokeProvider(ProviderFactory.java:84)
[surefire-booter-2.22.1.jar:2.22.1]
	at org.apache.maven.plugin.surefire.InPluginVMSurefireStarter.runSuitesInProcess(InPluginVMSurefireStarter.java:87)
[maven-surefire-common-2.22.1.jar:2.22.1]
	at org.apache.maven.plugin.surefire.AbstractSurefireMojo.executeProvider(AbstractSurefireMojo.java:1166)
[maven-surefire-common-2.22.1.jar:2.22.1]
	at org.apache.maven.plugin.surefire.AbstractSurefireMojo.executeAfterPreconditionsChecked(AbstractSurefireMojo.java:1011)
[maven-surefire-common-2.22.1.jar:2.22.1]
	at org.apache.maven.plugin.surefire.AbstractSurefireMojo.execute(AbstractSurefireMojo.java:857)
[maven-surefire-common-2.22.1.jar:2.22.1]
	at org.apache.maven.plugin.DefaultBuildPluginManager.executeMojo(DefaultBuildPluginManager.java:137)
[maven-core-3.5.4.jar:3.5.4]
	at org.apache.maven.lifecycle.internal.MojoExecutor.execute(MojoExecutor.java:208) [maven-core-3.5.4.jar:3.5.4]
	at org.apache.maven.lifecycle.internal.MojoExecutor.execute(MojoExecutor.java:154) [maven-core-3.5.4.jar:3.5.4]
	at org.apache.maven.lifecycle.internal.MojoExecutor.execute(MojoExecutor.java:146) [maven-core-3.5.4.jar:3.5.4]
	at org.apache.maven.lifecycle.internal.LifecycleModuleBuilder.buildProject(LifecycleModuleBuilder.java:117)
[maven-core-3.5.4.jar:3.5.4]
	at org.apache.maven.lifecycle.internal.LifecycleModuleBuilder.buildProject(LifecycleModuleBuilder.java:81)
[maven-core-3.5.4.jar:3.5.4]
	at org.apache.maven.lifecycle.internal.builder.singlethreaded.SingleThreadedBuilder.build(SingleThreadedBuilder.java:56)
[maven-core-3.5.4.jar:3.5.4]
	at org.apache.maven.lifecycle.internal.LifecycleStarter.execute(LifecycleStarter.java:128)
[maven-core-3.5.4.jar:3.5.4]
	at org.apache.maven.DefaultMaven.doExecute(DefaultMaven.java:305) [maven-core-3.5.4.jar:3.5.4]
	at org.apache.maven.DefaultMaven.doExecute(DefaultMaven.java:192) [maven-core-3.5.4.jar:3.5.4]
	at org.apache.maven.DefaultMaven.execute(DefaultMaven.java:105) [maven-core-3.5.4.jar:3.5.4]
	at org.apache.maven.cli.MavenCli.execute(MavenCli.java:954) [maven-embedder-3.5.4.jar:3.5.4]
	at org.apache.maven.cli.MavenCli.doMain(MavenCli.java:288) [maven-embedder-3.5.4.jar:3.5.4]
	at org.apache.maven.cli.MavenCli.main(MavenCli.java:192) [maven-embedder-3.5.4.jar:3.5.4]
	at jdk.internal.reflect.NativeMethodAccessorImpl.invoke0(Native Method) ~[?:?]
	at jdk.internal.reflect.NativeMethodAccessorImpl.invoke(NativeMethodAccessorImpl.java:62)
~[?:?]
	at jdk.internal.reflect.DelegatingMethodAccessorImpl.invoke(DelegatingMethodAccessorImpl.java:43)
~[?:?]
	at java.lang.reflect.Method.invoke(Method.java:564) ~[?:?]
	at org.codehaus.plexus.classworlds.launcher.Launcher.launchEnhanced(Launcher.java:289) [plexus-classworlds-2.5.2.jar:?]
	at org.codehaus.plexus.classworlds.launcher.Launcher.launch(Launcher.java:229) [plexus-classworlds-2.5.2.jar:?]
	at org.codehaus.plexus.classworlds.launcher.Launcher.mainWithExitCode(Launcher.java:415)
[plexus-classworlds-2.5.2.jar:?]
	at org.codehaus.plexus.classworlds.launcher.Launcher.main(Launcher.java:356) [plexus-classworlds-2.5.2.jar:?]
2018-11-19 10:17:51,686 WARN  [main] ognl.SecurityMemberAccess (SecurityMemberAccess.java:99)
- Access to static [public static java.lang.Runtime java.lang.Runtime.getRuntime()] is blocked!
2018-11-19 10:17:51,733 WARN  [main] ognl.SecurityMemberAccess (SecurityMemberAccess.java:106)
- Declaring class of member type [public final native java.lang.Class java.lang.Object.getClass()]
is excluded!
[INFO] Tests run: 41, Failures: 0, Errors: 0, Skipped: 0, Time elapsed: 0.199 s - in com.opensymphony.xwork2.ognl.OgnlUtilTest
[INFO] Running com.opensymphony.xwork2.ognl.SecurityMemberAccessProxyTest
Nov 19, 2018 10:17:51 AM org.springframework.context.support.ClassPathXmlApplicationContext
prepareRefresh
INFO: Refreshing org.springframework.context.support.ClassPathXmlApplicationContext@890b913:
startup date [Mon Nov 19 10:17:51 UTC 2018]; root of context hierarchy
Nov 19, 2018 10:17:51 AM org.springframework.beans.factory.xml.XmlBeanDefinitionReader loadBeanDefinitions
INFO: Loading XML bean definitions from class path resource [com/opensymphony/xwork2/spring/actionContext-spring.xml]
2018-11-19 10:17:51,809 WARN  [main] ognl.SecurityMemberAccess (SecurityMemberAccess.java:125)
- Access to proxy is blocked! Target class [class com.opensymphony.xwork2.TestSubBean$$EnhancerBySpringCGLIB$$20425f41]
of target [com.opensymphony.xwork2.TestSubBean@11fd6f69], member [public final boolean com.opensymphony.xwork2.TestSubBean$$EnhancerBySpringCGLIB$$20425f41.isExposeProxy()]
Nov 19, 2018 10:17:51 AM org.springframework.context.support.ClassPathXmlApplicationContext
prepareRefresh
INFO: Refreshing org.springframework.context.support.ClassPathXmlApplicationContext@7d1f2d01:
startup date [Mon Nov 19 10:17:51 UTC 2018]; root of context hierarchy
Nov 19, 2018 10:17:51 AM org.springframework.beans.factory.xml.XmlBeanDefinitionReader loadBeanDefinitions
INFO: Loading XML bean definitions from class path resource [com/opensymphony/xwork2/spring/actionContext-spring.xml]
[INFO] Tests run: 2, Failures: 0, Errors: 0, Skipped: 0, Time elapsed: 0.135 s - in com.opensymphony.xwork2.ognl.SecurityMemberAccessProxyTest
[INFO] Running com.opensymphony.xwork2.ognl.OgnlValueStackTest
2018-11-19 10:17:52,035 WARN  [main] ognl.SecurityMemberAccess (SecurityMemberAccess.java:99)
- Access to static [public static java.lang.String com.opensymphony.xwork2.util.Dog.getDeity()]
is blocked!
[INFO] Tests run: 58, Failures: 0, Errors: 0, Skipped: 0, Time elapsed: 0.257 s - in com.opensymphony.xwork2.ognl.OgnlValueStackTest
[INFO] Running com.opensymphony.xwork2.ognl.SecurityMemberAccessTest
2018-11-19 10:17:52,142 WARN  [main] ognl.SecurityMemberAccess (SecurityMemberAccess.java:114)
- Package [package com.opensymphony.xwork2.ognl] of target class [class com.opensymphony.xwork2.ognl.FooBar]
of target [com.opensymphony.xwork2.ognl.FooBar@1] or package [package com.opensymphony.xwork2.ognl]
of member [public java.lang.String com.opensymphony.xwork2.ognl.FooBar.getStringField()] are
excluded!
2018-11-19 10:17:52,143 WARN  [main] ognl.SecurityMemberAccess (SecurityMemberAccess.java:114)
- Package [package com.opensymphony.xwork2.ognl] of target class [class com.opensymphony.xwork2.ognl.FooBar]
of target [com.opensymphony.xwork2.ognl.FooBar@1] or package [package com.opensymphony.xwork2.ognl]
of member [public java.lang.String com.opensymphony.xwork2.ognl.FooBar.getStringField()] are
excluded!
2018-11-19 10:17:52,144 WARN  [main] ognl.SecurityMemberAccess (SecurityMemberAccess.java:106)
- Declaring class of member type [public java.lang.ClassLoader java.lang.Class.getClassLoader()]
is excluded!
2018-11-19 10:17:52,144 WARN  [main] ognl.SecurityMemberAccess (SecurityMemberAccess.java:106)
- Declaring class of member type [public void com.opensymphony.xwork2.ognl.SecurityMemberAccess.setExcludedClasses(java.util.Set)]
is excluded!
2018-11-19 10:17:52,145 WARN  [main] ognl.SecurityMemberAccess (SecurityMemberAccess.java:99)
- Access to static [public static java.lang.String com.opensymphony.xwork2.ognl.StaticTester.sayHello()]
is blocked!
2018-11-19 10:17:52,145 WARN  [main] ognl.SecurityMemberAccess (SecurityMemberAccess.java:99)
- Access to static [public static int com.opensymphony.xwork2.ognl.StaticTester.MAX_VALUE]
is blocked!
2018-11-19 10:17:52,146 WARN  [main] ognl.SecurityMemberAccess (SecurityMemberAccess.java:156)
- The use of the default (unnamed) package is discouraged!
2018-11-19 10:17:52,146 WARN  [main] ognl.SecurityMemberAccess (SecurityMemberAccess.java:106)
- Declaring class of member type [public abstract java.lang.String com.opensymphony.xwork2.ognl.BarInterface.barLogic()]
is excluded!
2018-11-19 10:17:52,147 WARN  [main] ognl.SecurityMemberAccess (SecurityMemberAccess.java:99)
- Access to static [public static void java.lang.System.exit(int)] is blocked!
2018-11-19 10:17:52,147 WARN  [main] ognl.SecurityMemberAccess (SecurityMemberAccess.java:106)
- Declaring class of member type [public java.lang.String com.opensymphony.xwork2.ognl.FooBar.getStringField()]
is excluded!
2018-11-19 10:17:52,148 WARN  [main] ognl.SecurityMemberAccess (SecurityMemberAccess.java:106)
- Declaring class of member type [public java.lang.String java.lang.Object.toString()] is
excluded!
2018-11-19 10:17:52,149 WARN  [main] ognl.SecurityMemberAccess (SecurityMemberAccess.java:106)
- Declaring class of member type [public abstract java.lang.String com.opensymphony.xwork2.ognl.BarInterface.barLogic()]
is excluded!
2018-11-19 10:17:52,149 WARN  [main] ognl.SecurityMemberAccess (SecurityMemberAccess.java:156)
- The use of the default (unnamed) package is discouraged!
2018-11-19 10:17:52,149 WARN  [main] ognl.SecurityMemberAccess (SecurityMemberAccess.java:156)
- The use of the default (unnamed) package is discouraged!
2018-11-19 10:17:52,150 WARN  [main] ognl.SecurityMemberAccess (SecurityMemberAccess.java:106)
- Declaring class of member type [public static int com.opensymphony.xwork2.ognl.StaticTester.MAX_VALUE]
is excluded!
2018-11-19 10:17:52,150 WARN  [main] ognl.SecurityMemberAccess (SecurityMemberAccess.java:156)
- The use of the default (unnamed) package is discouraged!
[INFO] Tests run: 26, Failures: 0, Errors: 0, Skipped: 0, Time elapsed: 0.01 s - in com.opensymphony.xwork2.ognl.SecurityMemberAccessTest
[INFO] Running com.opensymphony.xwork2.ognl.SetPropertiesTest
ognl:com.opensymphony.xwork2.ognl.accessor.XWorkMapPropertyAccessor@114c5c4a this:com.opensymphony.xwork2.mock.MockObjectTypeDeterminer@39815a1c
ognl:com.opensymphony.xwork2.ognl.accessor.XWorkMapPropertyAccessor@66b02c0 this:com.opensymphony.xwork2.mock.MockObjectTypeDeterminer@66afb0fc
ognl:com.opensymphony.xwork2.ognl.accessor.XWorkMapPropertyAccessor@7c48885d this:com.opensymphony.xwork2.mock.MockObjectTypeDeterminer@72ad3a6a
ognl:com.opensymphony.xwork2.ognl.accessor.XWorkMapPropertyAccessor@7c48885d this:com.opensymphony.xwork2.mock.MockObjectTypeDeterminer@72ad3a6a
ognl:com.opensymphony.xwork2.ognl.accessor.XWorkMapPropertyAccessor@2406efbc this:com.opensymphony.xwork2.mock.MockObjectTypeDeterminer@197a8502
2018-11-19 10:17:52,211 WARN  [main] ognl.OgnlValueStack (OgnlValueStack.java:203) - Error
setting value [Spielen] with expression [moreCats[2].name]
java.lang.IndexOutOfBoundsException: Index 2 out-of-bounds for length 0
	at jdk.internal.util.Preconditions.outOfBounds(Preconditions.java:64) ~[?:?]
	at jdk.internal.util.Preconditions.outOfBoundsCheckIndex(Preconditions.java:70) ~[?:?]
	at jdk.internal.util.Preconditions.checkIndex(Preconditions.java:248) ~[?:?]
	at java.util.Objects.checkIndex(Objects.java:372) ~[?:?]
	at java.util.ArrayList.get(ArrayList.java:440) ~[?:?]
	at ognl.ListPropertyAccessor.getProperty(ListPropertyAccessor.java:72) ~[ognl-3.2.8.jar:?]
	at com.opensymphony.xwork2.ognl.accessor.XWorkListPropertyAccessor.getProperty(XWorkListPropertyAccessor.java:137)
~[classes/:?]
	at ognl.OgnlRuntime.getProperty(OgnlRuntime.java:2695) ~[ognl-3.2.8.jar:?]
	at ognl.ASTProperty.getValueBody(ASTProperty.java:114) ~[ognl-3.2.8.jar:?]
	at ognl.SimpleNode.evaluateGetValueBody(SimpleNode.java:212) ~[ognl-3.2.8.jar:?]
	at ognl.SimpleNode.getValue(SimpleNode.java:258) ~[ognl-3.2.8.jar:?]
	at ognl.ASTChain.setValueBody(ASTChain.java:222) ~[ognl-3.2.8.jar:?]
	at ognl.SimpleNode.evaluateSetValueBody(SimpleNode.java:220) ~[ognl-3.2.8.jar:?]
	at ognl.SimpleNode.setValue(SimpleNode.java:301) ~[ognl-3.2.8.jar:?]
	at ognl.Ognl.setValue(Ognl.java:739) ~[ognl-3.2.8.jar:?]
	at com.opensymphony.xwork2.ognl.OgnlUtil$1.execute(OgnlUtil.java:341) ~[classes/:?]
	at com.opensymphony.xwork2.ognl.OgnlUtil$1.execute(OgnlUtil.java:333) ~[classes/:?]
	at com.opensymphony.xwork2.ognl.OgnlUtil.compileAndExecute(OgnlUtil.java:428) ~[classes/:?]
	at com.opensymphony.xwork2.ognl.OgnlUtil.setValue(OgnlUtil.java:333) ~[classes/:?]
	at com.opensymphony.xwork2.ognl.OgnlValueStack.trySetValue(OgnlValueStack.java:187) [classes/:?]
	at com.opensymphony.xwork2.ognl.OgnlValueStack.setValue(OgnlValueStack.java:174) [classes/:?]
	at com.opensymphony.xwork2.ognl.OgnlValueStack.setValue(OgnlValueStack.java:165) [classes/:?]
	at com.opensymphony.xwork2.ognl.SetPropertiesTest.doTestAddingToListsWithObjects(SetPropertiesTest.java:164)
[test-classes/:?]
	at com.opensymphony.xwork2.ognl.SetPropertiesTest.testAddingToListsWithObjectsFalse(SetPropertiesTest.java:134)
[test-classes/:?]
	at jdk.internal.reflect.NativeMethodAccessorImpl.invoke0(Native Method) ~[?:?]
	at jdk.internal.reflect.NativeMethodAccessorImpl.invoke(NativeMethodAccessorImpl.java:62)
~[?:?]
	at jdk.internal.reflect.DelegatingMethodAccessorImpl.invoke(DelegatingMethodAccessorImpl.java:43)
~[?:?]
	at java.lang.reflect.Method.invoke(Method.java:564) ~[?:?]
	at junit.framework.TestCase.runTest(TestCase.java:176) [junit-4.12.jar:4.12]
	at junit.framework.TestCase.runBare(TestCase.java:141) [junit-4.12.jar:4.12]
	at junit.framework.TestResult$1.protect(TestResult.java:122) [junit-4.12.jar:4.12]
	at junit.framework.TestResult.runProtected(TestResult.java:142) [junit-4.12.jar:4.12]
	at junit.framework.TestResult.run(TestResult.java:125) [junit-4.12.jar:4.12]
	at junit.framework.TestCase.run(TestCase.java:129) [junit-4.12.jar:4.12]
	at junit.framework.TestSuite.runTest(TestSuite.java:252) [junit-4.12.jar:4.12]
	at junit.framework.TestSuite.run(TestSuite.java:247) [junit-4.12.jar:4.12]
	at org.junit.internal.runners.JUnit38ClassRunner.run(JUnit38ClassRunner.java:86) [junit-4.12.jar:4.12]
	at org.junit.runners.Suite.runChild(Suite.java:128) [junit-4.12.jar:4.12]
	at org.junit.runners.Suite.runChild(Suite.java:27) [junit-4.12.jar:4.12]
	at org.junit.runners.ParentRunner$3.run(ParentRunner.java:290) [junit-4.12.jar:4.12]
	at org.junit.runners.ParentRunner$1.schedule(ParentRunner.java:71) [junit-4.12.jar:4.12]
	at org.junit.runners.ParentRunner.runChildren(ParentRunner.java:288) [junit-4.12.jar:4.12]
	at org.junit.runners.ParentRunner.access$000(ParentRunner.java:58) [junit-4.12.jar:4.12]
	at org.junit.runners.ParentRunner$2.evaluate(ParentRunner.java:268) [junit-4.12.jar:4.12]
	at org.junit.runners.ParentRunner.run(ParentRunner.java:363) [junit-4.12.jar:4.12]
	at org.apache.maven.surefire.junitcore.JUnitCore.run(JUnitCore.java:55) [surefire-junit47-2.22.1.jar:2.22.1]
	at org.apache.maven.surefire.junitcore.JUnitCoreWrapper.createRequestAndRun(JUnitCoreWrapper.java:137)
[surefire-junit47-2.22.1.jar:2.22.1]
	at org.apache.maven.surefire.junitcore.JUnitCoreWrapper.executeEager(JUnitCoreWrapper.java:107)
[surefire-junit47-2.22.1.jar:2.22.1]
	at org.apache.maven.surefire.junitcore.JUnitCoreWrapper.execute(JUnitCoreWrapper.java:83)
[surefire-junit47-2.22.1.jar:2.22.1]
	at org.apache.maven.surefire.junitcore.JUnitCoreWrapper.execute(JUnitCoreWrapper.java:75)
[surefire-junit47-2.22.1.jar:2.22.1]
	at org.apache.maven.surefire.junitcore.JUnitCoreProvider.invoke(JUnitCoreProvider.java:158)
[surefire-junit47-2.22.1.jar:2.22.1]
	at jdk.internal.reflect.NativeMethodAccessorImpl.invoke0(Native Method) ~[?:?]
	at jdk.internal.reflect.NativeMethodAccessorImpl.invoke(NativeMethodAccessorImpl.java:62)
~[?:?]
	at jdk.internal.reflect.DelegatingMethodAccessorImpl.invoke(DelegatingMethodAccessorImpl.java:43)
~[?:?]
	at java.lang.reflect.Method.invoke(Method.java:564) ~[?:?]
	at org.apache.maven.surefire.util.ReflectionUtils.invokeMethodWithArray2(ReflectionUtils.java:206)
[surefire-api-2.22.1.jar:2.22.1]
	at org.apache.maven.surefire.booter.ProviderFactory$ProviderProxy.invoke(ProviderFactory.java:161)
[surefire-booter-2.22.1.jar:2.22.1]
	at org.apache.maven.surefire.booter.ProviderFactory.invokeProvider(ProviderFactory.java:84)
[surefire-booter-2.22.1.jar:2.22.1]
	at org.apache.maven.plugin.surefire.InPluginVMSurefireStarter.runSuitesInProcess(InPluginVMSurefireStarter.java:87)
[maven-surefire-common-2.22.1.jar:2.22.1]
	at org.apache.maven.plugin.surefire.AbstractSurefireMojo.executeProvider(AbstractSurefireMojo.java:1166)
[maven-surefire-common-2.22.1.jar:2.22.1]
	at org.apache.maven.plugin.surefire.AbstractSurefireMojo.executeAfterPreconditionsChecked(AbstractSurefireMojo.java:1011)
[maven-surefire-common-2.22.1.jar:2.22.1]
	at org.apache.maven.plugin.surefire.AbstractSurefireMojo.execute(AbstractSurefireMojo.java:857)
[maven-surefire-common-2.22.1.jar:2.22.1]
	at org.apache.maven.plugin.DefaultBuildPluginManager.executeMojo(DefaultBuildPluginManager.java:137)
[maven-core-3.5.4.jar:3.5.4]
	at org.apache.maven.lifecycle.internal.MojoExecutor.execute(MojoExecutor.java:208) [maven-core-3.5.4.jar:3.5.4]
	at org.apache.maven.lifecycle.internal.MojoExecutor.execute(MojoExecutor.java:154) [maven-core-3.5.4.jar:3.5.4]
	at org.apache.maven.lifecycle.internal.MojoExecutor.execute(MojoExecutor.java:146) [maven-core-3.5.4.jar:3.5.4]
	at org.apache.maven.lifecycle.internal.LifecycleModuleBuilder.buildProject(LifecycleModuleBuilder.java:117)
[maven-core-3.5.4.jar:3.5.4]
	at org.apache.maven.lifecycle.internal.LifecycleModuleBuilder.buildProject(LifecycleModuleBuilder.java:81)
[maven-core-3.5.4.jar:3.5.4]
	at org.apache.maven.lifecycle.internal.builder.singlethreaded.SingleThreadedBuilder.build(SingleThreadedBuilder.java:56)
[maven-core-3.5.4.jar:3.5.4]
	at org.apache.maven.lifecycle.internal.LifecycleStarter.execute(LifecycleStarter.java:128)
[maven-core-3.5.4.jar:3.5.4]
	at org.apache.maven.DefaultMaven.doExecute(DefaultMaven.java:305) [maven-core-3.5.4.jar:3.5.4]
	at org.apache.maven.DefaultMaven.doExecute(DefaultMaven.java:192) [maven-core-3.5.4.jar:3.5.4]
	at org.apache.maven.DefaultMaven.execute(DefaultMaven.java:105) [maven-core-3.5.4.jar:3.5.4]
	at org.apache.maven.cli.MavenCli.execute(MavenCli.java:954) [maven-embedder-3.5.4.jar:3.5.4]
	at org.apache.maven.cli.MavenCli.doMain(MavenCli.java:288) [maven-embedder-3.5.4.jar:3.5.4]
	at org.apache.maven.cli.MavenCli.main(MavenCli.java:192) [maven-embedder-3.5.4.jar:3.5.4]
	at jdk.internal.reflect.NativeMethodAccessorImpl.invoke0(Native Method) ~[?:?]
	at jdk.internal.reflect.NativeMethodAccessorImpl.invoke(NativeMethodAccessorImpl.java:62)
~[?:?]
	at jdk.internal.reflect.DelegatingMethodAccessorImpl.invoke(DelegatingMethodAccessorImpl.java:43)
~[?:?]
	at java.lang.reflect.Method.invoke(Method.java:564) ~[?:?]
	at org.codehaus.plexus.classworlds.launcher.Launcher.launchEnhanced(Launcher.java:289) [plexus-classworlds-2.5.2.jar:?]
	at org.codehaus.plexus.classworlds.launcher.Launcher.launch(Launcher.java:229) [plexus-classworlds-2.5.2.jar:?]
	at org.codehaus.plexus.classworlds.launcher.Launcher.mainWithExitCode(Launcher.java:415)
[plexus-classworlds-2.5.2.jar:?]
	at org.codehaus.plexus.classworlds.launcher.Launcher.main(Launcher.java:356) [plexus-classworlds-2.5.2.jar:?]
ognl:com.opensymphony.xwork2.ognl.accessor.XWorkMapPropertyAccessor@4a71234b this:com.opensymphony.xwork2.mock.MockObjectTypeDeterminer@7c6e0b85
ognl:com.opensymphony.xwork2.ognl.accessor.XWorkMapPropertyAccessor@4a71234b this:com.opensymphony.xwork2.mock.MockObjectTypeDeterminer@7c6e0b85
[INFO] Tests run: 11, Failures: 0, Errors: 0, Skipped: 0, Time elapsed: 0.081 s - in com.opensymphony.xwork2.ognl.SetPropertiesTest
[INFO] Running com.opensymphony.xwork2.ognl.OgnlUtilStrutsTest
[INFO] Tests run: 2, Failures: 0, Errors: 0, Skipped: 0, Time elapsed: 0.057 s - in com.opensymphony.xwork2.ognl.OgnlUtilStrutsTest
[INFO] 
[INFO] Results:
[INFO] 
[INFO] Tests run: 1838, Failures: 0, Errors: 0, Skipped: 0
[INFO] 
[INFO] 
[INFO] --- apache-rat-plugin:0.12:check (default) @ struts2-core ---
[INFO] Added 1 additional default licenses.
[INFO] Added 1 custom approved licenses.
[INFO] Will parse SCM ignores for exclusions...
[INFO] Finished adding exclusions from SCM ignore files.
[INFO] 61 implicit excludes (use -debug for more details).
[INFO] Exclude: src/main/resources/org/apache/struts2/static/domTT.js
[INFO] Exclude: src/site/resources/tags/**/*.html
[INFO] Exclude: src/main/resources/*LICENSE.txt
[INFO] Exclude: src/test/resources/**/*.txt
[INFO] Exclude: src/main/webapp/**/*.css
[INFO] Exclude: src/main/webapp/**/*.map
[INFO] Exclude: src/main/webapp/**/*.js
[INFO] Exclude: src/main/webapp/**/*.svg
[INFO] Exclude: src/main/webapp/**/*.txt
[INFO] Exclude: src/main/resources/**/sitegraph-usage.txt
[INFO] Exclude: src/main/resources/**/docs-urls.txt
[INFO] Exclude: src/etc/header.txt
[INFO] Exclude: src/main/resources/static/css/**/*.css
[INFO] Exclude: src/main/resources/static/js/**/*.js
[INFO] Exclude: src/main/resources/docs.cfg
[INFO] Exclude: src/main/webapp/fonts/**/*
[INFO] 1582 resources included (use -debug for more details)
[INFO] ------------------------------------------------------------------------
[INFO] Reactor Summary:
[INFO] 
[INFO] Struts 2 Bill of Materials ......................... SUCCESS [  1.400 s]
[INFO] Struts 2 2.6-SNAPSHOT .............................. SUCCESS [  1.480 s]
[INFO] Struts 2 Core ...................................... FAILURE [01:35 min]
[INFO] Struts Plugins ..................................... SKIPPED
[INFO] Struts 2 Configuration Browser Plugin .............. SKIPPED
[INFO] Struts 2 Sitemesh Plugin ........................... SKIPPED
[INFO] Struts 2 Tiles Plugin .............................. SKIPPED
[INFO] Struts 2 DWR Plugin ................................ SKIPPED
[INFO] Struts 2 Spring Plugin ............................. SKIPPED
[INFO] Struts 2 Convention Plugin ......................... SKIPPED
[INFO] Struts 2 JUnit Plugin .............................. SKIPPED
[INFO] Struts 2 JSON Plugin ............................... SKIPPED
[INFO] Struts 2 Bean Validation Plugin .................... SKIPPED
[INFO] Struts 2 Async Plugin .............................. SKIPPED
[INFO] Struts 2 Webapps ................................... SKIPPED
[INFO] Struts 2 Showcase Webapp ........................... SKIPPED
[INFO] Struts 2 REST Plugin ............................... SKIPPED
[INFO] Struts 2 Rest Showcase Webapp ...................... SKIPPED
[INFO] Struts 2 CDI Plugin ................................ SKIPPED
[INFO] Struts 2 Embedded JSP Plugin ....................... SKIPPED
[INFO] Struts 2 GXP Plugin ................................ SKIPPED
[INFO] Struts 2 Jasper Reports Plugin ..................... SKIPPED
[INFO] Struts 2 Java Templates Plugin ..................... SKIPPED
[INFO] Struts 2 JFreeChart Plugin ......................... SKIPPED
[INFO] Struts 2 OSGi Plugin ............................... SKIPPED
[INFO] Struts 2 OVal Plugin ............................... SKIPPED
[INFO] Struts 2 Pell Multipart Plugin ..................... SKIPPED
[INFO] Struts 2 Plexus Plugin ............................. SKIPPED
[INFO] Struts 2 Portlet Plugin ............................ SKIPPED
[INFO] Struts 2 Portlet Tiles Plugin ...................... SKIPPED
[INFO] DEPRECATED: Struts 2 Sitegraph Plugin .............. SKIPPED
[INFO] Struts 2 TestNG Plugin ............................. SKIPPED
[INFO] Struts OSGi Bundles ................................ SKIPPED
[INFO] Struts 2 OSGi Admin Bundle ......................... SKIPPED
[INFO] Struts 2 OSGi Demo Bundle 2.6-SNAPSHOT ............. SKIPPED
[INFO] ------------------------------------------------------------------------
[INFO] BUILD FAILURE
[INFO] ------------------------------------------------------------------------
[INFO] Total time: 01:40 min
[INFO] Finished at: 2018-11-19T10:17:52Z
[INFO] ------------------------------------------------------------------------
[ERROR] Failed to execute goal org.apache.rat:apache-rat-plugin:0.12:check (default) on project
struts2-core: Cannot read header: src/test/resources/XSLTResultTest-val.xml (No such file
or directory) -> [Help 1]
[ERROR] 
[ERROR] To see the full stack trace of the errors, re-run Maven with the -e switch.
[ERROR] Re-run Maven using the -X switch to enable full debug logging.
[ERROR] 
[ERROR] For more information about the errors and possible solutions, please read the following
articles:
[ERROR] [Help 1] http://cwiki.apache.org/confluence/display/MAVEN/MojoExecutionException
[ERROR] 
[ERROR] After correcting the problems, you can resume the build with the command
[ERROR]   mvn <goals> -rf :struts2-core
Build step 'Execute shell' marked build as failure
[locks-and-latches] Releasing all the locks
[locks-and-latches] All the locks released
Setting MAVEN_3_LATEST__HOME=/home/jenkins/tools/maven/latest3/

---------------------------------------------------------------------
To unsubscribe, e-mail: dev-unsubscribe@struts.apache.org
For additional commands, e-mail: dev-help@struts.apache.org


Mime
View raw message