struts-dev mailing list archives

Site index · List index
Message view « Date » · « Thread »
Top « Date » · « Thread »
From Apache Jenkins Server <jenk...@builds.apache.org>
Subject Build failed in Jenkins: Struts-support-2-3-JDK6 #21
Date Wed, 29 Nov 2017 10:45:18 GMT
See <https://builds.apache.org/job/Struts-support-2-3-JDK6/21/display/redirect>

------------------------------------------
[...truncated 8.06 KB...]
[WARNING] 'reporting.plugins.plugin.version' for org.codehaus.mojo:rat-maven-plugin is missing.
@ org.apache.struts:struts2-parent:2.3.35-SNAPSHOT, <https://builds.apache.org/job/Struts-support-2-3-JDK6/ws/pom.xml,>
line 348, column 21
[WARNING] 
[WARNING] Some problems were encountered while building the effective model for org.apache.struts:struts2-javatemplates-plugin:jar:2.3.35-SNAPSHOT
[WARNING] 'reporting.plugins.plugin.version' for org.codehaus.mojo:rat-maven-plugin is missing.
@ org.apache.struts:struts2-parent:2.3.35-SNAPSHOT, <https://builds.apache.org/job/Struts-support-2-3-JDK6/ws/pom.xml,>
line 348, column 21
[WARNING] 
[WARNING] Some problems were encountered while building the effective model for org.apache.struts:struts2-jfreechart-plugin:jar:2.3.35-SNAPSHOT
[WARNING] 'reporting.plugins.plugin.version' for org.codehaus.mojo:rat-maven-plugin is missing.
@ org.apache.struts:struts2-parent:2.3.35-SNAPSHOT, <https://builds.apache.org/job/Struts-support-2-3-JDK6/ws/pom.xml,>
line 348, column 21
[WARNING] 
[WARNING] Some problems were encountered while building the effective model for org.apache.struts:struts2-jsf-plugin:jar:2.3.35-SNAPSHOT
[WARNING] 'reporting.plugins.plugin.version' for org.codehaus.mojo:rat-maven-plugin is missing.
@ org.apache.struts:struts2-parent:2.3.35-SNAPSHOT, <https://builds.apache.org/job/Struts-support-2-3-JDK6/ws/pom.xml,>
line 348, column 21
[WARNING] 
[WARNING] Some problems were encountered while building the effective model for org.apache.struts:struts2-json-plugin:jar:2.3.35-SNAPSHOT
[WARNING] 'reporting.plugins.plugin.version' for org.codehaus.mojo:rat-maven-plugin is missing.
@ org.apache.struts:struts2-parent:2.3.35-SNAPSHOT, <https://builds.apache.org/job/Struts-support-2-3-JDK6/ws/pom.xml,>
line 348, column 21
[WARNING] 
[WARNING] Some problems were encountered while building the effective model for org.apache.struts:struts2-junit-plugin:jar:2.3.35-SNAPSHOT
[WARNING] 'reporting.plugins.plugin.version' for org.codehaus.mojo:rat-maven-plugin is missing.
@ org.apache.struts:struts2-parent:2.3.35-SNAPSHOT, <https://builds.apache.org/job/Struts-support-2-3-JDK6/ws/pom.xml,>
line 348, column 21
[WARNING] 
[WARNING] Some problems were encountered while building the effective model for org.apache.struts:struts2-osgi-plugin:jar:2.3.35-SNAPSHOT
[WARNING] 'reporting.plugins.plugin.version' for org.codehaus.mojo:rat-maven-plugin is missing.
@ org.apache.struts:struts2-parent:2.3.35-SNAPSHOT, <https://builds.apache.org/job/Struts-support-2-3-JDK6/ws/pom.xml,>
line 348, column 21
[WARNING] 
[WARNING] Some problems were encountered while building the effective model for org.apache.struts:struts2-oval-plugin:jar:2.3.35-SNAPSHOT
[WARNING] 'reporting.plugins.plugin.version' for org.codehaus.mojo:rat-maven-plugin is missing.
@ org.apache.struts:struts2-parent:2.3.35-SNAPSHOT, <https://builds.apache.org/job/Struts-support-2-3-JDK6/ws/pom.xml,>
line 348, column 21
[WARNING] 
[WARNING] Some problems were encountered while building the effective model for org.apache.struts:struts2-pell-multipart-plugin:jar:2.3.35-SNAPSHOT
[WARNING] 'reporting.plugins.plugin.version' for org.codehaus.mojo:rat-maven-plugin is missing.
@ org.apache.struts:struts2-parent:2.3.35-SNAPSHOT, <https://builds.apache.org/job/Struts-support-2-3-JDK6/ws/pom.xml,>
line 348, column 21
[WARNING] 
[WARNING] Some problems were encountered while building the effective model for org.apache.struts:struts2-plexus-plugin:jar:2.3.35-SNAPSHOT
[WARNING] 'reporting.plugins.plugin.version' for org.codehaus.mojo:rat-maven-plugin is missing.
@ org.apache.struts:struts2-parent:2.3.35-SNAPSHOT, <https://builds.apache.org/job/Struts-support-2-3-JDK6/ws/pom.xml,>
line 348, column 21
[WARNING] 
[WARNING] Some problems were encountered while building the effective model for org.apache.struts:struts2-portlet-plugin:jar:2.3.35-SNAPSHOT
[WARNING] 'reporting.plugins.plugin.version' for org.codehaus.mojo:rat-maven-plugin is missing.
@ org.apache.struts:struts2-parent:2.3.35-SNAPSHOT, <https://builds.apache.org/job/Struts-support-2-3-JDK6/ws/pom.xml,>
line 348, column 21
[WARNING] 
[WARNING] Some problems were encountered while building the effective model for org.apache.struts:struts2-portlet-tiles-plugin:jar:2.3.35-SNAPSHOT
[WARNING] 'reporting.plugins.plugin.version' for org.codehaus.mojo:rat-maven-plugin is missing.
@ org.apache.struts:struts2-parent:2.3.35-SNAPSHOT, <https://builds.apache.org/job/Struts-support-2-3-JDK6/ws/pom.xml,>
line 348, column 21
[WARNING] 
[WARNING] Some problems were encountered while building the effective model for org.apache.struts:struts2-rest-plugin:jar:2.3.35-SNAPSHOT
[WARNING] 'reporting.plugins.plugin.version' for org.codehaus.mojo:rat-maven-plugin is missing.
@ org.apache.struts:struts2-parent:2.3.35-SNAPSHOT, <https://builds.apache.org/job/Struts-support-2-3-JDK6/ws/pom.xml,>
line 348, column 21
[WARNING] 
[WARNING] Some problems were encountered while building the effective model for org.apache.struts:struts2-sitemesh-plugin:jar:2.3.35-SNAPSHOT
[WARNING] 'reporting.plugins.plugin.version' for org.codehaus.mojo:rat-maven-plugin is missing.
@ org.apache.struts:struts2-parent:2.3.35-SNAPSHOT, <https://builds.apache.org/job/Struts-support-2-3-JDK6/ws/pom.xml,>
line 348, column 21
[WARNING] 
[WARNING] Some problems were encountered while building the effective model for org.apache.struts:struts2-spring-plugin:jar:2.3.35-SNAPSHOT
[WARNING] 'reporting.plugins.plugin.version' for org.codehaus.mojo:rat-maven-plugin is missing.
@ org.apache.struts:struts2-parent:2.3.35-SNAPSHOT, <https://builds.apache.org/job/Struts-support-2-3-JDK6/ws/pom.xml,>
line 348, column 21
[WARNING] 
[WARNING] Some problems were encountered while building the effective model for org.apache.struts:struts2-struts1-plugin:jar:2.3.35-SNAPSHOT
[WARNING] 'reporting.plugins.plugin.version' for org.codehaus.mojo:rat-maven-plugin is missing.
@ org.apache.struts:struts2-parent:2.3.35-SNAPSHOT, <https://builds.apache.org/job/Struts-support-2-3-JDK6/ws/pom.xml,>
line 348, column 21
[WARNING] 
[WARNING] Some problems were encountered while building the effective model for org.apache.struts:struts2-testng-plugin:jar:2.3.35-SNAPSHOT
[WARNING] 'reporting.plugins.plugin.version' for org.codehaus.mojo:rat-maven-plugin is missing.
@ org.apache.struts:struts2-parent:2.3.35-SNAPSHOT, <https://builds.apache.org/job/Struts-support-2-3-JDK6/ws/pom.xml,>
line 348, column 21
[WARNING] 
[WARNING] Some problems were encountered while building the effective model for org.apache.struts:struts2-tiles-plugin:jar:2.3.35-SNAPSHOT
[WARNING] 'reporting.plugins.plugin.version' for org.codehaus.mojo:rat-maven-plugin is missing.
@ org.apache.struts:struts2-parent:2.3.35-SNAPSHOT, <https://builds.apache.org/job/Struts-support-2-3-JDK6/ws/pom.xml,>
line 348, column 21
[WARNING] 
[WARNING] Some problems were encountered while building the effective model for org.apache.struts:struts2-tiles3-plugin:jar:2.3.35-SNAPSHOT
[WARNING] 'reporting.plugins.plugin.version' for org.codehaus.mojo:rat-maven-plugin is missing.
@ org.apache.struts:struts2-parent:2.3.35-SNAPSHOT, <https://builds.apache.org/job/Struts-support-2-3-JDK6/ws/pom.xml,>
line 348, column 21
[WARNING] 
[WARNING] Some problems were encountered while building the effective model for org.apache.struts:struts2-plugins:pom:2.3.35-SNAPSHOT
[WARNING] 'reporting.plugins.plugin.version' for org.codehaus.mojo:rat-maven-plugin is missing.
@ org.apache.struts:struts2-parent:2.3.35-SNAPSHOT, <https://builds.apache.org/job/Struts-support-2-3-JDK6/ws/pom.xml,>
line 348, column 21
[WARNING] 
[WARNING] Some problems were encountered while building the effective model for org.apache.struts:struts2-archetype-angularjs:jar:2.3.35-SNAPSHOT
[WARNING] 'reporting.plugins.plugin.version' for org.codehaus.mojo:rat-maven-plugin is missing.
@ org.apache.struts:struts2-parent:2.3.35-SNAPSHOT, <https://builds.apache.org/job/Struts-support-2-3-JDK6/ws/pom.xml,>
line 348, column 21
[WARNING] 
[WARNING] Some problems were encountered while building the effective model for org.apache.struts:struts2-archetype-blank:jar:2.3.35-SNAPSHOT
[WARNING] 'reporting.plugins.plugin.version' for org.codehaus.mojo:rat-maven-plugin is missing.
@ org.apache.struts:struts2-parent:2.3.35-SNAPSHOT, <https://builds.apache.org/job/Struts-support-2-3-JDK6/ws/pom.xml,>
line 348, column 21
[WARNING] 
[WARNING] Some problems were encountered while building the effective model for org.apache.struts:struts2-archetype-convention:jar:2.3.35-SNAPSHOT
[WARNING] 'reporting.plugins.plugin.version' for org.codehaus.mojo:rat-maven-plugin is missing.
@ org.apache.struts:struts2-parent:2.3.35-SNAPSHOT, <https://builds.apache.org/job/Struts-support-2-3-JDK6/ws/pom.xml,>
line 348, column 21
[WARNING] 
[WARNING] Some problems were encountered while building the effective model for org.apache.struts:struts2-archetype-dbportlet:jar:2.3.35-SNAPSHOT
[WARNING] 'reporting.plugins.plugin.version' for org.codehaus.mojo:rat-maven-plugin is missing.
@ org.apache.struts:struts2-parent:2.3.35-SNAPSHOT, <https://builds.apache.org/job/Struts-support-2-3-JDK6/ws/pom.xml,>
line 348, column 21
[WARNING] 
[WARNING] Some problems were encountered while building the effective model for org.apache.struts:struts2-archetype-plugin:jar:2.3.35-SNAPSHOT
[WARNING] 'reporting.plugins.plugin.version' for org.codehaus.mojo:rat-maven-plugin is missing.
@ org.apache.struts:struts2-parent:2.3.35-SNAPSHOT, <https://builds.apache.org/job/Struts-support-2-3-JDK6/ws/pom.xml,>
line 348, column 21
[WARNING] 
[WARNING] Some problems were encountered while building the effective model for org.apache.struts:struts2-archetype-portlet:jar:2.3.35-SNAPSHOT
[WARNING] 'reporting.plugins.plugin.version' for org.codehaus.mojo:rat-maven-plugin is missing.
@ org.apache.struts:struts2-parent:2.3.35-SNAPSHOT, <https://builds.apache.org/job/Struts-support-2-3-JDK6/ws/pom.xml,>
line 348, column 21
[WARNING] 
[WARNING] Some problems were encountered while building the effective model for org.apache.struts:struts2-archetype-starter:jar:2.3.35-SNAPSHOT
[WARNING] 'reporting.plugins.plugin.version' for org.codehaus.mojo:rat-maven-plugin is missing.
@ org.apache.struts:struts2-parent:2.3.35-SNAPSHOT, <https://builds.apache.org/job/Struts-support-2-3-JDK6/ws/pom.xml,>
line 348, column 21
[WARNING] 
[WARNING] Some problems were encountered while building the effective model for org.apache.struts:struts2-archetypes:pom:2.3.35-SNAPSHOT
[WARNING] 'reporting.plugins.plugin.version' for org.codehaus.mojo:rat-maven-plugin is missing.
@ org.apache.struts:struts2-parent:2.3.35-SNAPSHOT, <https://builds.apache.org/job/Struts-support-2-3-JDK6/ws/pom.xml,>
line 348, column 21
[WARNING] 
[WARNING] Some problems were encountered while building the effective model for org.apache.struts:struts2-parent:pom:2.3.35-SNAPSHOT
[WARNING] 'reporting.plugins.plugin.version' for org.codehaus.mojo:rat-maven-plugin is missing.
@ line 348, column 21
[WARNING] 
[WARNING] It is highly recommended to fix these problems because they threaten the stability
of your build.
[WARNING] 
[WARNING] For this reason, future Maven versions might no longer support building such malformed
projects.
[WARNING] 
[INFO] ------------------------------------------------------------------------
[INFO] Reactor Build Order:
[INFO] 
[INFO] Struts 2 Bill of Materials
[INFO] Struts 2
[INFO] XWork: Core
[INFO] Struts 2 Core
[INFO] Struts Plugins
[INFO] Struts 2 Spring Plugin
[INFO] Struts 2 Convention Plugin
[INFO] Struts 2 JUnit Plugin
[INFO] Struts 2 Webapps
[INFO] Struts 2 Blank Webapp
[INFO] Struts 2 JBoss Blank Webapp
[INFO] Struts 2 Mail Reader Webapp
[INFO] Struts 2 Portlet Plugin
[INFO] Struts 2 DWR Plugin
[INFO] Struts 2 Tiles Plugin
[INFO] Struts 2 Portlet Tiles Plugin
[INFO] Struts 2 Portlet Webapp
[INFO] Struts 2 Struts 1 Plugin
[INFO] Struts 2 Dojo Plugin
[INFO] Struts 2 JSF Plugin
[INFO] Struts 2 Configuration Browser Plugin
[INFO] Struts 2 Sitemesh Plugin
[INFO] Struts 2 JSON Plugin
[INFO] Struts 2 Showcase Webapp
[INFO] Struts 2 REST Plugin
[INFO] Struts 2 Rest Showcase Webapp
[INFO] Struts 2 CDI Plugin
[INFO] Struts 2 Codebehind Plugin
[INFO] Struts 2 Embedded JSP Plugin
[INFO] Struts 2 GXP Plugin
[INFO] Struts 2 Jasper Reports Plugin
[INFO] Struts 2 Java 8 support plugin
[INFO] Struts 2 Java Templates Plugin
[INFO] Struts 2 JFreeChart Plugin
[INFO] Struts 2 OSGi Plugin
[INFO] Struts 2 OVal Plugin
[INFO] Struts 2 Pell Multipart Plugin
[INFO] Struts 2 Plexus Plugin
[INFO] Struts 2 Sitegraph Plugin
[INFO] Struts 2 TestNG Plugin
[INFO] Struts 2 Tiles 3 Plugin
[INFO] Struts OSGi Bundles
[INFO] Struts 2 OSGi Admin Bundle
[INFO] Struts 2 OSGi Demo Bundle
[INFO] Struts 2 Maven Archetypes
[INFO] Struts 2 Archetypes - Angular JS
[INFO] Struts 2 Archetypes - Blank
[INFO] Struts 2 Archetypes - Blank Convention
[INFO] Struts 2 Archetypes - Database Portlet
[INFO] Struts 2 Archetypes - Plugin
[INFO] Struts 2 Archetypes - Portlet
[INFO] Struts 2 Archetypes - Starter
[INFO]                                                                         
[INFO] ------------------------------------------------------------------------
[INFO] Building Struts 2 Bill of Materials 2.3.35-SNAPSHOT
[INFO] ------------------------------------------------------------------------
[INFO] 
[INFO] >>> maven-source-plugin:2.1.2:jar (default-cli) @ struts2-bom >>>
[INFO] 
[INFO] <<< maven-source-plugin:2.1.2:jar (default-cli) @ struts2-bom <<<
[INFO] 
[INFO] --- maven-source-plugin:2.1.2:jar (default-cli) @ struts2-bom ---
[INFO] 
[INFO] --- maven-javadoc-plugin:2.8:jar (default-cli) @ struts2-bom ---
[INFO] Not executing Javadoc as the project is not a Java classpath-capable package
[INFO] 
[INFO] --- maven-remote-resources-plugin:1.2.1:process (default) @ struts2-bom ---
[INFO] 
[INFO] --- maven-site-plugin:3.0:attach-descriptor (attach-descriptor) @ struts2-bom ---
[INFO] 
[INFO] --- maven-install-plugin:2.3.1:install (default-install) @ struts2-bom ---
[INFO] Installing <https://builds.apache.org/job/Struts-support-2-3-JDK6/ws/bom/pom.xml>
to /home/jenkins/.m2/repository/org/apache/struts/struts2-bom/2.3.35-SNAPSHOT/struts2-bom-2.3.35-SNAPSHOT.pom
[INFO] 
[INFO] --- maven-remote-resources-plugin:1.2.1:process (default) @ struts2-bom ---
[INFO] 
[INFO] --- maven-site-plugin:3.0:attach-descriptor (attach-descriptor) @ struts2-bom ---
[INFO] 
[INFO] --- maven-install-plugin:2.3.1:install (default-install) @ struts2-bom ---
[INFO] Installing <https://builds.apache.org/job/Struts-support-2-3-JDK6/ws/bom/pom.xml>
to /home/jenkins/.m2/repository/org/apache/struts/struts2-bom/2.3.35-SNAPSHOT/struts2-bom-2.3.35-SNAPSHOT.pom
[INFO] 
[INFO] --- maven-deploy-plugin:2.6:deploy (default-deploy) @ struts2-bom ---
Downloading: https://repository.apache.org/content/repositories/snapshots/org/apache/struts/struts2-bom/2.3.35-SNAPSHOT/maven-metadata.xml
[WARNING] Could not transfer metadata org.apache.struts:struts2-bom:2.3.35-SNAPSHOT/maven-metadata.xml
from/to apache.snapshots.https (https://repository.apache.org/content/repositories/snapshots):
peer not authenticated
[INFO] ------------------------------------------------------------------------
[INFO] Reactor Summary:
[INFO] 
[INFO] Struts 2 Bill of Materials ........................ FAILURE [3.076s]
[INFO] Struts 2 .......................................... SKIPPED
[INFO] XWork: Core ....................................... SKIPPED
[INFO] Struts 2 Core ..................................... SKIPPED
[INFO] Struts Plugins .................................... SKIPPED
[INFO] Struts 2 Spring Plugin ............................ SKIPPED
[INFO] Struts 2 Convention Plugin ........................ SKIPPED
[INFO] Struts 2 JUnit Plugin ............................. SKIPPED
[INFO] Struts 2 Webapps .................................. SKIPPED
[INFO] Struts 2 Blank Webapp ............................. SKIPPED
[INFO] Struts 2 JBoss Blank Webapp ....................... SKIPPED
[INFO] Struts 2 Mail Reader Webapp ....................... SKIPPED
[INFO] Struts 2 Portlet Plugin ........................... SKIPPED
[INFO] Struts 2 DWR Plugin ............................... SKIPPED
[INFO] Struts 2 Tiles Plugin ............................. SKIPPED
[INFO] Struts 2 Portlet Tiles Plugin ..................... SKIPPED
[INFO] Struts 2 Portlet Webapp ........................... SKIPPED
[INFO] Struts 2 Struts 1 Plugin .......................... SKIPPED
[INFO] Struts 2 Dojo Plugin .............................. SKIPPED
[INFO] Struts 2 JSF Plugin ............................... SKIPPED
[INFO] Struts 2 Configuration Browser Plugin ............. SKIPPED
[INFO] Struts 2 Sitemesh Plugin .......................... SKIPPED
[INFO] Struts 2 JSON Plugin .............................. SKIPPED
[INFO] Struts 2 Showcase Webapp .......................... SKIPPED
[INFO] Struts 2 REST Plugin .............................. SKIPPED
[INFO] Struts 2 Rest Showcase Webapp ..................... SKIPPED
[INFO] Struts 2 CDI Plugin ............................... SKIPPED
[INFO] Struts 2 Codebehind Plugin ........................ SKIPPED
[INFO] Struts 2 Embedded JSP Plugin ...................... SKIPPED
[INFO] Struts 2 GXP Plugin ............................... SKIPPED
[INFO] Struts 2 Jasper Reports Plugin .................... SKIPPED
[INFO] Struts 2 Java 8 support plugin .................... SKIPPED
[INFO] Struts 2 Java Templates Plugin .................... SKIPPED
[INFO] Struts 2 JFreeChart Plugin ........................ SKIPPED
[INFO] Struts 2 OSGi Plugin .............................. SKIPPED
[INFO] Struts 2 OVal Plugin .............................. SKIPPED
[INFO] Struts 2 Pell Multipart Plugin .................... SKIPPED
[INFO] Struts 2 Plexus Plugin ............................ SKIPPED
[INFO] Struts 2 Sitegraph Plugin ......................... SKIPPED
[INFO] Struts 2 TestNG Plugin ............................ SKIPPED
[INFO] Struts 2 Tiles 3 Plugin ........................... SKIPPED
[INFO] Struts OSGi Bundles ............................... SKIPPED
[INFO] Struts 2 OSGi Admin Bundle ........................ SKIPPED
[INFO] Struts 2 OSGi Demo Bundle ......................... SKIPPED
[INFO] Struts 2 Maven Archetypes ......................... SKIPPED
[INFO] Struts 2 Archetypes - Angular JS .................. SKIPPED
[INFO] Struts 2 Archetypes - Blank ....................... SKIPPED
[INFO] Struts 2 Archetypes - Blank Convention ............ SKIPPED
[INFO] Struts 2 Archetypes - Database Portlet ............ SKIPPED
[INFO] Struts 2 Archetypes - Plugin ...................... SKIPPED
[INFO] Struts 2 Archetypes - Portlet ..................... SKIPPED
[INFO] Struts 2 Archetypes - Starter ..................... SKIPPED
[INFO] ------------------------------------------------------------------------
[INFO] BUILD FAILURE
[INFO] ------------------------------------------------------------------------
[INFO] Total time: 5.513s
[INFO] Finished at: Wed Nov 29 10:45:17 UTC 2017
[INFO] Final Memory: 31M/313M
[INFO] ------------------------------------------------------------------------
[ERROR] Failed to execute goal org.apache.maven.plugins:maven-deploy-plugin:2.6:deploy (default-deploy)
on project struts2-bom: Failed to retrieve remote metadata org.apache.struts:struts2-bom:2.3.35-SNAPSHOT/maven-metadata.xml:
Could not transfer metadata org.apache.struts:struts2-bom:2.3.35-SNAPSHOT/maven-metadata.xml
from/to apache.snapshots.https (https://repository.apache.org/content/repositories/snapshots):
peer not authenticated -> [Help 1]
[ERROR] 
[ERROR] To see the full stack trace of the errors, re-run Maven with the -e switch.
[ERROR] Re-run Maven using the -X switch to enable full debug logging.
[ERROR] 
[ERROR] For more information about the errors and possible solutions, please read the following
articles:
[ERROR] [Help 1] http://cwiki.apache.org/confluence/display/MAVEN/MojoExecutionException
Build step 'Execute shell' marked build as failure
[locks-and-latches] Releasing all the locks
[locks-and-latches] All the locks released
Setting MAVEN_3_0_5_HOME=/home/jenkins/tools/maven/apache-maven-3.0.5

---------------------------------------------------------------------
To unsubscribe, e-mail: dev-unsubscribe@struts.apache.org
For additional commands, e-mail: dev-help@struts.apache.org


Mime
View raw message