struts-dev mailing list archives

Site index · List index
Message view « Date » · « Thread »
Top « Date » · « Thread »
From Apache Jenkins Server <jenk...@builds.apache.org>
Subject Build failed in Jenkins: Struts-site-javadocs #4
Date Tue, 28 Nov 2017 07:59:40 GMT
See <https://builds.apache.org/job/Struts-site-javadocs/4/display/redirect>

------------------------------------------
[...truncated 1.50 MB...]
        at java.lang.Thread.runat org.owasp.dependencycheck.analyzer.AbstractAnalyzer.analyze
java.lang.Thread.run (Thread.java:745) (Thread.java:745)

Caused by: java.io.IOException (AnalysisTask.java:88): 
    [WARNING] An error occurred while analyzing '/home/jenkins/.m2/repository/org/testng/testng/6.9.10/testng-6.9.10.jar'
(Central Analyzer).
Could not connect to MavenCentral (400): Bad Request
 (AbstractAnalyzer.java:137)
        atat org.owasp.dependencycheck.AnalysisTask.call org.owasp.dependencycheck.AnalysisTask.callat
org.owasp.dependencycheck.data.central.CentralSearch.searchSha1 (AnalysisTask.java:88) (AnalysisTask.java:37)
 (CentralSearch.java:181)
    
at     java.util.concurrent.FutureTask.run    atat org.owasp.dependencycheck.analyzer.CentralAnalyzer.fetchMavenArtifacts
org.owasp.dependencycheck.AnalysisTask.call (FutureTask.java:262) (CentralAnalyzer.java:266)
     (AnalysisTask.java:37)at
    
    atat java.util.concurrent.FutureTask.run org.owasp.dependencycheck.analyzer.CentralAnalyzer.analyzeDependency
java.util.concurrent.ThreadPoolExecutor.runWorker (FutureTask.java:262)
     (CentralAnalyzer.java:198) (ThreadPoolExecutor.java:1145)
    
at     org.owasp.dependencycheck.analyzer.AbstractAnalyzer.analyzeatat java.util.concurrent.ThreadPoolExecutor.runWorker
java.util.concurrent.ThreadPoolExecutor$Worker.run (AbstractAnalyzer.java:137) (ThreadPoolExecutor.java:1145)
    
at     org.owasp.dependencycheck.AnalysisTask.call (ThreadPoolExecutor.java:615)at
 (AnalysisTask.java:88)    
at java.lang.Thread.run     java.util.concurrent.ThreadPoolExecutor$Worker.runat (Thread.java:745)
org.owasp.dependencycheck.AnalysisTask.call (ThreadPoolExecutor.java:615)

     (AnalysisTask.java:37)at
    [WARNING] An error occurred while analyzing '/home/jenkins/.m2/repository/xpp3/xpp3_min/1.1.4c/xpp3_min-1.1.4c.jar'
(Central Analyzer).
 java.lang.Thread.runat java.util.concurrent.FutureTask.run (Thread.java:745)
 (FutureTask.java:262)
    at java.util.concurrent.ThreadPoolExecutor.runWorker[WARNING] An error occurred while
analyzing '/home/jenkins/.m2/repository/sslext/sslext/1.2-0/sslext-1.2-0.jar' (Central Analyzer).
 (ThreadPoolExecutor.java:1145)
    at java.util.concurrent.ThreadPoolExecutor$Worker.run (ThreadPoolExecutor.java:615)
    at java.lang.Thread.run (Thread.java:745)
[WARNING] An error occurred while analyzing '/home/jenkins/.m2/repository/tomcat/jasper-runtime/5.5.12/jasper-runtime-5.5.12.jar'
(Central Analyzer).
[INFO] Finished Central Analyzer (98 seconds)
[INFO] Finished Dependency Merging Analyzer (0 seconds)
[INFO] Finished Version Filter Analyzer (0 seconds)
[INFO] Finished Hint Analyzer (0 seconds)
[INFO] Created CPE Index (2 seconds)
[INFO] Finished CPE Analyzer (3 seconds)
[INFO] Finished False Positive Analyzer (0 seconds)
[INFO] Finished Cpe Suppression Analyzer (0 seconds)
[INFO] Finished NVD CVE Analyzer (0 seconds)
[INFO] Finished Vulnerability Suppression Analyzer (0 seconds)
[INFO] Finished Dependency Bundling Analyzer (0 seconds)
[INFO] Analysis Complete (105 seconds)
[WARNING] 

One or more dependencies were identified with known vulnerabilities in Struts 2:

org.mortbay.jetty-5.1.4.jar (cpe:/a:jetty:jetty:5.1.4, cpe:/a:jetty:jetty_http_server:5.1.4,
jetty:org.mortbay.jetty:5.1.4, cpe:/a:mortbay_jetty:jetty:5.1.4) : CVE-2007-5615
struts-annotations-1.0.6.jar (org.apache.struts:struts-annotations:1.0.6, cpe:/a:apache:struts:1.0.6)
: CVE-2006-1548, CVE-2006-1547, CVE-2006-1546
struts-core-1.3.8.jar (org.apache.struts:struts-core:1.3.8, cpe:/a:apache:struts:1.3.8) :
CVE-2016-1182, CVE-2016-1181, CVE-2015-0899, CVE-2014-0114
struts-tiles-1.3.8.jar (cpe:/a:apache:tiles:1.3.8, cpe:/a:apache:struts:1.3.8, org.apache.struts:struts-tiles:1.3.8)
: CVE-2016-1182, CVE-2016-1181, CVE-2015-0899, CVE-2014-0114
juli-6.0.18.jar (cpe:/a:apache_tomcat:apache_tomcat:6.0.18, cpe:/a:apache:tomcat:6.0.18, cpe:/a:apache_software_foundation:tomcat:6.0.18,
org.apache.tomcat:juli:6.0.18) : CVE-2017-6056, CVE-2017-5647, CVE-2016-8735, CVE-2016-6816,
CVE-2016-6797, CVE-2016-6796, CVE-2016-6794, CVE-2016-6325, CVE-2016-5425, CVE-2016-5388,
CVE-2016-5018, CVE-2016-0762, CVE-2016-0714, CVE-2016-0706, CVE-2015-5345, CVE-2015-5174,
CVE-2014-7810, CVE-2014-0230, CVE-2014-0227, CVE-2014-0119, CVE-2014-0099, CVE-2014-0096,
CVE-2014-0075, CVE-2013-4590, CVE-2013-4444, CVE-2013-4322, CVE-2013-4286, CVE-2013-2185,
CVE-2012-5887, CVE-2012-5886, CVE-2012-5885, CVE-2012-5568, CVE-2012-4534, CVE-2012-4431,
CVE-2012-3546, CVE-2012-3544, CVE-2012-2733, CVE-2012-0022, CVE-2011-5064, CVE-2011-5063,
CVE-2011-5062, CVE-2011-4858, CVE-2011-3190, CVE-2011-2526, CVE-2011-2204, CVE-2011-1184,
CVE-2011-0534, CVE-2011-0013, CVE-2010-4312, CVE-2010-4172, CVE-2010-3718, CVE-2010-2227,
CVE-2010-1157, CVE-2009-3548, CVE-2009-2902, CVE-2009-2901, CVE-2009-2693, CVE-2009-0783,
CVE-2008-5515
bsh-2.0b4.jar (cpe:/a:beanshell_project:beanshell:2.0.b4, org.beanshell:bsh:2.0b4) : CVE-2016-2510
spring-core-4.1.9.RELEASE.jar (cpe:/a:springsource:spring_framework:4.1.9, cpe:/a:pivotal:spring_framework:4.1.9,
cpe:/a:vmware:springsource_spring_framework:4.1.9, cpe:/a:pivotal_software:spring_framework:4.1.9,
org.springframework:spring-core:4.1.9.RELEASE) : CVE-2016-5007
dwr-1.1.1.jar (uk.ltd.getahead:dwr:1.1.1, cpe:/a:getahead:direct_web_remoting:1.1.1) : CVE-2007-0185,
CVE-2007-0184, CVE-2006-6916


See the dependency-check report for more details.


[INFO] ------------------------------------------------------------------------
[INFO] Reactor Summary:
[INFO] 
[INFO] Struts 2 Bill of Materials ......................... SUCCESS [  1.234 s]
[INFO] Struts 2 ........................................... FAILURE [08:17 min]
[INFO] Struts 2 Core ...................................... SKIPPED
[INFO] Struts Plugins ..................................... SKIPPED
[INFO] Struts 2 Configuration Browser Plugin .............. SKIPPED
[INFO] Struts 2 Sitemesh Plugin ........................... SKIPPED
[INFO] Struts 2 Tiles Plugin .............................. SKIPPED
[INFO] Struts 2 DWR Plugin ................................ SKIPPED
[INFO] Struts 2 Spring Plugin ............................. SKIPPED
[INFO] Struts 2 Convention Plugin ......................... SKIPPED
[INFO] Struts 2 JUnit Plugin .............................. SKIPPED
[INFO] Struts 2 JSON Plugin ............................... SKIPPED
[INFO] Struts 2 Bean Validation Plugin .................... SKIPPED
[INFO] Struts 2 Webapps ................................... SKIPPED
[INFO] Struts 2 Showcase Webapp ........................... SKIPPED
[INFO] Struts 2 REST Plugin ............................... SKIPPED
[INFO] Struts 2 Rest Showcase Webapp ...................... SKIPPED
[INFO] Struts 2 CDI Plugin ................................ SKIPPED
[INFO] Struts 2 Embedded JSP Plugin ....................... SKIPPED
[INFO] Struts 2 GXP Plugin ................................ SKIPPED
[INFO] Struts 2 Jasper Reports Plugin ..................... SKIPPED
[INFO] Struts 2 Java Templates Plugin ..................... SKIPPED
[INFO] Struts 2 JFreeChart Plugin ......................... SKIPPED
[INFO] Struts 2 OSGi Plugin ............................... SKIPPED
[INFO] Struts 2 OVal Plugin ............................... SKIPPED
[INFO] Struts 2 Pell Multipart Plugin ..................... SKIPPED
[INFO] Struts 2 Plexus Plugin ............................. SKIPPED
[INFO] Struts 2 Portlet Plugin ............................ SKIPPED
[INFO] Struts 2 Portlet Tiles Plugin ...................... SKIPPED
[INFO] DEPRECATED: Struts 2 Sitegraph Plugin .............. SKIPPED
[INFO] Struts 2 TestNG Plugin ............................. SKIPPED
[INFO] Struts OSGi Bundles ................................ SKIPPED
[INFO] Struts 2 OSGi Admin Bundle ......................... SKIPPED
[INFO] Struts 2 OSGi Demo Bundle .......................... SKIPPED
[INFO] Struts 2 Assembly .................................. SKIPPED
[INFO] ------------------------------------------------------------------------
[INFO] BUILD FAILURE
[INFO] ------------------------------------------------------------------------
[INFO] Total time: 08:22 min
[INFO] Finished at: 2017-11-28T07:59:38Z
[INFO] Final Memory: 75M/5789M
[INFO] ------------------------------------------------------------------------
[ERROR] Failed to execute goal org.apache.maven.plugins:maven-site-plugin:3.5.1:site (default-cli)
on project struts2-parent: Error generating dependency-check-maven:3.0.1:aggregate: One or
more exceptions occurred during dependency-check analysis: One or more exceptions occurred
during dependency-check analysis
[ERROR] 	Could not connect to Central search. Analysis failed.
[ERROR] 	Could not connect to Central search. Analysis failed.
[ERROR] 	Could not connect to Central search. Analysis failed.
[ERROR] 	Could not connect to Central search. Analysis failed.
[ERROR] 	Could not connect to Central search. Analysis failed.
[ERROR] 	Could not connect to Central search. Analysis failed.
[ERROR] 	Could not connect to Central search. Analysis failed.
[ERROR] 	Could not connect to Central search. Analysis failed.
[ERROR] 	Could not connect to Central search. Analysis failed.
[ERROR] 	Could not connect to Central search. Analysis failed.
[ERROR] 	Could not connect to Central search. Analysis failed.
[ERROR] 	Could not connect to Central search. Analysis failed.
[ERROR] 	Could not connect to Central search. Analysis failed.
[ERROR] 	Could not connect to Central search. Analysis failed.
[ERROR] 	Could not connect to Central search. Analysis failed.
[ERROR] 	Could not connect to Central search. Analysis failed.
[ERROR] 	Could not connect to Central search. Analysis failed.
[ERROR] 	Could not connect to Central search. Analysis failed.
[ERROR] 	Could not connect to Central search. Analysis failed.
[ERROR] 	Could not connect to Central search. Analysis failed.
[ERROR] 	Could not connect to Central search. Analysis failed.
[ERROR] 	Could not connect to Central search. Analysis failed.
[ERROR] 	Could not connect to Central search. Analysis failed.
[ERROR] 	Could not connect to Central search. Analysis failed.
[ERROR] 	Could not connect to Central search. Analysis failed.
[ERROR] 	Could not connect to Central search. Analysis failed.
[ERROR] 	Could not connect to Central search. Analysis failed.
[ERROR] 	Could not connect to Central search. Analysis failed.
[ERROR] 	Could not connect to Central search. Analysis failed.
[ERROR] 	Could not connect to Central search. Analysis failed.
[ERROR] 	Could not connect to Central search. Analysis failed.
[ERROR] 	Could not connect to Central search. Analysis failed.
[ERROR] 	Could not connect to Central search. Analysis failed.
[ERROR] 	Could not connect to Central search. Analysis failed.
[ERROR] 	Could not connect to Central search. Analysis failed.
[ERROR] 	Could not connect to Central search. Analysis failed.
[ERROR] 	Could not connect to Central search. Analysis failed.
[ERROR] 	Could not connect to Central search. Analysis failed.
[ERROR] 	Could not connect to Central search. Analysis failed.
[ERROR] 	Could not connect to Central search. Analysis failed.
[ERROR] 	Could not connect to Central search. Analysis failed.
[ERROR] 	Could not connect to Central search. Analysis failed.
[ERROR] 	Could not connect to Central search. Analysis failed.
[ERROR] 	Could not connect to Central search. Analysis failed.
[ERROR] 	Could not connect to Central search. Analysis failed.
[ERROR] 	Could not connect to Central search. Analysis failed.
[ERROR] 	Could not connect to Central search. Analysis failed.
[ERROR] 	Could not connect to Central search. Analysis failed.
[ERROR] 	Could not connect to Central search. Analysis failed.
[ERROR] 	Could not connect to Central search. Analysis failed.
[ERROR] 	Could not connect to Central search. Analysis failed.
[ERROR] 	Could not connect to Central search. Analysis failed.
[ERROR] 	Could not connect to Central search. Analysis failed.
[ERROR] 	Could not connect to Central search. Analysis failed.
[ERROR] 	Could not connect to Central search. Analysis failed.
[ERROR] 	Could not connect to Central search. Analysis failed.
[ERROR] 	Could not connect to Central search. Analysis failed.
[ERROR] 	Could not connect to Central search. Analysis failed.
[ERROR] 	Could not connect to Central search. Analysis failed.
[ERROR] 	Could not connect to Central search. Analysis failed.
[ERROR] 	Could not connect to Central search. Analysis failed.
[ERROR] 	Could not connect to Central search. Analysis failed.
[ERROR] 	Could not connect to Central search. Analysis failed.
[ERROR] 	Could not connect to Central search. Analysis failed.
[ERROR] 	Could not connect to Central search. Analysis failed.
[ERROR] 	Could not connect to Central search. Analysis failed.
[ERROR] 	Could not connect to Central search. Analysis failed.
[ERROR] 	Could not connect to Central search. Analysis failed.
[ERROR] 	Could not connect to Central search. Analysis failed.
[ERROR] 	Could not connect to Central search. Analysis failed.
[ERROR] 	Could not connect to Central search. Analysis failed.
[ERROR] 	Could not connect to Central search. Analysis failed.
[ERROR] 	Could not connect to Central search. Analysis failed.
[ERROR] 	Could not connect to Central search. Analysis failed.
[ERROR] 	Could not connect to Central search. Analysis failed.
[ERROR] 	Could not connect to Central search. Analysis failed.
[ERROR] 	Could not connect to Central search. Analysis failed.
[ERROR] 	Could not connect to Central search. Analysis failed.
[ERROR] 	Could not connect to Central search. Analysis failed.
[ERROR] 	Could not connect to Central search. Analysis failed.
[ERROR] 	Could not connect to Central search. Analysis failed.
[ERROR] 	Could not connect to Central search. Analysis failed.
[ERROR] 	Could not connect to Central search. Analysis failed.
[ERROR] 	Could not connect to Central search. Analysis failed.
[ERROR] 	Could not connect to Central search. Analysis failed.
[ERROR] 	Could not connect to Central search. Analysis failed.
[ERROR] 	Could not connect to Central search. Analysis failed.
[ERROR] 	Could not connect to Central search. Analysis failed.
[ERROR] 	Could not connect to Central search. Analysis failed.
[ERROR] 	Could not connect to Central search. Analysis failed.
[ERROR] 	Could not connect to Central search. Analysis failed.
[ERROR] 	Could not connect to Central search. Analysis failed.
[ERROR] 	Could not connect to Central search. Analysis failed.
[ERROR] 	Could not connect to Central search. Analysis failed.
[ERROR] 	Could not connect to Central search. Analysis failed.
[ERROR] 	Could not connect to Central search. Analysis failed.
[ERROR] 	Could not connect to Central search. Analysis failed.
[ERROR] 	Could not connect to Central search. Analysis failed.
[ERROR] 	Could not connect to Central search. Analysis failed.
[ERROR] 	Could not connect to Central search. Analysis failed.
[ERROR] 	Could not connect to Central search. Analysis failed.
[ERROR] 	Could not connect to Central search. Analysis failed.
[ERROR] 	Could not connect to Central search. Analysis failed.
[ERROR] 	Could not connect to Central search. Analysis failed.
[ERROR] 	Could not connect to Central search. Analysis failed.
[ERROR] 	Could not connect to Central search. Analysis failed.
[ERROR] 	Could not connect to Central search. Analysis failed.
[ERROR] 	Could not connect to Central search. Analysis failed.
[ERROR] 	Could not connect to Central search. Analysis failed.
[ERROR] 	Could not connect to Central search. Analysis failed.
[ERROR] 	Could not connect to Central search. Analysis failed.
[ERROR] 	Could not connect to Central search. Analysis failed.
[ERROR] 	Could not connect to Central search. Analysis failed.
[ERROR] 	Could not connect to Central search. Analysis failed.
[ERROR] 	Could not connect to Central search. Analysis failed.
[ERROR] 	Could not connect to Central search. Analysis failed.
[ERROR] 	Could not connect to Central search. Analysis failed.
[ERROR] 	Could not connect to Central search. Analysis failed.
[ERROR] 	Could not connect to Central search. Analysis failed.
[ERROR] 	Could not connect to Central search. Analysis failed.
[ERROR] 	Could not connect to Central search. Analysis failed.
[ERROR] 	Could not connect to Central search. Analysis failed.
[ERROR] 	Could not connect to Central search. Analysis failed.
[ERROR] 	Could not connect to Central search. Analysis failed.
[ERROR] 	Could not connect to Central search. Analysis failed.
[ERROR] 	Could not connect to Central search. Analysis failed.
[ERROR] 	Could not connect to Central search. Analysis failed.
[ERROR] 	Could not connect to Central search. Analysis failed.
[ERROR] 	Could not connect to Central search. Analysis failed.
[ERROR] 	Could not connect to Central search. Analysis failed.
[ERROR] 	Could not connect to Central search. Analysis failed.
[ERROR] 	Could not connect to Central search. Analysis failed.
[ERROR] -> [Help 1]
[ERROR] 
[ERROR] To see the full stack trace of the errors, re-run Maven with the -e switch.
[ERROR] Re-run Maven using the -X switch to enable full debug logging.
[ERROR] 
[ERROR] For more information about the errors and possible solutions, please read the following
articles:
[ERROR] [Help 1] http://cwiki.apache.org/confluence/display/MAVEN/MojoExecutionException
[ERROR] 
[ERROR] After correcting the problems, you can resume the build with the command
[ERROR]   mvn <goals> -rf :struts2-parent
Build step 'Execute shell' marked build as failure
Setting MAVEN_3_LATEST__HOME=/home/jenkins/tools/maven/latest3/

---------------------------------------------------------------------
To unsubscribe, e-mail: dev-unsubscribe@struts.apache.org
For additional commands, e-mail: dev-help@struts.apache.org


Mime
View raw message