struts-dev mailing list archives

Site index · List index
Message view « Date » · « Thread »
Top « Date » · « Thread »
From Apache Jenkins Server <jenk...@builds.apache.org>
Subject Build failed in Jenkins: Struts-master-JDK7-dependency-check #15
Date Sun, 26 Nov 2017 22:30:43 GMT
See <https://builds.apache.org/job/Struts-master-JDK7-dependency-check/15/display/redirect>

------------------------------------------
[...truncated 1.11 MB...]
    at org.owasp.dependencycheck.analyzer.AbstractAnalyzer.analyze java.util.concurrent.ThreadPoolExecutor$Worker.run
(FutureTask.java:262) (AbstractAnalyzer.java:137)
     (ThreadPoolExecutor.java:615)
     (AbstractAnalyzer.java:137)at
    at org.owasp.dependencycheck.AnalysisTask.call java.util.concurrent.ThreadPoolExecutor.runWorker
 (AnalysisTask.java:88)     org.owasp.dependencycheck.AnalysisTask.call (ThreadPoolExecutor.java:1145)at
     org.owasp.dependencycheck.analyzer.AbstractAnalyzer.analyzeat java.util.concurrent.ThreadPoolExecutor$Worker.run
(AbstractAnalyzer.java:137) (ThreadPoolExecutor.java:615)
    atat java.util.concurrent.ThreadPoolExecutor$Worker.run org.owasp.dependencycheck.AnalysisTask.call
 (ThreadPoolExecutor.java:615) (AnalysisTask.java:88)    
    atat java.lang.Thread.run org.owasp.dependencycheck.AnalysisTask.call (AnalysisTask.java:88)
(Thread.java:745)
     java.lang.Thread.runat org.owasp.dependencycheck.AnalysisTask.call
     (Thread.java:745)at
 java.lang.Thread.run[WARNING] An error occurred while analyzing '/home/jenkins/.m2/repository/org/beanshell/bsh/2.0b4/bsh-2.0b4.jar'
(Central Analyzer).
at java.util.concurrent.ThreadPoolExecutor.runWorker
    Could not connect to MavenCentral (400): Bad Requestat
 java.util.concurrent.ThreadPoolExecutor.runWorker    at org.owasp.dependencycheck.data.central.CentralSearch.searchSha1
java.util.concurrent.ThreadPoolExecutor.runWorker (ThreadPoolExecutor.java:1145) (CentralSearch.java:181)
    at (AnalysisTask.java:37) java.util.concurrent.ThreadPoolExecutor$Worker.run
    at (ThreadPoolExecutor.java:615) java.util.concurrent.ThreadPoolExecutor.runWorker
    at
     (AnalysisTask.java:37)at
     java.lang.Thread.runat java.util.concurrent.FutureTask.run java.lang.Thread.run (Thread.java:745)
(FutureTask.java:262)
 (Thread.java:745) (ThreadPoolExecutor.java:1145)
Caused by: java.io.IOException: atCould not connect to MavenCentral (400): Bad Request java.util.concurrent.FutureTask.run
     (ThreadPoolExecutor.java:1145)at (FutureTask.java:262) org.owasp.dependencycheck.data.central.CentralSearch.searchSha1
    
    at org.owasp.dependencycheck.analyzer.CentralAnalyzer.fetchMavenArtifacts org.owasp.dependencycheck.AnalysisTask.call
(ThreadPoolExecutor.java:1145)
    at (Thread.java:745) java.util.concurrent.ThreadPoolExecutor$Worker.run
 org.owasp.dependencycheck.AnalysisTask.call (ThreadPoolExecutor.java:615)[WARNING] An error
occurred while analyzing '/home/jenkins/.m2/repository/oro/oro/2.0.8/oro-2.0.8.jar' (Central
Analyzer).
 (AnalysisTask.java:37)
    
 (AnalysisTask.java:37)
    at
     java.util.concurrent.FutureTask.runat java.lang.Thread.run (FutureTask.java:262)
[WARNING] An error occurred while analyzing '/home/jenkins/.m2/repository/org/slf4j/slf4j-simple/1.7.12/slf4j-simple-1.7.12.jar'
(Central Analyzer).
at java.util.concurrent.FutureTask.run (AnalysisTask.java:37)
    
    at (AnalysisTask.java:88) java.lang.Thread.run
    at (CentralAnalyzer.java:266) org.owasp.dependencycheck.AnalysisTask.call
     (CentralSearch.java:181) (AnalysisTask.java:37)at
    at java.util.concurrent.FutureTask.runat (FutureTask.java:262) java.util.concurrent.ThreadPoolExecutor.runWorker
    at java.util.concurrent.ThreadPoolExecutor.runWorker
 (ThreadPoolExecutor.java:1145) (ThreadPoolExecutor.java:1145)    
    atat java.util.concurrent.ThreadPoolExecutor$Worker.run java.util.concurrent.ThreadPoolExecutor$Worker.run
     (ThreadPoolExecutor.java:615) (ThreadPoolExecutor.java:615)
    at java.lang.Thread.run
    [WARNING] An error occurred while analyzing '/home/jenkins/.m2/repository/org/testng/testng/5.14.10/testng-5.14.10.jar'
(Central Analyzer).

    atat java.util.concurrent.ThreadPoolExecutor$Worker.run java.lang.Thread.run
     org.owasp.dependencycheck.analyzer.CentralAnalyzer.analyzeDependencyat java.util.concurrent.ThreadPoolExecutor$Worker.run
     (CentralAnalyzer.java:198) (Thread.java:745)
    at (FutureTask.java:262) org.owasp.dependencycheck.analyzer.AbstractAnalyzer.analyze
    at (AbstractAnalyzer.java:137) java.util.concurrent.FutureTask.run
     (Thread.java:745)at (FutureTask.java:262) org.owasp.dependencycheck.AnalysisTask.call
    at (AnalysisTask.java:88)    
    atat java.util.concurrent.ThreadPoolExecutor.runWorker org.owasp.dependencycheck.AnalysisTask.call
java.util.concurrent.ThreadPoolExecutor.runWorker (ThreadPoolExecutor.java:1145) (AnalysisTask.java:37)
     (ThreadPoolExecutor.java:1145)at
    
Caused by: java.io.IOExceptionat:  java.util.concurrent.ThreadPoolExecutor.runWorkerCould
not connect to MavenCentral (400): Bad Request

 (ThreadPoolExecutor.java:1145) (ThreadPoolExecutor.java:615)[WARNING] An error occurred while
analyzing '/home/jenkins/.m2/repository/org/freemarker/freemarker/2.3.26-incubating/freemarker-2.3.26-incubating.jar'
(Central Analyzer).
at org.owasp.dependencycheck.analyzer.CentralAnalyzer.fetchMavenArtifacts (Thread.java:745)
 (CentralAnalyzer.java:266) (ThreadPoolExecutor.java:615)
     (Thread.java:745)at
at java.util.concurrent.ThreadPoolExecutor.runWorker[WARNING] An error occurred while analyzing
'/home/jenkins/.m2/repository/org/javassist/javassist/3.20.0-GA/javassist-3.20.0-GA.jar' (Central
Analyzer).
 (ThreadPoolExecutor.java:1145) java.lang.Thread.run[WARNING] An error occurred while analyzing
'/home/jenkins/.m2/repository/org/springframework/spring-expression/4.1.9.RELEASE/spring-expression-4.1.9.RELEASE.jar'
(Central Analyzer).

    
    at
        atat java.util.concurrent.ThreadPoolExecutor$Worker.run org.owasp.dependencycheck.data.central.CentralSearch.searchSha1at
java.util.concurrent.ThreadPoolExecutor$Worker.run (CentralSearch.java:181) java.util.concurrent.ThreadPoolExecutor$Worker.run
 (ThreadPoolExecutor.java:615)    
at     org.owasp.dependencycheck.analyzer.CentralAnalyzer.fetchMavenArtifactsat java.lang.Thread.run
 (CentralAnalyzer.java:266)     (Thread.java:745)at
 (ThreadPoolExecutor.java:615)[WARNING] An error occurred while analyzing '/home/jenkins/.m2/repository/org/slf4j/slf4j-api/1.7.12/slf4j-api-1.7.12.jar'
(Central Analyzer).
 (ThreadPoolExecutor.java:615)
     java.lang.Thread.runat java.lang.Thread.runat org.owasp.dependencycheck.analyzer.CentralAnalyzer.analyzeDependency
(Thread.java:745)
 (Thread.java:745)
    [WARNING] An error occurred while analyzing '/home/jenkins/.m2/repository/org/springframework/spring-aop/4.1.9.RELEASE/spring-aop-4.1.9.RELEASE.jar'
(Central Analyzer).

 (CentralAnalyzer.java:198)Caused by: java.io.IOException
    at (Thread.java:745) org.owasp.dependencycheck.analyzer.AbstractAnalyzer.analyze

 (AbstractAnalyzer.java:137) java.util.concurrent.FutureTask.run[WARNING] An error occurred
while analyzing '/home/jenkins/.m2/repository/org/springframework/spring-context-support/4.1.9.RELEASE/spring-context-support-4.1.9.RELEASE.jar'
(Central Analyzer).

    at (FutureTask.java:262) org.owasp.dependencycheck.analyzer.CentralAnalyzer.analyzeDependency
    at (CentralAnalyzer.java:198) java.util.concurrent.ThreadPoolExecutor.runWorker
    at org.owasp.dependencycheck.analyzer.AbstractAnalyzer.analyze
         (AbstractAnalyzer.java:137)atat org.owasp.dependencycheck.AnalysisTask.call java.lang.Thread.run:
at (Thread.java:745) java.util.concurrent.ThreadPoolExecutor$Worker.run
Could not connect to MavenCentral (400): Bad Request
 (AnalysisTask.java:88)    
at     org.owasp.dependencycheck.data.central.CentralSearch.searchSha1
    at (ThreadPoolExecutor.java:1145) org.owasp.dependencycheck.AnalysisTask.call
     (CentralSearch.java:181) (AnalysisTask.java:88)at
    atat org.owasp.dependencycheck.AnalysisTask.call org.owasp.dependencycheck.analyzer.CentralAnalyzer.fetchMavenArtifacts[WARNING]
An error occurred while analyzing '/home/jenkins/.m2/repository/org/hamcrest/hamcrest-core/1.3/hamcrest-core-1.3.jar'
(Central Analyzer).
 (CentralAnalyzer.java:266) (ThreadPoolExecutor.java:615)
    at java.lang.Thread.run
     (AnalysisTask.java:37)at (Thread.java:745) org.owasp.dependencycheck.analyzer.CentralAnalyzer.analyzeDependency

     (CentralAnalyzer.java:198)[WARNING] An error occurred while analyzing '/home/jenkins/.m2/repository/org/springframework/spring-beans/4.1.9.RELEASE/spring-beans-4.1.9.RELEASE.jar'
(Central Analyzer).
 java.util.concurrent.ThreadPoolExecutor$Worker.run
 (ThreadPoolExecutor.java:615)    
at     org.owasp.dependencycheck.analyzer.AbstractAnalyzer.analyzeatat java.lang.Thread.run
org.owasp.dependencycheck.AnalysisTask.call
     (AnalysisTask.java:37) (Thread.java:745)at
 (AbstractAnalyzer.java:137)[WARNING] An error occurred while analyzing '/home/jenkins/.m2/repository/sslext/sslext/1.2-0/sslext-1.2-0.jar'
(Central Analyzer).

     java.util.concurrent.FutureTask.runat org.owasp.dependencycheck.AnalysisTask.call
     (FutureTask.java:262) (AnalysisTask.java:88)at
     java.util.concurrent.FutureTask.runat org.owasp.dependencycheck.AnalysisTask.call
     (FutureTask.java:262) (AnalysisTask.java:37)at
     java.util.concurrent.ThreadPoolExecutor.runWorkerat java.util.concurrent.FutureTask.run
     (ThreadPoolExecutor.java:1145) (FutureTask.java:262)
    
    atat java.util.concurrent.ThreadPoolExecutor.runWorker java.util.concurrent.ThreadPoolExecutor.runWorkerat
(ThreadPoolExecutor.java:1145)
    at (ThreadPoolExecutor.java:1145) java.util.concurrent.ThreadPoolExecutor$Worker.run
     java.util.concurrent.ThreadPoolExecutor$Worker.runat java.util.concurrent.ThreadPoolExecutor$Worker.run
(ThreadPoolExecutor.java:615)
     (ThreadPoolExecutor.java:615) (ThreadPoolExecutor.java:615)
    
    atat java.lang.Thread.run java.lang.Thread.runat java.lang.Thread.run (Thread.java:745)
(Thread.java:745)
 (Thread.java:745)[WARNING] An error occurred while analyzing '/home/jenkins/.m2/repository/org/yaml/snakeyaml/1.6/snakeyaml-1.6.jar'
(Central Analyzer).


[WARNING] An error occurred while analyzing '/home/jenkins/.m2/repository/org/springframework/spring-web/4.1.9.RELEASE/spring-web-4.1.9.RELEASE.jar'
(Central Analyzer).
[WARNING] An error occurred while analyzing '/home/jenkins/.m2/repository/org/springframework/spring-aspects/4.1.9.RELEASE/spring-aspects-4.1.9.RELEASE.jar'
(Central Analyzer).
[INFO] Finished Central Analyzer (32 seconds)
[INFO] Finished Dependency Merging Analyzer (0 seconds)
[INFO] Finished Version Filter Analyzer (0 seconds)
[INFO] Finished Hint Analyzer (0 seconds)
[INFO] Created CPE Index (1 seconds)
[INFO] Finished CPE Analyzer (1 seconds)
[INFO] Finished False Positive Analyzer (0 seconds)
[INFO] Finished Cpe Suppression Analyzer (0 seconds)
[INFO] Finished NVD CVE Analyzer (0 seconds)
[INFO] Finished Vulnerability Suppression Analyzer (0 seconds)
[INFO] Finished Dependency Bundling Analyzer (0 seconds)
[INFO] Analysis Complete (36 seconds)
[WARNING] 

One or more dependencies were identified with known vulnerabilities in Struts 2 Core:

struts-annotations-1.0.6.jar (org.apache.struts:struts-annotations:1.0.6, cpe:/a:apache:struts:1.0.6)
: CVE-2006-1548, CVE-2006-1547, CVE-2006-1546
struts-core-1.3.8.jar (org.apache.struts:struts-core:1.3.8, cpe:/a:apache:struts:1.3.8) :
CVE-2016-1182, CVE-2016-1181, CVE-2015-0899, CVE-2014-0114
struts-tiles-1.3.8.jar (cpe:/a:apache:tiles:1.3.8, cpe:/a:apache:struts:1.3.8, org.apache.struts:struts-tiles:1.3.8)
: CVE-2016-1182, CVE-2016-1181, CVE-2015-0899, CVE-2014-0114
bsh-2.0b4.jar (cpe:/a:beanshell_project:beanshell:2.0.b4, org.beanshell:bsh:2.0b4) : CVE-2016-2510
spring-core-4.1.9.RELEASE.jar (cpe:/a:springsource:spring_framework:4.1.9, cpe:/a:pivotal:spring_framework:4.1.9,
cpe:/a:vmware:springsource_spring_framework:4.1.9, cpe:/a:pivotal_software:spring_framework:4.1.9,
org.springframework:spring-core:4.1.9.RELEASE) : CVE-2016-5007


See the dependency-check report for more details.


[INFO] ------------------------------------------------------------------------
[INFO] Reactor Summary:
[INFO] 
[INFO] Struts 2 Bill of Materials ......................... SUCCESS [  1.248 s]
[INFO] Struts 2 ........................................... SUCCESS [ 16.781 s]
[INFO] Struts 2 Core ...................................... FAILURE [02:09 min]
[INFO] Struts Plugins ..................................... SKIPPED
[INFO] Struts 2 Configuration Browser Plugin .............. SKIPPED
[INFO] Struts 2 Sitemesh Plugin ........................... SKIPPED
[INFO] Struts 2 Tiles Plugin .............................. SKIPPED
[INFO] Struts 2 DWR Plugin ................................ SKIPPED
[INFO] Struts 2 Spring Plugin ............................. SKIPPED
[INFO] Struts 2 Convention Plugin ......................... SKIPPED
[INFO] Struts 2 JUnit Plugin .............................. SKIPPED
[INFO] Struts 2 JSON Plugin ............................... SKIPPED
[INFO] Struts 2 Bean Validation Plugin .................... SKIPPED
[INFO] Struts 2 Webapps ................................... SKIPPED
[INFO] Struts 2 Showcase Webapp ........................... SKIPPED
[INFO] Struts 2 REST Plugin ............................... SKIPPED
[INFO] Struts 2 Rest Showcase Webapp ...................... SKIPPED
[INFO] Struts 2 CDI Plugin ................................ SKIPPED
[INFO] Struts 2 Embedded JSP Plugin ....................... SKIPPED
[INFO] Struts 2 GXP Plugin ................................ SKIPPED
[INFO] Struts 2 Jasper Reports Plugin ..................... SKIPPED
[INFO] Struts 2 Java Templates Plugin ..................... SKIPPED
[INFO] Struts 2 JFreeChart Plugin ......................... SKIPPED
[INFO] Struts 2 OSGi Plugin ............................... SKIPPED
[INFO] Struts 2 OVal Plugin ............................... SKIPPED
[INFO] Struts 2 Pell Multipart Plugin ..................... SKIPPED
[INFO] Struts 2 Plexus Plugin ............................. SKIPPED
[INFO] Struts 2 Portlet Plugin ............................ SKIPPED
[INFO] Struts 2 Portlet Tiles Plugin ...................... SKIPPED
[INFO] DEPRECATED: Struts 2 Sitegraph Plugin .............. SKIPPED
[INFO] Struts 2 TestNG Plugin ............................. SKIPPED
[INFO] Struts OSGi Bundles ................................ SKIPPED
[INFO] Struts 2 OSGi Admin Bundle ......................... SKIPPED
[INFO] Struts 2 OSGi Demo Bundle .......................... SKIPPED
[INFO] Struts 2 Assembly .................................. SKIPPED
[INFO] ------------------------------------------------------------------------
[INFO] BUILD FAILURE
[INFO] ------------------------------------------------------------------------
[INFO] Total time: 02:29 min
[INFO] Finished at: 2017-11-26T22:30:41Z
[INFO] Final Memory: 110M/4268M
[INFO] ------------------------------------------------------------------------
[ERROR] Failed to execute goal org.owasp:dependency-check-maven:3.0.1:check (default) on project
struts2-core: One or more exceptions occurred during dependency-check analysis: One or more
exceptions occurred during dependency-check analysis
[ERROR] 	Could not connect to Central search. Analysis failed.
[ERROR] 	Could not connect to Central search. Analysis failed.
[ERROR] 	Could not connect to Central search. Analysis failed.
[ERROR] 	Could not connect to Central search. Analysis failed.
[ERROR] 	Could not connect to Central search. Analysis failed.
[ERROR] 	Could not connect to Central search. Analysis failed.
[ERROR] 	Could not connect to Central search. Analysis failed.
[ERROR] 	Could not connect to Central search. Analysis failed.
[ERROR] 	Could not connect to Central search. Analysis failed.
[ERROR] 	Could not connect to Central search. Analysis failed.
[ERROR] 	Could not connect to Central search. Analysis failed.
[ERROR] 	Could not connect to Central search. Analysis failed.
[ERROR] 	Could not connect to Central search. Analysis failed.
[ERROR] 	Could not connect to Central search. Analysis failed.
[ERROR] 	Could not connect to Central search. Analysis failed.
[ERROR] 	Could not connect to Central search. Analysis failed.
[ERROR] 	Could not connect to Central search. Analysis failed.
[ERROR] 	Could not connect to Central search. Analysis failed.
[ERROR] 	Could not connect to Central search. Analysis failed.
[ERROR] 	Could not connect to Central search. Analysis failed.
[ERROR] 	Could not connect to Central search. Analysis failed.
[ERROR] 	Could not connect to Central search. Analysis failed.
[ERROR] 	Could not connect to Central search. Analysis failed.
[ERROR] 	Could not connect to Central search. Analysis failed.
[ERROR] 	Could not connect to Central search. Analysis failed.
[ERROR] 	Could not connect to Central search. Analysis failed.
[ERROR] 	Could not connect to Central search. Analysis failed.
[ERROR] 	Could not connect to Central search. Analysis failed.
[ERROR] 	Could not connect to Central search. Analysis failed.
[ERROR] 	Could not connect to Central search. Analysis failed.
[ERROR] 	Could not connect to Central search. Analysis failed.
[ERROR] 	Could not connect to Central search. Analysis failed.
[ERROR] 	Could not connect to Central search. Analysis failed.
[ERROR] 	Could not connect to Central search. Analysis failed.
[ERROR] 	Could not connect to Central search. Analysis failed.
[ERROR] 	Could not connect to Central search. Analysis failed.
[ERROR] 	Could not connect to Central search. Analysis failed.
[ERROR] 	Could not connect to Central search. Analysis failed.
[ERROR] 	Could not connect to Central search. Analysis failed.
[ERROR] 	Could not connect to Central search. Analysis failed.
[ERROR] 	Could not connect to Central search. Analysis failed.
[ERROR] 	Could not connect to Central search. Analysis failed.
[ERROR] -> [Help 1]
[ERROR] 
[ERROR] To see the full stack trace of the errors, re-run Maven with the -e switch.
[ERROR] Re-run Maven using the -X switch to enable full debug logging.
[ERROR] 
[ERROR] For more information about the errors and possible solutions, please read the following
articles:
[ERROR] [Help 1] http://cwiki.apache.org/confluence/display/MAVEN/MojoExecutionException
[ERROR] 
[ERROR] After correcting the problems, you can resume the build with the command
[ERROR]   mvn <goals> -rf :struts2-core
Build step 'Execute shell' marked build as failure
[locks-and-latches] Releasing all the locks
[locks-and-latches] All the locks released
Setting MAVEN_3_LATEST__HOME=/home/jenkins/tools/maven/latest3/

---------------------------------------------------------------------
To unsubscribe, e-mail: dev-unsubscribe@struts.apache.org
For additional commands, e-mail: dev-help@struts.apache.org


Mime
View raw message