struts-dev mailing list archives

Site index · List index
Message view « Date » · « Thread »
Top « Date » · « Thread »
From Apache Jenkins Server <jenk...@builds.apache.org>
Subject Build failed in Jenkins: Struts-master-JDK7-dependency-check #11
Date Sun, 12 Nov 2017 22:30:52 GMT
See <https://builds.apache.org/job/Struts-master-JDK7-dependency-check/11/display/redirect?page=changes>

Changes:

[Lukasz Lenart] Adds schema to have a proper URL

[Lukasz Lenart] Adds proper url to Sonar host

[stefaan.dutry] WW-4713 Added deprecation warnings as preparation to drop

------------------------------------------
[...truncated 1.19 MB...]
	at java.util.concurrent.FutureTask.run(FutureTask.java:262)
	at java.util.concurrent.ThreadPoolExecutor.runWorker(ThreadPoolExecutor.java:1145)
	at java.util.concurrent.ThreadPoolExecutor$Worker.run(ThreadPoolExecutor.java:615)
	at java.lang.Thread.run(Thread.java:745)
Caused by: java.io.IOException: Could not connect to MavenCentral (400): Bad Request
	at org.owasp.dependencycheck.data.central.CentralSearch.searchSha1(CentralSearch.java:181)
	at org.owasp.dependencycheck.analyzer.CentralAnalyzer.fetchMavenArtifacts(CentralAnalyzer.java:266)
	... 8 more
[WARNING] An error occurred while analyzing '/home/jenkins/.m2/repository/org/springframework/spring-core/4.1.9.RELEASE/spring-core-4.1.9.RELEASE.jar'
(Central Analyzer).
[ERROR] Could not connect to Central search. Analysis failed.
java.io.IOException: Finally failed connecting to Central search. Giving up after 5 tries.
	at org.owasp.dependencycheck.analyzer.CentralAnalyzer.fetchMavenArtifacts(CentralAnalyzer.java:288)
	at org.owasp.dependencycheck.analyzer.CentralAnalyzer.analyzeDependency(CentralAnalyzer.java:198)
	at org.owasp.dependencycheck.analyzer.AbstractAnalyzer.analyze(AbstractAnalyzer.java:137)
	at org.owasp.dependencycheck.AnalysisTask.call(AnalysisTask.java:88)
	at org.owasp.dependencycheck.AnalysisTask.call(AnalysisTask.java:37)
	at java.util.concurrent.FutureTask.run(FutureTask.java:262)
	at java.util.concurrent.ThreadPoolExecutor.runWorker(ThreadPoolExecutor.java:1145)
	at java.util.concurrent.ThreadPoolExecutor$Worker.run(ThreadPoolExecutor.java:615)
	at java.lang.Thread.run(Thread.java:745)
Caused by: java.io.IOException: Could not connect to MavenCentral (400): Bad Request
	at org.owasp.dependencycheck.data.central.CentralSearch.searchSha1(CentralSearch.java:181)
	at org.owasp.dependencycheck.analyzer.CentralAnalyzer.fetchMavenArtifacts(CentralAnalyzer.java:266)
	... 8 more
[ERROR] Could not connect to Central search. Analysis failed.
java.io.IOException: Finally failed connecting to Central search. Giving up after 5 tries.
	at org.owasp.dependencycheck.analyzer.CentralAnalyzer.fetchMavenArtifacts(CentralAnalyzer.java:288)
	at org.owasp.dependencycheck.analyzer.CentralAnalyzer.analyzeDependency(CentralAnalyzer.java:198)
	at org.owasp.dependencycheck.analyzer.AbstractAnalyzer.analyze(AbstractAnalyzer.java:137)
	at org.owasp.dependencycheck.AnalysisTask.call(AnalysisTask.java:88)
	at org.owasp.dependencycheck.AnalysisTask.call(AnalysisTask.java:37)
	at java.util.concurrent.FutureTask.run(FutureTask.java:262)
	at java.util.concurrent.ThreadPoolExecutor.runWorker(ThreadPoolExecutor.java:1145)
	at java.util.concurrent.ThreadPoolExecutor$Worker.run(ThreadPoolExecutor.java:615)
	at java.lang.Thread.run(Thread.java:745)
Caused by: java.io.IOException: Could not connect to MavenCentral (400): Bad Request
	at org.owasp.dependencycheck.data.central.CentralSearch.searchSha1(CentralSearch.java:181)
	at org.owasp.dependencycheck.analyzer.CentralAnalyzer.fetchMavenArtifacts(CentralAnalyzer.java:266)
	... 8 more
[WARNING] An error occurred while analyzing '/home/jenkins/.m2/repository/org/springframework/spring-expression/4.1.9.RELEASE/spring-expression-4.1.9.RELEASE.jar'
(Central Analyzer).
[WARNING] An error occurred while analyzing '/home/jenkins/.m2/repository/org/springframework/spring-aop/4.1.9.RELEASE/spring-aop-4.1.9.RELEASE.jar'
(Central Analyzer).
[ERROR] Could not connect to Central search. Analysis failed.
java.io.IOException: Finally failed connecting to Central search. Giving up after 5 tries.
	at org.owasp.dependencycheck.analyzer.CentralAnalyzer.fetchMavenArtifacts(CentralAnalyzer.java:288)
	at org.owasp.dependencycheck.analyzer.CentralAnalyzer.analyzeDependency(CentralAnalyzer.java:198)
	at org.owasp.dependencycheck.analyzer.AbstractAnalyzer.analyze(AbstractAnalyzer.java:137)
	at org.owasp.dependencycheck.AnalysisTask.call(AnalysisTask.java:88)
	at org.owasp.dependencycheck.AnalysisTask.call(AnalysisTask.java:37)
	at java.util.concurrent.FutureTask.run(FutureTask.java:262)
	at java.util.concurrent.ThreadPoolExecutor.runWorker(ThreadPoolExecutor.java:1145)
	at java.util.concurrent.ThreadPoolExecutor$Worker.run(ThreadPoolExecutor.java:615)
	at java.lang.Thread.run(Thread.java:745)
Caused by: java.io.IOException: Could not connect to MavenCentral (400): Bad Request
	at org.owasp.dependencycheck.data.central.CentralSearch.searchSha1(CentralSearch.java:181)
	at org.owasp.dependencycheck.analyzer.CentralAnalyzer.fetchMavenArtifacts(CentralAnalyzer.java:266)
	... 8 more
[WARNING] An error occurred while analyzing '/home/jenkins/.m2/repository/org/hamcrest/hamcrest-core/1.3/hamcrest-core-1.3.jar'
(Central Analyzer).
[ERROR] Could not connect to Central search. Analysis failed.
java.io.IOException: Finally failed connecting to Central search. Giving up after 5 tries.
	at org.owasp.dependencycheck.analyzer.CentralAnalyzer.fetchMavenArtifacts(CentralAnalyzer.java:288)
	at org.owasp.dependencycheck.analyzer.CentralAnalyzer.analyzeDependency(CentralAnalyzer.java:198)
	at org.owasp.dependencycheck.analyzer.AbstractAnalyzer.analyze(AbstractAnalyzer.java:137)
	at org.owasp.dependencycheck.AnalysisTask.call(AnalysisTask.java:88)
	at org.owasp.dependencycheck.AnalysisTask.call(AnalysisTask.java:37)
	at java.util.concurrent.FutureTask.run(FutureTask.java:262)
	at java.util.concurrent.ThreadPoolExecutor.runWorker(ThreadPoolExecutor.java:1145)
	at java.util.concurrent.ThreadPoolExecutor$Worker.run(ThreadPoolExecutor.java:615)
	at java.lang.Thread.run(Thread.java:745)
Caused by: java.io.IOException: Could not connect to MavenCentral (400): Bad Request
	at org.owasp.dependencycheck.data.central.CentralSearch.searchSha1(CentralSearch.java:181)
	at org.owasp.dependencycheck.analyzer.CentralAnalyzer.fetchMavenArtifacts(CentralAnalyzer.java:266)
	... 8 more
[ERROR] Could not connect to Central search. Analysis failed.
java.io.IOException: Finally failed connecting to Central search. Giving up after 5 tries.
	at org.owasp.dependencycheck.analyzer.CentralAnalyzer.fetchMavenArtifacts(CentralAnalyzer.java:288)
	at org.owasp.dependencycheck.analyzer.CentralAnalyzer.analyzeDependency(CentralAnalyzer.java:198)
	at org.owasp.dependencycheck.analyzer.AbstractAnalyzer.analyze(AbstractAnalyzer.java:137)
	at org.owasp.dependencycheck.AnalysisTask.call(AnalysisTask.java:88)
	at org.owasp.dependencycheck.AnalysisTask.call(AnalysisTask.java:37)
	at java.util.concurrent.FutureTask.run(FutureTask.java:262)
	at java.util.concurrent.ThreadPoolExecutor.runWorker(ThreadPoolExecutor.java:1145)
	at java.util.concurrent.ThreadPoolExecutor$Worker.run(ThreadPoolExecutor.java:615)
	at java.lang.Thread.run(Thread.java:745)
Caused by: java.io.IOException: Could not connect to MavenCentral (400): Bad Request
	at org.owasp.dependencycheck.data.central.CentralSearch.searchSha1(CentralSearch.java:181)
	at org.owasp.dependencycheck.analyzer.CentralAnalyzer.fetchMavenArtifacts(CentralAnalyzer.java:266)
	... 8 more
[WARNING] An error occurred while analyzing '/home/jenkins/.m2/repository/org/springframework/spring-context/4.1.9.RELEASE/spring-context-4.1.9.RELEASE.jar'
(Central Analyzer).
[WARNING] An error occurred while analyzing '/home/jenkins/.m2/repository/org/springframework/spring-context-support/4.1.9.RELEASE/spring-context-support-4.1.9.RELEASE.jar'
(Central Analyzer).
[ERROR] Could not connect to Central search. Analysis failed.
java.io.IOException: Finally failed connecting to Central search. Giving up after 5 tries.
	at org.owasp.dependencycheck.analyzer.CentralAnalyzer.fetchMavenArtifacts(CentralAnalyzer.java:288)
	at org.owasp.dependencycheck.analyzer.CentralAnalyzer.analyzeDependency(CentralAnalyzer.java:198)
	at org.owasp.dependencycheck.analyzer.AbstractAnalyzer.analyze(AbstractAnalyzer.java:137)
	at org.owasp.dependencycheck.AnalysisTask.call(AnalysisTask.java:88)
	at org.owasp.dependencycheck.AnalysisTask.call(AnalysisTask.java:37)
	at java.util.concurrent.FutureTask.run(FutureTask.java:262)
	at java.util.concurrent.ThreadPoolExecutor.runWorker(ThreadPoolExecutor.java:1145)
	at java.util.concurrent.ThreadPoolExecutor$Worker.run(ThreadPoolExecutor.java:615)
	at java.lang.Thread.run(Thread.java:745)
Caused by: java.io.IOException: Could not connect to MavenCentral (400): Bad Request
	at org.owasp.dependencycheck.data.central.CentralSearch.searchSha1(CentralSearch.java:181)
	at org.owasp.dependencycheck.analyzer.CentralAnalyzer.fetchMavenArtifacts(CentralAnalyzer.java:266)
	... 8 more
[WARNING] An error occurred while analyzing '/home/jenkins/.m2/repository/org/testng/testng/5.14.10/testng-5.14.10.jar'
(Central Analyzer).
[ERROR] Could not connect to Central search. Analysis failed.
java.io.IOException: Finally failed connecting to Central search. Giving up after 5 tries.
	at org.owasp.dependencycheck.analyzer.CentralAnalyzer.fetchMavenArtifacts(CentralAnalyzer.java:288)
	at org.owasp.dependencycheck.analyzer.CentralAnalyzer.analyzeDependency(CentralAnalyzer.java:198)
	at org.owasp.dependencycheck.analyzer.AbstractAnalyzer.analyze(AbstractAnalyzer.java:137)
	at org.owasp.dependencycheck.AnalysisTask.call(AnalysisTask.java:88)
	at org.owasp.dependencycheck.AnalysisTask.call(AnalysisTask.java:37)
	at java.util.concurrent.FutureTask.run(FutureTask.java:262)
	at java.util.concurrent.ThreadPoolExecutor.runWorker(ThreadPoolExecutor.java:1145)
	at java.util.concurrent.ThreadPoolExecutor$Worker.run(ThreadPoolExecutor.java:615)
	at java.lang.Thread.run(Thread.java:745)
Caused by: java.io.IOException: Could not connect to MavenCentral (400): Bad Request
	at org.owasp.dependencycheck.data.central.CentralSearch.searchSha1(CentralSearch.java:181)
	at org.owasp.dependencycheck.analyzer.CentralAnalyzer.fetchMavenArtifacts(CentralAnalyzer.java:266)
	... 8 more
[WARNING] An error occurred while analyzing '/home/jenkins/.m2/repository/org/beanshell/bsh/2.0b4/bsh-2.0b4.jar'
(Central Analyzer).
[INFO] Finished Central Analyzer (33 seconds)
[INFO] Finished Dependency Merging Analyzer (0 seconds)
[INFO] Finished Version Filter Analyzer (0 seconds)
[INFO] Finished Hint Analyzer (0 seconds)
[INFO] Created CPE Index (1 seconds)
[INFO] Finished CPE Analyzer (2 seconds)
[INFO] Finished False Positive Analyzer (0 seconds)
[INFO] Finished Cpe Suppression Analyzer (0 seconds)
[INFO] Finished NVD CVE Analyzer (0 seconds)
[INFO] Finished Vulnerability Suppression Analyzer (0 seconds)
[INFO] Finished Dependency Bundling Analyzer (0 seconds)
[INFO] Analysis Complete (37 seconds)
[WARNING] 

One or more dependencies were identified with known vulnerabilities in Struts 2 Core:

struts-annotations-1.0.6.jar (org.apache.struts:struts-annotations:1.0.6, cpe:/a:apache:struts:1.0.6)
: CVE-2006-1548, CVE-2006-1547, CVE-2006-1546
struts-core-1.3.8.jar (org.apache.struts:struts-core:1.3.8, cpe:/a:apache:struts:1.3.8) :
CVE-2016-1182, CVE-2016-1181, CVE-2015-0899, CVE-2014-0114
struts-tiles-1.3.8.jar (cpe:/a:apache:tiles:1.3.8, cpe:/a:apache:struts:1.3.8, org.apache.struts:struts-tiles:1.3.8)
: CVE-2016-1182, CVE-2016-1181, CVE-2015-0899, CVE-2014-0114
bsh-2.0b4.jar (cpe:/a:beanshell_project:beanshell:2.0.b4, org.beanshell:bsh:2.0b4) : CVE-2016-2510
spring-core-4.1.9.RELEASE.jar (cpe:/a:springsource:spring_framework:4.1.9, cpe:/a:pivotal:spring_framework:4.1.9,
cpe:/a:vmware:springsource_spring_framework:4.1.9, cpe:/a:pivotal_software:spring_framework:4.1.9,
org.springframework:spring-core:4.1.9.RELEASE) : CVE-2016-5007


See the dependency-check report for more details.


[INFO] ------------------------------------------------------------------------
[INFO] Reactor Summary:
[INFO] 
[INFO] Struts 2 Bill of Materials ......................... SUCCESS [  1.151 s]
[INFO] Struts 2 ........................................... SUCCESS [ 22.317 s]
[INFO] Struts 2 Core ...................................... FAILURE [02:11 min]
[INFO] Struts Plugins ..................................... SKIPPED
[INFO] Struts 2 Configuration Browser Plugin .............. SKIPPED
[INFO] Struts 2 Sitemesh Plugin ........................... SKIPPED
[INFO] Struts 2 Tiles Plugin .............................. SKIPPED
[INFO] Struts 2 DWR Plugin ................................ SKIPPED
[INFO] Struts 2 Spring Plugin ............................. SKIPPED
[INFO] Struts 2 Convention Plugin ......................... SKIPPED
[INFO] Struts 2 JUnit Plugin .............................. SKIPPED
[INFO] Struts 2 JSON Plugin ............................... SKIPPED
[INFO] Struts 2 Bean Validation Plugin .................... SKIPPED
[INFO] Struts 2 Webapps ................................... SKIPPED
[INFO] Struts 2 Showcase Webapp ........................... SKIPPED
[INFO] Struts 2 REST Plugin ............................... SKIPPED
[INFO] Struts 2 Rest Showcase Webapp ...................... SKIPPED
[INFO] Struts 2 CDI Plugin ................................ SKIPPED
[INFO] Struts 2 Embedded JSP Plugin ....................... SKIPPED
[INFO] Struts 2 GXP Plugin ................................ SKIPPED
[INFO] Struts 2 Jasper Reports Plugin ..................... SKIPPED
[INFO] Struts 2 Java Templates Plugin ..................... SKIPPED
[INFO] Struts 2 JFreeChart Plugin ......................... SKIPPED
[INFO] Struts 2 OSGi Plugin ............................... SKIPPED
[INFO] Struts 2 OVal Plugin ............................... SKIPPED
[INFO] Struts 2 Pell Multipart Plugin ..................... SKIPPED
[INFO] Struts 2 Plexus Plugin ............................. SKIPPED
[INFO] Struts 2 Portlet Plugin ............................ SKIPPED
[INFO] Struts 2 Portlet Tiles Plugin ...................... SKIPPED
[INFO] DEPRECATED: Struts 2 Sitegraph Plugin .............. SKIPPED
[INFO] Struts 2 TestNG Plugin ............................. SKIPPED
[INFO] Struts OSGi Bundles ................................ SKIPPED
[INFO] Struts 2 OSGi Admin Bundle ......................... SKIPPED
[INFO] Struts 2 OSGi Demo Bundle .......................... SKIPPED
[INFO] Struts 2 Assembly .................................. SKIPPED
[INFO] ------------------------------------------------------------------------
[INFO] BUILD FAILURE
[INFO] ------------------------------------------------------------------------
[INFO] Total time: 02:36 min
[INFO] Finished at: 2017-11-12T22:30:51Z
[INFO] Final Memory: 103M/7160M
[INFO] ------------------------------------------------------------------------
[ERROR] Failed to execute goal org.owasp:dependency-check-maven:3.0.1:check (default) on project
struts2-core: One or more exceptions occurred during dependency-check analysis: One or more
exceptions occurred during dependency-check analysis
[ERROR] 	Could not connect to Central search. Analysis failed.
[ERROR] 	Could not connect to Central search. Analysis failed.
[ERROR] 	Could not connect to Central search. Analysis failed.
[ERROR] 	Could not connect to Central search. Analysis failed.
[ERROR] 	Could not connect to Central search. Analysis failed.
[ERROR] 	Could not connect to Central search. Analysis failed.
[ERROR] 	Could not connect to Central search. Analysis failed.
[ERROR] 	Could not connect to Central search. Analysis failed.
[ERROR] 	Could not connect to Central search. Analysis failed.
[ERROR] 	Could not connect to Central search. Analysis failed.
[ERROR] 	Could not connect to Central search. Analysis failed.
[ERROR] 	Could not connect to Central search. Analysis failed.
[ERROR] 	Could not connect to Central search. Analysis failed.
[ERROR] 	Could not connect to Central search. Analysis failed.
[ERROR] 	Could not connect to Central search. Analysis failed.
[ERROR] 	Could not connect to Central search. Analysis failed.
[ERROR] 	Could not connect to Central search. Analysis failed.
[ERROR] 	Could not connect to Central search. Analysis failed.
[ERROR] 	Could not connect to Central search. Analysis failed.
[ERROR] 	Could not connect to Central search. Analysis failed.
[ERROR] 	Could not connect to Central search. Analysis failed.
[ERROR] 	Could not connect to Central search. Analysis failed.
[ERROR] 	Could not connect to Central search. Analysis failed.
[ERROR] 	Could not connect to Central search. Analysis failed.
[ERROR] 	Could not connect to Central search. Analysis failed.
[ERROR] 	Could not connect to Central search. Analysis failed.
[ERROR] 	Could not connect to Central search. Analysis failed.
[ERROR] 	Could not connect to Central search. Analysis failed.
[ERROR] 	Could not connect to Central search. Analysis failed.
[ERROR] 	Could not connect to Central search. Analysis failed.
[ERROR] 	Could not connect to Central search. Analysis failed.
[ERROR] 	Could not connect to Central search. Analysis failed.
[ERROR] 	Could not connect to Central search. Analysis failed.
[ERROR] 	Could not connect to Central search. Analysis failed.
[ERROR] 	Could not connect to Central search. Analysis failed.
[ERROR] 	Could not connect to Central search. Analysis failed.
[ERROR] 	Could not connect to Central search. Analysis failed.
[ERROR] 	Could not connect to Central search. Analysis failed.
[ERROR] 	Could not connect to Central search. Analysis failed.
[ERROR] 	Could not connect to Central search. Analysis failed.
[ERROR] 	Could not connect to Central search. Analysis failed.
[ERROR] 	Could not connect to Central search. Analysis failed.
[ERROR] -> [Help 1]
[ERROR] 
[ERROR] To see the full stack trace of the errors, re-run Maven with the -e switch.
[ERROR] Re-run Maven using the -X switch to enable full debug logging.
[ERROR] 
[ERROR] For more information about the errors and possible solutions, please read the following
articles:
[ERROR] [Help 1] http://cwiki.apache.org/confluence/display/MAVEN/MojoExecutionException
[ERROR] 
[ERROR] After correcting the problems, you can resume the build with the command
[ERROR]   mvn <goals> -rf :struts2-core
Build step 'Execute shell' marked build as failure
[locks-and-latches] Releasing all the locks
[locks-and-latches] All the locks released
Setting MAVEN_3_LATEST__HOME=/home/jenkins/tools/maven/latest3/

---------------------------------------------------------------------
To unsubscribe, e-mail: dev-unsubscribe@struts.apache.org
For additional commands, e-mail: dev-help@struts.apache.org


Mime
View raw message