struts-dev mailing list archives

Site index · List index
Message view « Date » · « Thread »
Top « Date » · « Thread »
From Apache Jenkins Server <jenk...@builds.apache.org>
Subject Build failed in Jenkins: Struts-master-JDK7 #37
Date Sun, 22 Oct 2017 07:30:31 GMT
See <https://builds.apache.org/job/Struts-master-JDK7/37/display/redirect?page=changes>

Changes:

[Lukasz Lenart] Adds missing header with license or updates the existing one

[Lukasz Lenart] Adds missing header with license or updates the existing one

[Lukasz Lenart] Adds missing header with license

[Lukasz Lenart] Adds missing header with license

[Lukasz Lenart] Adds missing header with license

[Lukasz Lenart] Adds missing header with license

[Lukasz Lenart] Adds missing header with license

[Lukasz Lenart] Adds missing header with license

[Lukasz Lenart] Enables Rat plugin on each build

[Lukasz Lenart] Adds missing header with license

[Lukasz Lenart] Adds missing header with license

[Lukasz Lenart] Adds missing header with license and fixes tests

[Lukasz Lenart] Adds missing header with license and fixes tests

[Lukasz Lenart] Uses property instead of hardcoding path

[Lukasz Lenart] Fixes encoding

[Lukasz Lenart] Fixes encoding

[Lukasz Lenart] Puts back JavaDoc reference

[Lukasz Lenart] Removes unneeded header

[Lukasz Lenart] Fixes encoding

[Lukasz Lenart] Fixes encoding

[Lukasz Lenart] Converts content to a proper CSS

------------------------------------------
[...truncated 3.12 MB...]
Generating <https://builds.apache.org/job/Struts-master-JDK7/ws/apps/showcase/target/apidocs/org/apache/struts2/showcase/xslt/class-use/JVMAction.ImportantInfo.html...>
Generating <https://builds.apache.org/job/Struts-master-JDK7/ws/apps/showcase/target/apidocs/org/apache/struts2/showcase/chat/class-use/ChatService.html...>
Generating <https://builds.apache.org/job/Struts-master-JDK7/ws/apps/showcase/target/apidocs/org/apache/struts2/showcase/chat/class-use/CrudRoomAction.html...>
Generating <https://builds.apache.org/job/Struts-master-JDK7/ws/apps/showcase/target/apidocs/org/apache/struts2/showcase/chat/class-use/DateConverter.html...>
Generating <https://builds.apache.org/job/Struts-master-JDK7/ws/apps/showcase/target/apidocs/org/apache/struts2/showcase/chat/class-use/ChatMessage.html...>
Generating <https://builds.apache.org/job/Struts-master-JDK7/ws/apps/showcase/target/apidocs/org/apache/struts2/showcase/chat/class-use/Constants.html...>
Generating <https://builds.apache.org/job/Struts-master-JDK7/ws/apps/showcase/target/apidocs/org/apache/struts2/showcase/chat/class-use/ChatServiceImpl.html...>
Generating <https://builds.apache.org/job/Struts-master-JDK7/ws/apps/showcase/target/apidocs/org/apache/struts2/showcase/chat/class-use/ChatSessionListener.html...>
Generating <https://builds.apache.org/job/Struts-master-JDK7/ws/apps/showcase/target/apidocs/org/apache/struts2/showcase/chat/class-use/ChatInterceptor.html...>
Generating <https://builds.apache.org/job/Struts-master-JDK7/ws/apps/showcase/target/apidocs/org/apache/struts2/showcase/chat/class-use/User.html...>
Generating <https://builds.apache.org/job/Struts-master-JDK7/ws/apps/showcase/target/apidocs/org/apache/struts2/showcase/chat/class-use/ChatException.html...>
Generating <https://builds.apache.org/job/Struts-master-JDK7/ws/apps/showcase/target/apidocs/org/apache/struts2/showcase/chat/class-use/ChatException.ErrorType.html...>
Generating <https://builds.apache.org/job/Struts-master-JDK7/ws/apps/showcase/target/apidocs/org/apache/struts2/showcase/chat/class-use/ChatAuthenticationInterceptor.html...>
Generating <https://builds.apache.org/job/Struts-master-JDK7/ws/apps/showcase/target/apidocs/org/apache/struts2/showcase/chat/class-use/UsersAvailableAction.html...>
Generating <https://builds.apache.org/job/Struts-master-JDK7/ws/apps/showcase/target/apidocs/org/apache/struts2/showcase/chat/class-use/Room.html...>
Generating <https://builds.apache.org/job/Struts-master-JDK7/ws/apps/showcase/target/apidocs/org/apache/struts2/showcase/chat/class-use/SendMessageToRoomAction.html...>
Generating <https://builds.apache.org/job/Struts-master-JDK7/ws/apps/showcase/target/apidocs/org/apache/struts2/showcase/chat/class-use/ChatLoginAction.html...>
Generating <https://builds.apache.org/job/Struts-master-JDK7/ws/apps/showcase/target/apidocs/org/apache/struts2/showcase/chat/class-use/UsersAvailableInRoomAction.html...>
Generating <https://builds.apache.org/job/Struts-master-JDK7/ws/apps/showcase/target/apidocs/org/apache/struts2/showcase/chat/class-use/ExitRoomAction.html...>
Generating <https://builds.apache.org/job/Struts-master-JDK7/ws/apps/showcase/target/apidocs/org/apache/struts2/showcase/chat/class-use/ChatLogoutAction.html...>
Generating <https://builds.apache.org/job/Struts-master-JDK7/ws/apps/showcase/target/apidocs/org/apache/struts2/showcase/chat/class-use/EnterRoomAction.html...>
Generating <https://builds.apache.org/job/Struts-master-JDK7/ws/apps/showcase/target/apidocs/org/apache/struts2/showcase/chat/class-use/RoomsAvailableAction.html...>
Generating <https://builds.apache.org/job/Struts-master-JDK7/ws/apps/showcase/target/apidocs/org/apache/struts2/showcase/chat/class-use/MessagesAvailableInRoomAction.html...>
Generating <https://builds.apache.org/job/Struts-master-JDK7/ws/apps/showcase/target/apidocs/org/apache/struts2/showcase/exception/class-use/StorageException.html...>
Generating <https://builds.apache.org/job/Struts-master-JDK7/ws/apps/showcase/target/apidocs/org/apache/struts2/showcase/exception/class-use/UpdateException.html...>
Generating <https://builds.apache.org/job/Struts-master-JDK7/ws/apps/showcase/target/apidocs/org/apache/struts2/showcase/exception/class-use/DeleteException.html...>
Generating <https://builds.apache.org/job/Struts-master-JDK7/ws/apps/showcase/target/apidocs/org/apache/struts2/showcase/exception/class-use/DuplicateKeyException.html...>
Generating <https://builds.apache.org/job/Struts-master-JDK7/ws/apps/showcase/target/apidocs/org/apache/struts2/showcase/exception/class-use/CreateException.html...>
Generating <https://builds.apache.org/job/Struts-master-JDK7/ws/apps/showcase/target/apidocs/org/apache/struts2/showcase/model/class-use/Skill.html...>
Generating <https://builds.apache.org/job/Struts-master-JDK7/ws/apps/showcase/target/apidocs/org/apache/struts2/showcase/model/class-use/IdEntity.html...>
Generating <https://builds.apache.org/job/Struts-master-JDK7/ws/apps/showcase/target/apidocs/org/apache/struts2/showcase/model/class-use/Employee.html...>
Generating <https://builds.apache.org/job/Struts-master-JDK7/ws/apps/showcase/target/apidocs/org/apache/struts2/showcase/tag/nonui/iteratortag/class-use/IteratorGeneratorTagDemo.html...>
Generating <https://builds.apache.org/job/Struts-master-JDK7/ws/apps/showcase/target/apidocs/org/apache/struts2/showcase/tag/nonui/iteratortag/class-use/AppendIteratorTagDemo.html...>
Generating <https://builds.apache.org/job/Struts-master-JDK7/ws/apps/showcase/target/apidocs/org/apache/struts2/showcase/tag/nonui/iteratortag/class-use/SubsetIteratorTagDemo.html...>
Generating <https://builds.apache.org/job/Struts-master-JDK7/ws/apps/showcase/target/apidocs/org/apache/struts2/showcase/tag/nonui/iteratortag/class-use/MergeIteratorTagDemo.html...>
Generating <https://builds.apache.org/job/Struts-master-JDK7/ws/apps/showcase/target/apidocs/org/apache/struts2/showcase/tag/nonui/actiontag/class-use/ActionTagDemo.html...>
Generating <https://builds.apache.org/job/Struts-master-JDK7/ws/apps/showcase/target/apidocs/org/apache/struts2/showcase/tag/nonui/actionPrefix/class-use/SubmitAction.html...>
Generating <https://builds.apache.org/job/Struts-master-JDK7/ws/apps/showcase/target/apidocs/org/apache/struts2/showcase/person/class-use/NewPersonAction.html...>
Generating <https://builds.apache.org/job/Struts-master-JDK7/ws/apps/showcase/target/apidocs/org/apache/struts2/showcase/person/class-use/ListPeopleAction.html...>
Generating <https://builds.apache.org/job/Struts-master-JDK7/ws/apps/showcase/target/apidocs/org/apache/struts2/showcase/person/class-use/EditPersonAction.html...>
Generating <https://builds.apache.org/job/Struts-master-JDK7/ws/apps/showcase/target/apidocs/org/apache/struts2/showcase/person/class-use/PersonManager.html...>
Generating <https://builds.apache.org/job/Struts-master-JDK7/ws/apps/showcase/target/apidocs/org/apache/struts2/showcase/person/class-use/Person.html...>
Generating <https://builds.apache.org/job/Struts-master-JDK7/ws/apps/showcase/target/apidocs/org/apache/struts2/showcase/fileupload/class-use/FileUploadAction.html...>
Generating <https://builds.apache.org/job/Struts-master-JDK7/ws/apps/showcase/target/apidocs/org/apache/struts2/showcase/fileupload/class-use/MultipleFileUploadUsingArrayAction.html...>
Generating <https://builds.apache.org/job/Struts-master-JDK7/ws/apps/showcase/target/apidocs/org/apache/struts2/showcase/fileupload/class-use/MultipleFileUploadUsingListAction.html...>
Generating <https://builds.apache.org/job/Struts-master-JDK7/ws/apps/showcase/target/apidocs/org/apache/struts2/showcase/filedownload/class-use/FileDownloadAction.html...>
Generating <https://builds.apache.org/job/Struts-master-JDK7/ws/apps/showcase/target/apidocs/org/apache/struts2/showcase/tiles/class-use/TilesAnnotationsAction.html...>
Generating <https://builds.apache.org/job/Struts-master-JDK7/ws/apps/showcase/target/apidocs/org/apache/struts2/showcase/token/class-use/TokenAction.html...>
Generating <https://builds.apache.org/job/Struts-master-JDK7/ws/apps/showcase/target/apidocs/org/apache/struts2/showcase/modelDriven/class-use/ModelDrivenAction.html...>
Generating <https://builds.apache.org/job/Struts-master-JDK7/ws/apps/showcase/target/apidocs/org/apache/struts2/showcase/modelDriven/class-use/Gangster.html...>
Generating <https://builds.apache.org/job/Struts-master-JDK7/ws/apps/showcase/target/apidocs/org/apache/struts2/showcase/source/class-use/ViewSourceAction.html...>
Generating <https://builds.apache.org/job/Struts-master-JDK7/ws/apps/showcase/target/apidocs/org/apache/struts2/showcase/ajax/tree/class-use/GetCategory.html...>
Generating <https://builds.apache.org/job/Struts-master-JDK7/ws/apps/showcase/target/apidocs/org/apache/struts2/showcase/ajax/tree/class-use/Category.html...>
Generating <https://builds.apache.org/job/Struts-master-JDK7/ws/apps/showcase/target/apidocs/org/apache/struts2/showcase/ajax/tree/class-use/Toggle.html...>
Generating <https://builds.apache.org/job/Struts-master-JDK7/ws/apps/showcase/target/apidocs/org/apache/struts2/showcase/ajax/class-use/Example4ShowPanelAction.html...>
Generating <https://builds.apache.org/job/Struts-master-JDK7/ws/apps/showcase/target/apidocs/org/apache/struts2/showcase/ajax/class-use/AutocompleterExampleAction.html...>
Generating <https://builds.apache.org/job/Struts-master-JDK7/ws/apps/showcase/target/apidocs/org/apache/struts2/showcase/ajax/class-use/AjaxTestAction.html...>
Generating <https://builds.apache.org/job/Struts-master-JDK7/ws/apps/showcase/target/apidocs/org/apache/struts2/showcase/ajax/class-use/Example5Action.html...>
Generating <https://builds.apache.org/job/Struts-master-JDK7/ws/apps/showcase/target/apidocs/org/apache/struts2/showcase/action/class-use/SkillAction.html...>
Generating <https://builds.apache.org/job/Struts-master-JDK7/ws/apps/showcase/target/apidocs/org/apache/struts2/showcase/action/class-use/ExampleAction.html...>
Generating <https://builds.apache.org/job/Struts-master-JDK7/ws/apps/showcase/target/apidocs/org/apache/struts2/showcase/action/class-use/EmployeeAction.html...>
Generating <https://builds.apache.org/job/Struts-master-JDK7/ws/apps/showcase/target/apidocs/org/apache/struts2/showcase/action/class-use/JSPEvalAction.html...>
Generating <https://builds.apache.org/job/Struts-master-JDK7/ws/apps/showcase/target/apidocs/org/apache/struts2/showcase/action/class-use/AbstractCRUDAction.html...>
Generating <https://builds.apache.org/job/Struts-master-JDK7/ws/apps/showcase/target/apidocs/org/apache/struts2/showcase/package-use.html...>
Generating <https://builds.apache.org/job/Struts-master-JDK7/ws/apps/showcase/target/apidocs/org/apache/struts2/showcase/action/package-use.html...>
Generating <https://builds.apache.org/job/Struts-master-JDK7/ws/apps/showcase/target/apidocs/org/apache/struts2/showcase/actionchaining/package-use.html...>
Generating <https://builds.apache.org/job/Struts-master-JDK7/ws/apps/showcase/target/apidocs/org/apache/struts2/showcase/ajax/package-use.html...>
Generating <https://builds.apache.org/job/Struts-master-JDK7/ws/apps/showcase/target/apidocs/org/apache/struts2/showcase/ajax/tree/package-use.html...>
Generating <https://builds.apache.org/job/Struts-master-JDK7/ws/apps/showcase/target/apidocs/org/apache/struts2/showcase/application/package-use.html...>
Generating <https://builds.apache.org/job/Struts-master-JDK7/ws/apps/showcase/target/apidocs/org/apache/struts2/showcase/chat/package-use.html...>
Generating <https://builds.apache.org/job/Struts-master-JDK7/ws/apps/showcase/target/apidocs/org/apache/struts2/showcase/conversion/package-use.html...>
Generating <https://builds.apache.org/job/Struts-master-JDK7/ws/apps/showcase/target/apidocs/org/apache/struts2/showcase/dao/package-use.html...>
Generating <https://builds.apache.org/job/Struts-master-JDK7/ws/apps/showcase/target/apidocs/org/apache/struts2/showcase/exception/package-use.html...>
Generating <https://builds.apache.org/job/Struts-master-JDK7/ws/apps/showcase/target/apidocs/org/apache/struts2/showcase/filedownload/package-use.html...>
Generating <https://builds.apache.org/job/Struts-master-JDK7/ws/apps/showcase/target/apidocs/org/apache/struts2/showcase/fileupload/package-use.html...>
Generating <https://builds.apache.org/job/Struts-master-JDK7/ws/apps/showcase/target/apidocs/org/apache/struts2/showcase/freemarker/package-use.html...>
Generating <https://builds.apache.org/job/Struts-master-JDK7/ws/apps/showcase/target/apidocs/org/apache/struts2/showcase/hangman/package-use.html...>
Generating <https://builds.apache.org/job/Struts-master-JDK7/ws/apps/showcase/target/apidocs/org/apache/struts2/showcase/model/package-use.html...>
Generating <https://builds.apache.org/job/Struts-master-JDK7/ws/apps/showcase/target/apidocs/org/apache/struts2/showcase/modelDriven/package-use.html...>
Generating <https://builds.apache.org/job/Struts-master-JDK7/ws/apps/showcase/target/apidocs/org/apache/struts2/showcase/person/package-use.html...>
Generating <https://builds.apache.org/job/Struts-master-JDK7/ws/apps/showcase/target/apidocs/org/apache/struts2/showcase/source/package-use.html...>
Generating <https://builds.apache.org/job/Struts-master-JDK7/ws/apps/showcase/target/apidocs/org/apache/struts2/showcase/tag/nonui/actionPrefix/package-use.html...>
Generating <https://builds.apache.org/job/Struts-master-JDK7/ws/apps/showcase/target/apidocs/org/apache/struts2/showcase/tag/nonui/actiontag/package-use.html...>
Generating <https://builds.apache.org/job/Struts-master-JDK7/ws/apps/showcase/target/apidocs/org/apache/struts2/showcase/tag/nonui/iteratortag/package-use.html...>
Generating <https://builds.apache.org/job/Struts-master-JDK7/ws/apps/showcase/target/apidocs/org/apache/struts2/showcase/tiles/package-use.html...>
Generating <https://builds.apache.org/job/Struts-master-JDK7/ws/apps/showcase/target/apidocs/org/apache/struts2/showcase/token/package-use.html...>
Generating <https://builds.apache.org/job/Struts-master-JDK7/ws/apps/showcase/target/apidocs/org/apache/struts2/showcase/validation/package-use.html...>
Generating <https://builds.apache.org/job/Struts-master-JDK7/ws/apps/showcase/target/apidocs/org/apache/struts2/showcase/wait/package-use.html...>
Generating <https://builds.apache.org/job/Struts-master-JDK7/ws/apps/showcase/target/apidocs/org/apache/struts2/showcase/xslt/package-use.html...>
Building index for all the packages and classes...
Generating <https://builds.apache.org/job/Struts-master-JDK7/ws/apps/showcase/target/apidocs/overview-tree.html...>
Generating <https://builds.apache.org/job/Struts-master-JDK7/ws/apps/showcase/target/apidocs/index-all.html...>
Generating <https://builds.apache.org/job/Struts-master-JDK7/ws/apps/showcase/target/apidocs/deprecated-list.html...>
Building index for all classes...
Generating <https://builds.apache.org/job/Struts-master-JDK7/ws/apps/showcase/target/apidocs/allclasses-frame.html...>
Generating <https://builds.apache.org/job/Struts-master-JDK7/ws/apps/showcase/target/apidocs/allclasses-noframe.html...>
Generating <https://builds.apache.org/job/Struts-master-JDK7/ws/apps/showcase/target/apidocs/index.html...>
Generating <https://builds.apache.org/job/Struts-master-JDK7/ws/apps/showcase/target/apidocs/overview-summary.html...>
Generating <https://builds.apache.org/job/Struts-master-JDK7/ws/apps/showcase/target/apidocs/help-doc.html...>
[INFO] Building jar: <https://builds.apache.org/job/Struts-master-JDK7/ws/apps/showcase/target/struts2-showcase-javadoc.jar>
[INFO] 
[INFO] --- maven-antrun-plugin:1.8:run (copy-sources) @ struts2-showcase ---
[WARNING] Parameter tasks is deprecated, use target instead
[INFO] Executing tasks

main:
     [copy] Copying 112 files to <https://builds.apache.org/job/Struts-master-JDK7/ws/apps/showcase/target/struts2-showcase/WEB-INF/src/java>
     [copy] Copying 59 files to <https://builds.apache.org/job/Struts-master-JDK7/ws/apps/showcase/target/struts2-showcase/WEB-INF/src/java>
[INFO] Executed tasks
[INFO] 
[INFO] --- maven-remote-resources-plugin:1.5:process (process-resource-bundles) @ struts2-showcase
---
[INFO] 
[INFO] --- maven-resources-plugin:2.7:resources (default-resources) @ struts2-showcase ---
[INFO] Using 'UTF-8' encoding to copy filtered resources.
[INFO] Copying 59 resources
[INFO] Copying 112 resources
[INFO] Copying 3 resources
[INFO] 
[INFO] --- maven-compiler-plugin:3.5.1:compile (default-compile) @ struts2-showcase ---
[INFO] Changes detected - recompiling the module!
[INFO] Compiling 112 source files to <https://builds.apache.org/job/Struts-master-JDK7/ws/apps/showcase/target/classes>
[INFO] <https://builds.apache.org/job/Struts-master-JDK7/ws/apps/showcase/src/main/java/org/apache/struts2/showcase/application/TestDataProvider.java>:
Some input files use or override a deprecated API.
[INFO] <https://builds.apache.org/job/Struts-master-JDK7/ws/apps/showcase/src/main/java/org/apache/struts2/showcase/application/TestDataProvider.java>:
Recompile with -Xlint:deprecation for details.
[INFO] <https://builds.apache.org/job/Struts-master-JDK7/ws/apps/showcase/src/main/java/org/apache/struts2/showcase/chat/ChatLoginAction.java>:
Some input files use unchecked or unsafe operations.
[INFO] <https://builds.apache.org/job/Struts-master-JDK7/ws/apps/showcase/src/main/java/org/apache/struts2/showcase/chat/ChatLoginAction.java>:
Recompile with -Xlint:unchecked for details.
[INFO] 
[INFO] --- maven-bundle-plugin:2.1.0:manifest (bundle-manifest) @ struts2-showcase ---
[WARNING] Ignoring project type war - supportedProjectTypes = [jar, bundle]
[INFO] 
[INFO] --- maven-resources-plugin:2.7:testResources (default-testResources) @ struts2-showcase
---
[INFO] Using 'UTF-8' encoding to copy filtered resources.
[INFO] skip non existing resourceDirectory <https://builds.apache.org/job/Struts-master-JDK7/ws/apps/showcase/src/test/resources>
[INFO] Copying 3 resources
[INFO] 
[INFO] --- maven-compiler-plugin:3.5.1:testCompile (default-testCompile) @ struts2-showcase
---
[INFO] Changes detected - recompiling the module!
[INFO] Compiling 14 source files to <https://builds.apache.org/job/Struts-master-JDK7/ws/apps/showcase/target/test-classes>
[INFO] <https://builds.apache.org/job/Struts-master-JDK7/ws/apps/showcase/src/test/java/org/apache/struts2/showcase/filedownload/FileDownloadActionTest.java>:
<https://builds.apache.org/job/Struts-master-JDK7/ws/apps/showcase/src/test/java/org/apache/struts2/showcase/filedownload/FileDownloadActionTest.java>
uses or overrides a deprecated API.
[INFO] <https://builds.apache.org/job/Struts-master-JDK7/ws/apps/showcase/src/test/java/org/apache/struts2/showcase/filedownload/FileDownloadActionTest.java>:
Recompile with -Xlint:deprecation for details.
[INFO] 
[INFO] --- maven-surefire-plugin:2.20.1:test (default-test) @ struts2-showcase ---
[INFO] 
[INFO] -------------------------------------------------------
[INFO]  T E S T S
[INFO] -------------------------------------------------------
[INFO] Running org.apache.struts2.showcase.filedownload.FileDownloadActionTest
[INFO] Tests run: 5, Failures: 0, Errors: 0, Skipped: 0, Time elapsed: 0.101 s - in org.apache.struts2.showcase.filedownload.FileDownloadActionTest
[INFO] 
[INFO] Results:
[INFO] 
[INFO] Tests run: 5, Failures: 0, Errors: 0, Skipped: 0
[INFO] 
[INFO] 
[INFO] --- maven-war-plugin:2.1:war (default-war) @ struts2-showcase ---
[INFO] Packaging webapp
[INFO] Assembling webapp [struts2-showcase] in [<https://builds.apache.org/job/Struts-master-JDK7/ws/apps/showcase/target/struts2-showcase]>
[INFO] Processing war project
[INFO] Copying webapp webResources [<https://builds.apache.org/job/Struts-master-JDK7/ws/apps/showcase/src/main/resources]>
to [<https://builds.apache.org/job/Struts-master-JDK7/ws/apps/showcase/target/struts2-showcase]>
[INFO] Copying webapp resources [<https://builds.apache.org/job/Struts-master-JDK7/ws/apps/showcase/src/main/webapp]>
[INFO] Webapp assembled in [308 msecs]
[INFO] Building war: <https://builds.apache.org/job/Struts-master-JDK7/ws/apps/showcase/target/struts2-showcase.war>
[INFO] WEB-INF/web.xml already added, skipping
[INFO] 
[INFO] >>> maven-source-plugin:3.0.0:jar (attach-sources) > generate-sources @
struts2-showcase >>>
[INFO] 
[INFO] <<< maven-source-plugin:3.0.0:jar (attach-sources) < generate-sources @
struts2-showcase <<<
[INFO] 
[INFO] 
[INFO] --- maven-source-plugin:3.0.0:jar (attach-sources) @ struts2-showcase ---
[INFO] Building jar: <https://builds.apache.org/job/Struts-master-JDK7/ws/apps/showcase/target/struts2-showcase-sources.jar>
[INFO] 
[INFO] --- maven-site-plugin:3.5.1:attach-descriptor (attach-descriptor) @ struts2-showcase
---
[INFO] 
[INFO] --- apache-rat-plugin:0.11:check (default) @ struts2-showcase ---
[INFO] 51 implicit excludes (use -debug for more details).
[INFO] Exclude: src/main/resources/org/apache/struts2/static/domTT.js
[INFO] Exclude: src/site/resources/tags/**/*.html
[INFO] Exclude: src/main/resources/*LICENSE.txt
[INFO] Exclude: src/test/resources/**/*.txt
[INFO] Exclude: src/main/webapp/**/*.css
[INFO] Exclude: src/main/webapp/**/*.map
[INFO] Exclude: src/main/webapp/**/*.js
[INFO] Exclude: src/main/webapp/**/*.svg
[INFO] Exclude: src/main/webapp/**/*.txt
[INFO] Exclude: src/main/resources/**/sitegraph-usage.txt
[INFO] Exclude: src/main/resources/static/css/**/*.css
[INFO] Exclude: src/main/resources/static/js/**/*.js
[INFO] Exclude: src/main/resources/docs.cfg
[INFO] 370 resources included (use -debug for more details)
[INFO] Rat check: Summary of files. Unapproved: 1 unknown: 1 generated: 0 approved: 307 licence.
[INFO] ------------------------------------------------------------------------
[INFO] Reactor Summary:
[INFO] 
[INFO] Struts 2 Bill of Materials ......................... SUCCESS [  7.402 s]
[INFO] Struts 2 ........................................... SUCCESS [ 11.705 s]
[INFO] Struts 2 Core ...................................... SUCCESS [03:12 min]
[INFO] Struts Plugins ..................................... SUCCESS [  9.602 s]
[INFO] Struts 2 Configuration Browser Plugin .............. SUCCESS [ 18.931 s]
[INFO] Struts 2 Sitemesh Plugin ........................... SUCCESS [ 18.830 s]
[INFO] Struts 2 Tiles Plugin .............................. SUCCESS [ 20.073 s]
[INFO] Struts 2 DWR Plugin ................................ SUCCESS [ 17.441 s]
[INFO] Struts 2 Spring Plugin ............................. SUCCESS [ 19.977 s]
[INFO] Struts 2 Convention Plugin ......................... SUCCESS [ 24.289 s]
[INFO] Struts 2 JUnit Plugin .............................. SUCCESS [ 23.892 s]
[INFO] Struts 2 JSON Plugin ............................... SUCCESS [ 26.622 s]
[INFO] Struts 2 Bean Validation Plugin .................... SUCCESS [ 21.281 s]
[INFO] Struts 2 Webapps ................................... SUCCESS [  6.015 s]
[INFO] Struts 2 Showcase Webapp ........................... FAILURE [ 10.870 s]
[INFO] Struts 2 REST Plugin ............................... SKIPPED
[INFO] Struts 2 Rest Showcase Webapp ...................... SKIPPED
[INFO] Struts 2 CDI Plugin ................................ SKIPPED
[INFO] Struts 2 Embedded JSP Plugin ....................... SKIPPED
[INFO] Struts 2 GXP Plugin ................................ SKIPPED
[INFO] Struts 2 Jasper Reports Plugin ..................... SKIPPED
[INFO] Struts 2 Java Templates Plugin ..................... SKIPPED
[INFO] Struts 2 JFreeChart Plugin ......................... SKIPPED
[INFO] Struts 2 OSGi Plugin ............................... SKIPPED
[INFO] Struts 2 OVal Plugin ............................... SKIPPED
[INFO] Struts 2 Pell Multipart Plugin ..................... SKIPPED
[INFO] Struts 2 Plexus Plugin ............................. SKIPPED
[INFO] Struts 2 Portlet Plugin ............................ SKIPPED
[INFO] Struts 2 Portlet Tiles Plugin ...................... SKIPPED
[INFO] DEPRECATED: Struts 2 Sitegraph Plugin .............. SKIPPED
[INFO] Struts 2 TestNG Plugin ............................. SKIPPED
[INFO] Struts OSGi Bundles ................................ SKIPPED
[INFO] Struts 2 OSGi Admin Bundle ......................... SKIPPED
[INFO] Struts 2 OSGi Demo Bundle .......................... SKIPPED
[INFO] Struts 2 Assembly .................................. SKIPPED
[INFO] ------------------------------------------------------------------------
[INFO] BUILD FAILURE
[INFO] ------------------------------------------------------------------------
[INFO] Total time: 07:11 min
[INFO] Finished at: 2017-10-22T07:30:30Z
[INFO] Final Memory: 92M/2741M
[INFO] ------------------------------------------------------------------------
[ERROR] Failed to execute goal org.apache.rat:apache-rat-plugin:0.11:check (default) on project
struts2-showcase: Too many files with unapproved license: 1 See RAT report in: <https://builds.apache.org/job/Struts-master-JDK7/ws/apps/showcase/target/rat.txt>
-> [Help 1]
[ERROR] 
[ERROR] To see the full stack trace of the errors, re-run Maven with the -e switch.
[ERROR] Re-run Maven using the -X switch to enable full debug logging.
[ERROR] 
[ERROR] For more information about the errors and possible solutions, please read the following
articles:
[ERROR] [Help 1] http://cwiki.apache.org/confluence/display/MAVEN/MojoFailureException
[ERROR] 
[ERROR] After correcting the problems, you can resume the build with the command
[ERROR]   mvn <goals> -rf :struts2-showcase
Build step 'Execute shell' marked build as failure
[locks-and-latches] Releasing all the locks
[locks-and-latches] All the locks released
Setting MAVEN_3_LATEST__HOME=/home/jenkins/tools/maven/latest3/

---------------------------------------------------------------------
To unsubscribe, e-mail: dev-unsubscribe@struts.apache.org
For additional commands, e-mail: dev-help@struts.apache.org


Mime
View raw message